{"text_format":"1","workbook":"xlsx","n_sheets":7,"sheets":["Header Info","QSO Form","QSO DB","Cabrillo","Feature Notes","Cabrillo instructions","ZipDB"],"not_rendered":{"charts":0,"images":1,"macros":1,"external_links":0,"defined_names":60,"comments":0,"pivot_tables":0},"unopened":[],"bounds":{"document_bytes":16777216,"sheet_cells":100000,"rows_first":2000,"rows_last":500,"rows_between":2000,"halvings":0,"cell_chars":16384,"cell_head_chars":4096},"cells_cut":0,"cells_raw":0,"read":"whole","date_system":"1900"}

{"sheet":"Header Info","index":0,"n_rows":30,"n_cols":7,"rows_kept":30,"cut":false,"hidden":false,"merged":[]}
[]
[]
[]
[]
[]
[null,null,null,null,"TAG","ENTER DATA IN ALL CAPS"]
[null,null,null,null,"CONTEST: ","2026 DU3MY MEMORIAL CONTEST","Contest Title"]
[null,null,null,null,"CREATED-BY:","Microsoft Excel 2013","Program/App name and version"]
[null,null,null,null,"CALLSIGN:","DW1WWW","Callsign"]
[null,null,null,null,"CALL NATIONALITY:","LOCAL","Local or International (DX) Call"]
[null,null,null,null,"CURRENT PHIL. DISTRICT:","SAME","Choose 1-9 if not within default district or DX call, else select \"SAME\""]
[null,null,null,null,"CONTEST CALL:",{"$f":"F9&IF(F11=\"SAME\",\"\",\"/\"&IF(F10=\"LOCAL\",F11,\"DU\"&F11))","v":"DW1WWW"},"Derived Call with extension. If DX call, ext will be preceded with \"DU\""]
[null,null,null,null,"CATEGORY-OPERATOR:","SINGLE-OP FIXED","Single-Op, Multi-Op or Checklog"]
[null,null,null,null,"CATEGORY-MODE:","ALL","ALL only"]
[null,null,null,null,"CATEGORY-BAND:","2m","6m, 2m, 70cm, 40m or All band"]
[null,null,null,null,"CATEGORY-POWER:","HIGH","Low (50W or less) or High (more than 50W)"]
[null,null,null,null,"OPERATORS:",null,"REQUIRED  for Cat-Op=MULTI-OP, CALL/name separated by comma"]
[null,null,null,null,"NAME:","JUAN A. DELA CRUZ","Complete name of participant"]
[null,null,null,null,"ADDRESS-STREET:","MABINI ST.","Actual TX QTH. Max=75 characters"]
[null,null,null,null,"ADDRESS-BARANGAY:","SAMPALOC","Actual TX QTH. Max=75 characters"]
[null,null,null,null,"ADDRESS-CITY/TOWN:","MANILA","Actual TX QTH. Max=75 characters"]
[null,null,null,null,"ADDRESS-STATE-PROVINCE:","MM","Actual TX QTH. Max=75 characters"]
[null,null,null,null,"ADDRESS-COUNTRY:","PHILIPPINES","Actual TX QTH. Max=75 characters"]
[null,null,null,null,"ZIP CODE:",1015,"Philippine Zip code. \"0000\" if foreign contact\"."]
[null,null,null,null,"EMAIL:","DW1WWW@GMAIL.COM","email address"]
[null,null,null,null,"CLAIMED-SCORE:",null,"self-computed score (OPTIONAL)"]
[null,null,null,null,"CLUB:","DX1ABC","Club affiliation (Enter \"NONE\" if no club)"]
[null,null,null,null,"GPS COORDINATES:","14.602803, 120.996586","Required for Long Haul award candidates only."]
[]
[null,null,null,null,null,null,"To find GPS using Google Maps (Android) or Apple Maps (iOS):\n1- Open app allowing use of location, either once or while using the app.\n2- Zoom in (enlarge view) to conveniently press and hold the desired location.\n3- In Google Maps, GPS will be displayed at the top of screen.\nIn Apple Maps, tap the pin notification to display the GPS coordinates."]

{"sheet":"QSO Form","index":1,"n_rows":218,"n_cols":35,"rows_kept":218,"cut":false,"hidden":true,"merged":[[2,2,2,11],[5,4,5,5],[1,7,1,8]]}
[null,null,null,null,null,null,null,null,null,null,null,null,null,null,null,null,null,null,"Freq_Band Table",null,null,"Band_Mode Table",null,null,null,null,"Live_Date_Time"]
[null,null,"Must update HEADER info first.",null,null,"Data entry is N1MM style",null,"Post-contest data entry/edit",null,"      Generate Cabrillo file",null,null,null,null,null,null,null,null,"FREQ","BAND",null,"_6m","_2m","_70cm","_40m",null,"UTC_Date","UTC_Time"]
[null,null,{"$f":"'Header Info'!F7","v":"2026 DU3MY MEMORIAL CONTEST"},null,null,null,null,null,null,null,null,null,null,null,null,null,null,null,7,"_40m",null,"CW","CW","CW","CW",null,"2026-06-01",{"$f":"IF(HOUR(NOW()-TIME(8,0,0))<10,\"0\",\"\")&HOUR(NOW()-TIME(8,0,0))&IF(MINUTE(NOW()-TIME(8,0,0))<10,\"0\",\"\")&MINUTE(NOW()-TIME(8,0,0))","v":"0530"},null,"Display_PST",null,"Hide_PST"]
[null,null,"LIVE-CONTEST-LOGGER (Live logging during actual contest day)",null,null,null,null,null,null,null,null,null,null,null,null,null,null,null,50,"_6m",null,"SSB","SSB","SSB","SSB",null,null,null,null,"PST Date:",{"$f":"NOW()","v":"2026-08-11T13:30:02.630"}]
[null,null,null,null,null,null,null,null,null,null,null,null,null,null,null,null,null,null,144,"_2m",null,"cw","FM","FM","FM",null,"SearchCALL2Box",null,null,"PST Time:",{"$f":"NOW()","v":46245.562530439813}]
[null,null,null,null,"UTC Date/TIME here are based on computer clock",null,null,null,null,null,null,null,null,null,null,null,null,null,432,"_70cm",null,"ssb","cw","cw","cw"]
[null,null,null,null,null,null,null,null,null,null,null,null,null,null,null,null,null,null,null,null,null,null,"ssb","ssb","ssb"]
[null,null,"FREQ ","MODE","UTC_Date","UTC_Time","SntCALL","Snt","SntNR","RcvCALL","Rcv","RcvNR",null,null,null,null,null,null,"Band","Call2&Band&Mode",null,null,"fm","fm","fm",null,"UTC Date","UTC_Time",null,null,null,null,null,null,"This tab has N1MM equivalent, single QSO data entry mechanics. "]
[null,null,144,"FM",{"$f":"NOW()","v":"2026-08-11T13:30:02.630"},{"$f":"IF(HOUR(NOW()-TIME(8,0,0))<10,\"0\",\"\")&HOUR(NOW()-TIME(8,0,0))&IF(MINUTE(NOW()-TIME(8,0,0))<10,\"0\",\"\")&MINUTE(NOW()-TIME(8,0,0))","v":"0530"},{"$f":"'Header Info'!F12","v":"DW1WWW"},{"$f":"IF(UPPER(D9)=\"CW\",\"599\",\"59\")","v":"59"},{"$f":"IF(COUNTA(FREQ_DB)<100,\"00\",IF(COUNTA(FREQ_DB)<10,\"0\",\"\"))&COUNTA(FREQ_DB)+1","v":"001"},null,{"$f":"IF(UPPER(D9)=\"CW\",\"599\",\"59\")","v":"59"},null,null,null,null,null,null,null,{"$f":"IF(C9=1240,\"23cm\",IF(C9=432,\"70cm\",IF(C9=50,\"6m\",\"2m\")))","v":"2m"},{"$f":"J9&S9&UPPER(D9)","v":"2mFM"},null,null,null,null,null,null,"2026-06-01","0000",null,null,null,null,null,null,"Restricted to 4 input fields only: FREQ, MODE, RcvCALL and RcvNR"]
[null,null,{"$f":"IF(C9=\"\",\"blank FREQ\",\"\")","v":""},{"$f":"IF(D9=\"\",\"blank MODE\",\"\")","v":""},null,null,null,{"$f":"IF(_xlfn.IFNA(VLOOKUP($T$9,QSO_DB,8,0),\"\")=\"\",\"\",\"Dupe with QSO# \"&_xlfn.IFNA(VLOOKUP($T$9,QSO_DB,8,0),\"\"))","v":""},null,{"$f":"IF(J9=\"\",\"blank RcvCALL\",\"\")","v":"blank RcvCALL"},null,{"$f":"IF(L9=\"\",\"blank RcvNR\",\"\")","v":"blank RcvNR"},null,null,null,null,null,"<-- error_messages ",null,null,{"$f":"IF(blank_FREQ&blank_MODE&Dupe_message&blank_CALL2&blank_Exch2=\"\",1,0)","v":0},"error_messages_blank tag [0=not blank, 1=blank]",null,null,null,null,null,null,null,null,null,null,null,null,"UTC Date and Time are based on computer clock. SntCALL is from [Header Info]."]
["error_formula",null,{"$f":"IF(C10=\"\",\"blank FREQ\",\"\")","v":"blank FREQ"},{"$f":"IF(D10=\"\",\"blank MODE\",\"\")","v":"blank MODE"},null,null,null,{"$f":"IF(_xlfn.IFNA(VLOOKUP($T$9,QSO_DB,8,0),\"\")=\"\",\"\",\"Dupe with QSO# \"&_xlfn.IFNA(VLOOKUP($T$9,QSO_DB,8,0),\"\"))","v":""},null,{"$f":"IF(J10=\"\",\"blank RcvCALL\",\"\")","v":""},null,{"$f":"IF(L10=\"\",\"blank RcvNR\",\"\")","v":""}]
[]
[null,null,null,null,null,null,null,"If Dupe, QSO line #",null,"  To add QSO, all gray message",null,null,null,null,null,null,null,0,"Display/Hide tag [0=hidden, 1=displayed]",null,null,null,null,null,null,null,null,null,null,null,null,null,null,null,"Snt/Rcv signal report depends on MODE"]
[null,null,null,null,null,"<- notes_tag",null,"will  be  in  this  box",null,"   boxes   must   be   error-free",null,null,null,null,null,null,null,1,"operation tag [1=Run, 2= S&P]",null,null,null,null,null,null,"PathName:","D:\\HAM\\DX3H\\DU3MY UHF-VFH MEMORIAL CONTEST\\2026\\Logs\\DW1WWW.log",null,null,null,null,null,null,null,"If the 4 input fields are complete and valid, line# 9 will be logged in the database."]
[]
[null,null,"In <Live Contest> mode, data listed below are for viewing only. Data cannot be edited here."]
[null,null,"To update actual database, click <Post Contest> button near the upper left part of this tab.",null,null,null,null,null,null,null,null,null,null,null,null,null,null,"OldShapeName",null,"OldShapeText",null,null,null,"NewShapeName"]
["QSO","Call2&Band&Mode","Freq","Mode","UTC Date","Time","SntCALL","Snt","SntNR","RcvCALL","Rcv","RcvNR",null,null,null,null,null,"Option Button S&P",null,"Display Notes"]
[{"$f":"IF('QSO DB'!$D5=\"\",\"\",'QSO DB'!A5)","v":""},{"$f":"IF('QSO DB'!$D5=\"\",\"\",'QSO DB'!B5)","v":""},{"$f":"IF('QSO DB'!$D5=\"\",\"\",'QSO DB'!D5)","v":""},{"$f":"IF('QSO DB'!$D5=\"\",\"\",'QSO DB'!E5)","v":""},{"$f":"IF('QSO DB'!$D5=\"\",\"\",'QSO DB'!I5)","v":""},{"$f":"IF('QSO DB'!$D5=\"\",\"\",'QSO DB'!J5)","v":""},{"$f":"IF('QSO DB'!$D5=\"\",\"\",'QSO DB'!K5)","v":""},{"$f":"IF('QSO DB'!$D5=\"\",\"\",'QSO DB'!L5)","v":""},{"$f":"IF('QSO DB'!$D5=\"\",\"\",'QSO DB'!M5)","v":""},{"$f":"IF('QSO DB'!$D5=\"\",\"\",'QSO DB'!F5)","v":""},{"$f":"IF('QSO DB'!$D5=\"\",\"\",'QSO DB'!G5)","v":""},{"$f":"IF('QSO DB'!$D5=\"\",\"\",'QSO DB'!H5)","v":""}]
[{"$f":"IF('QSO DB'!$D6=\"\",\"\",'QSO DB'!A6)","v":""},{"$f":"IF('QSO DB'!$D6=\"\",\"\",'QSO DB'!B6)","v":""},{"$f":"IF('QSO DB'!$D6=\"\",\"\",'QSO DB'!D6)","v":""},{"$f":"IF('QSO DB'!$D6=\"\",\"\",'QSO DB'!E6)","v":""},{"$f":"IF('QSO DB'!$D6=\"\",\"\",'QSO DB'!I6)","v":""},{"$f":"IF('QSO DB'!$D6=\"\",\"\",'QSO DB'!J6)","v":""},{"$f":"IF('QSO DB'!$D6=\"\",\"\",'QSO DB'!K6)","v":""},{"$f":"IF('QSO DB'!$D6=\"\",\"\",'QSO DB'!L6)","v":""},{"$f":"IF('QSO DB'!$D6=\"\",\"\",'QSO DB'!M6)","v":""},{"$f":"IF('QSO DB'!$D6=\"\",\"\",'QSO DB'!F6)","v":""},{"$f":"IF('QSO DB'!$D6=\"\",\"\",'QSO DB'!G6)","v":""},{"$f":"IF('QSO DB'!$D6=\"\",\"\",'QSO DB'!H6)","v":""},null,null,null,null,null,"Hide PST",null,"Hide PST"]
[{"$f":"IF('QSO DB'!$D7=\"\",\"\",'QSO DB'!A7)","v":""},{"$f":"IF('QSO DB'!$D7=\"\",\"\",'QSO DB'!B7)","v":""},{"$f":"IF('QSO DB'!$D7=\"\",\"\",'QSO DB'!D7)","v":""},{"$f":"IF('QSO DB'!$D7=\"\",\"\",'QSO DB'!E7)","v":""},{"$f":"IF('QSO DB'!$D7=\"\",\"\",'QSO DB'!I7)","v":""},{"$f":"IF('QSO DB'!$D7=\"\",\"\",'QSO DB'!J7)","v":""},{"$f":"IF('QSO DB'!$D7=\"\",\"\",'QSO DB'!K7)","v":""},{"$f":"IF('QSO DB'!$D7=\"\",\"\",'QSO DB'!L7)","v":""},{"$f":"IF('QSO DB'!$D7=\"\",\"\",'QSO DB'!M7)","v":""},{"$f":"IF('QSO DB'!$D7=\"\",\"\",'QSO DB'!F7)","v":""},{"$f":"IF('QSO DB'!$D7=\"\",\"\",'QSO DB'!G7)","v":""},{"$f":"IF('QSO DB'!$D7=\"\",\"\",'QSO DB'!H7)","v":""},null,null,null,null,null,"Edit FREQ/MODE",null,"Edit FREQ/MODE"]
[{"$f":"IF('QSO DB'!$D8=\"\",\"\",'QSO DB'!A8)","v":""},{"$f":"IF('QSO DB'!$D8=\"\",\"\",'QSO DB'!B8)","v":""},{"$f":"IF('QSO DB'!$D8=\"\",\"\",'QSO DB'!D8)","v":""},{"$f":"IF('QSO DB'!$D8=\"\",\"\",'QSO DB'!E8)","v":""},{"$f":"IF('QSO DB'!$D8=\"\",\"\",'QSO DB'!I8)","v":""},{"$f":"IF('QSO DB'!$D8=\"\",\"\",'QSO DB'!J8)","v":""},{"$f":"IF('QSO DB'!$D8=\"\",\"\",'QSO DB'!K8)","v":""},{"$f":"IF('QSO DB'!$D8=\"\",\"\",'QSO DB'!L8)","v":""},{"$f":"IF('QSO DB'!$D8=\"\",\"\",'QSO DB'!M8)","v":""},{"$f":"IF('QSO DB'!$D8=\"\",\"\",'QSO DB'!F8)","v":""},{"$f":"IF('QSO DB'!$D8=\"\",\"\",'QSO DB'!G8)","v":""},{"$f":"IF('QSO DB'!$D8=\"\",\"\",'QSO DB'!H8)","v":""},null,null,null,null,null,"Search CALL2",null,"Search CALL2\n"]
[{"$f":"IF('QSO DB'!$D9=\"\",\"\",'QSO DB'!A9)","v":""},{"$f":"IF('QSO DB'!$D9=\"\",\"\",'QSO DB'!B9)","v":""},{"$f":"IF('QSO DB'!$D9=\"\",\"\",'QSO DB'!D9)","v":""},{"$f":"IF('QSO DB'!$D9=\"\",\"\",'QSO DB'!E9)","v":""},{"$f":"IF('QSO DB'!$D9=\"\",\"\",'QSO DB'!I9)","v":""},{"$f":"IF('QSO DB'!$D9=\"\",\"\",'QSO DB'!J9)","v":""},{"$f":"IF('QSO DB'!$D9=\"\",\"\",'QSO DB'!K9)","v":""},{"$f":"IF('QSO DB'!$D9=\"\",\"\",'QSO DB'!L9)","v":""},{"$f":"IF('QSO DB'!$D9=\"\",\"\",'QSO DB'!M9)","v":""},{"$f":"IF('QSO DB'!$D9=\"\",\"\",'QSO DB'!F9)","v":""},{"$f":"IF('QSO DB'!$D9=\"\",\"\",'QSO DB'!G9)","v":""},{"$f":"IF('QSO DB'!$D9=\"\",\"\",'QSO DB'!H9)","v":""},null,null,null,null,null,"Edit CALL2/Exch2",null,"Edit CALL2/Exch2"]
[{"$f":"IF('QSO DB'!$D10=\"\",\"\",'QSO DB'!A10)","v":""},{"$f":"IF('QSO DB'!$D10=\"\",\"\",'QSO DB'!B10)","v":""},{"$f":"IF('QSO DB'!$D10=\"\",\"\",'QSO DB'!D10)","v":""},{"$f":"IF('QSO DB'!$D10=\"\",\"\",'QSO DB'!E10)","v":""},{"$f":"IF('QSO DB'!$D10=\"\",\"\",'QSO DB'!I10)","v":""},{"$f":"IF('QSO DB'!$D10=\"\",\"\",'QSO DB'!J10)","v":""},{"$f":"IF('QSO DB'!$D10=\"\",\"\",'QSO DB'!K10)","v":""},{"$f":"IF('QSO DB'!$D10=\"\",\"\",'QSO DB'!L10)","v":""},{"$f":"IF('QSO DB'!$D10=\"\",\"\",'QSO DB'!M10)","v":""},{"$f":"IF('QSO DB'!$D10=\"\",\"\",'QSO DB'!F10)","v":""},{"$f":"IF('QSO DB'!$D10=\"\",\"\",'QSO DB'!G10)","v":""},{"$f":"IF('QSO DB'!$D10=\"\",\"\",'QSO DB'!H10)","v":""},null,null,null,null,null,"Delete",null,"Delete"]
[{"$f":"IF('QSO DB'!$D11=\"\",\"\",'QSO DB'!A11)","v":""},{"$f":"IF('QSO DB'!$D11=\"\",\"\",'QSO DB'!B11)","v":""},{"$f":"IF('QSO DB'!$D11=\"\",\"\",'QSO DB'!D11)","v":""},{"$f":"IF('QSO DB'!$D11=\"\",\"\",'QSO DB'!E11)","v":""},{"$f":"IF('QSO DB'!$D11=\"\",\"\",'QSO DB'!I11)","v":""},{"$f":"IF('QSO DB'!$D11=\"\",\"\",'QSO DB'!J11)","v":""},{"$f":"IF('QSO DB'!$D11=\"\",\"\",'QSO DB'!K11)","v":""},{"$f":"IF('QSO DB'!$D11=\"\",\"\",'QSO DB'!L11)","v":""},{"$f":"IF('QSO DB'!$D11=\"\",\"\",'QSO DB'!M11)","v":""},{"$f":"IF('QSO DB'!$D11=\"\",\"\",'QSO DB'!F11)","v":""},{"$f":"IF('QSO DB'!$D11=\"\",\"\",'QSO DB'!G11)","v":""},{"$f":"IF('QSO DB'!$D11=\"\",\"\",'QSO DB'!H11)","v":""},null,null,null,null,null,"Update",null,"Update"]
[{"$f":"IF('QSO DB'!$D12=\"\",\"\",'QSO DB'!A12)","v":""},{"$f":"IF('QSO DB'!$D12=\"\",\"\",'QSO DB'!B12)","v":""},{"$f":"IF('QSO DB'!$D12=\"\",\"\",'QSO DB'!D12)","v":""},{"$f":"IF('QSO DB'!$D12=\"\",\"\",'QSO DB'!E12)","v":""},{"$f":"IF('QSO DB'!$D12=\"\",\"\",'QSO DB'!I12)","v":""},{"$f":"IF('QSO DB'!$D12=\"\",\"\",'QSO DB'!J12)","v":""},{"$f":"IF('QSO DB'!$D12=\"\",\"\",'QSO DB'!K12)","v":""},{"$f":"IF('QSO DB'!$D12=\"\",\"\",'QSO DB'!L12)","v":""},{"$f":"IF('QSO DB'!$D12=\"\",\"\",'QSO DB'!M12)","v":""},{"$f":"IF('QSO DB'!$D12=\"\",\"\",'QSO DB'!F12)","v":""},{"$f":"IF('QSO DB'!$D12=\"\",\"\",'QSO DB'!G12)","v":""},{"$f":"IF('QSO DB'!$D12=\"\",\"\",'QSO DB'!H12)","v":""},null,null,null,null,null,"AddQSO",null,"Add QSO"]
[{"$f":"IF('QSO DB'!$D13=\"\",\"\",'QSO DB'!A13)","v":""},{"$f":"IF('QSO DB'!$D13=\"\",\"\",'QSO DB'!B13)","v":""},{"$f":"IF('QSO DB'!$D13=\"\",\"\",'QSO DB'!D13)","v":""},{"$f":"IF('QSO DB'!$D13=\"\",\"\",'QSO DB'!E13)","v":""},{"$f":"IF('QSO DB'!$D13=\"\",\"\",'QSO DB'!I13)","v":""},{"$f":"IF('QSO DB'!$D13=\"\",\"\",'QSO DB'!J13)","v":""},{"$f":"IF('QSO DB'!$D13=\"\",\"\",'QSO DB'!K13)","v":""},{"$f":"IF('QSO DB'!$D13=\"\",\"\",'QSO DB'!L13)","v":""},{"$f":"IF('QSO DB'!$D13=\"\",\"\",'QSO DB'!M13)","v":""},{"$f":"IF('QSO DB'!$D13=\"\",\"\",'QSO DB'!F13)","v":""},{"$f":"IF('QSO DB'!$D13=\"\",\"\",'QSO DB'!G13)","v":""},{"$f":"IF('QSO DB'!$D13=\"\",\"\",'QSO DB'!H13)","v":""},null,null,null,null,null,"Display Notes",null,"Display Notes"]
[{"$f":"IF('QSO DB'!$D14=\"\",\"\",'QSO DB'!A14)","v":""},{"$f":"IF('QSO DB'!$D14=\"\",\"\",'QSO DB'!B14)","v":""},{"$f":"IF('QSO DB'!$D14=\"\",\"\",'QSO DB'!D14)","v":""},{"$f":"IF('QSO DB'!$D14=\"\",\"\",'QSO DB'!E14)","v":""},{"$f":"IF('QSO DB'!$D14=\"\",\"\",'QSO DB'!I14)","v":""},{"$f":"IF('QSO DB'!$D14=\"\",\"\",'QSO DB'!J14)","v":""},{"$f":"IF('QSO DB'!$D14=\"\",\"\",'QSO DB'!K14)","v":""},{"$f":"IF('QSO DB'!$D14=\"\",\"\",'QSO DB'!L14)","v":""},{"$f":"IF('QSO DB'!$D14=\"\",\"\",'QSO DB'!M14)","v":""},{"$f":"IF('QSO DB'!$D14=\"\",\"\",'QSO DB'!F14)","v":""},{"$f":"IF('QSO DB'!$D14=\"\",\"\",'QSO DB'!G14)","v":""},{"$f":"IF('QSO DB'!$D14=\"\",\"\",'QSO DB'!H14)","v":""}]
[{"$f":"IF('QSO DB'!$D15=\"\",\"\",'QSO DB'!A15)","v":""},{"$f":"IF('QSO DB'!$D15=\"\",\"\",'QSO DB'!B15)","v":""},{"$f":"IF('QSO DB'!$D15=\"\",\"\",'QSO DB'!D15)","v":""},{"$f":"IF('QSO DB'!$D15=\"\",\"\",'QSO DB'!E15)","v":""},{"$f":"IF('QSO DB'!$D15=\"\",\"\",'QSO DB'!I15)","v":""},{"$f":"IF('QSO DB'!$D15=\"\",\"\",'QSO DB'!J15)","v":""},{"$f":"IF('QSO DB'!$D15=\"\",\"\",'QSO DB'!K15)","v":""},{"$f":"IF('QSO DB'!$D15=\"\",\"\",'QSO DB'!L15)","v":""},{"$f":"IF('QSO DB'!$D15=\"\",\"\",'QSO DB'!M15)","v":""},{"$f":"IF('QSO DB'!$D15=\"\",\"\",'QSO DB'!F15)","v":""},{"$f":"IF('QSO DB'!$D15=\"\",\"\",'QSO DB'!G15)","v":""},{"$f":"IF('QSO DB'!$D15=\"\",\"\",'QSO DB'!H15)","v":""},null,null,null,null,null,"Option Button Run"]
[{"$f":"IF('QSO DB'!$D16=\"\",\"\",'QSO DB'!A16)","v":""},{"$f":"IF('QSO DB'!$D16=\"\",\"\",'QSO DB'!B16)","v":""},{"$f":"IF('QSO DB'!$D16=\"\",\"\",'QSO DB'!D16)","v":""},{"$f":"IF('QSO DB'!$D16=\"\",\"\",'QSO DB'!E16)","v":""},{"$f":"IF('QSO DB'!$D16=\"\",\"\",'QSO DB'!I16)","v":""},{"$f":"IF('QSO DB'!$D16=\"\",\"\",'QSO DB'!J16)","v":""},{"$f":"IF('QSO DB'!$D16=\"\",\"\",'QSO DB'!K16)","v":""},{"$f":"IF('QSO DB'!$D16=\"\",\"\",'QSO DB'!L16)","v":""},{"$f":"IF('QSO DB'!$D16=\"\",\"\",'QSO DB'!M16)","v":""},{"$f":"IF('QSO DB'!$D16=\"\",\"\",'QSO DB'!F16)","v":""},{"$f":"IF('QSO DB'!$D16=\"\",\"\",'QSO DB'!G16)","v":""},{"$f":"IF('QSO DB'!$D16=\"\",\"\",'QSO DB'!H16)","v":""}]
[{"$f":"IF('QSO DB'!$D17=\"\",\"\",'QSO DB'!A17)","v":""},{"$f":"IF('QSO DB'!$D17=\"\",\"\",'QSO DB'!B17)","v":""},{"$f":"IF('QSO DB'!$D17=\"\",\"\",'QSO DB'!D17)","v":""},{"$f":"IF('QSO DB'!$D17=\"\",\"\",'QSO DB'!E17)","v":""},{"$f":"IF('QSO DB'!$D17=\"\",\"\",'QSO DB'!I17)","v":""},{"$f":"IF('QSO DB'!$D17=\"\",\"\",'QSO DB'!J17)","v":""},{"$f":"IF('QSO DB'!$D17=\"\",\"\",'QSO DB'!K17)","v":""},{"$f":"IF('QSO DB'!$D17=\"\",\"\",'QSO DB'!L17)","v":""},{"$f":"IF('QSO DB'!$D17=\"\",\"\",'QSO DB'!M17)","v":""},{"$f":"IF('QSO DB'!$D17=\"\",\"\",'QSO DB'!F17)","v":""},{"$f":"IF('QSO DB'!$D17=\"\",\"\",'QSO DB'!G17)","v":""},{"$f":"IF('QSO DB'!$D17=\"\",\"\",'QSO DB'!H17)","v":""}]
[{"$f":"IF('QSO DB'!$D18=\"\",\"\",'QSO DB'!A18)","v":""},{"$f":"IF('QSO DB'!$D18=\"\",\"\",'QSO DB'!B18)","v":""},{"$f":"IF('QSO DB'!$D18=\"\",\"\",'QSO DB'!D18)","v":""},{"$f":"IF('QSO DB'!$D18=\"\",\"\",'QSO DB'!E18)","v":""},{"$f":"IF('QSO DB'!$D18=\"\",\"\",'QSO DB'!I18)","v":""},{"$f":"IF('QSO DB'!$D18=\"\",\"\",'QSO DB'!J18)","v":""},{"$f":"IF('QSO DB'!$D18=\"\",\"\",'QSO DB'!K18)","v":""},{"$f":"IF('QSO DB'!$D18=\"\",\"\",'QSO DB'!L18)","v":""},{"$f":"IF('QSO DB'!$D18=\"\",\"\",'QSO DB'!M18)","v":""},{"$f":"IF('QSO DB'!$D18=\"\",\"\",'QSO DB'!F18)","v":""},{"$f":"IF('QSO DB'!$D18=\"\",\"\",'QSO DB'!G18)","v":""},{"$f":"IF('QSO DB'!$D18=\"\",\"\",'QSO DB'!H18)","v":""}]
[{"$f":"IF('QSO DB'!$D19=\"\",\"\",'QSO DB'!A19)","v":""},{"$f":"IF('QSO DB'!$D19=\"\",\"\",'QSO DB'!B19)","v":""},{"$f":"IF('QSO DB'!$D19=\"\",\"\",'QSO DB'!D19)","v":""},{"$f":"IF('QSO DB'!$D19=\"\",\"\",'QSO DB'!E19)","v":""},{"$f":"IF('QSO DB'!$D19=\"\",\"\",'QSO DB'!I19)","v":""},{"$f":"IF('QSO DB'!$D19=\"\",\"\",'QSO DB'!J19)","v":""},{"$f":"IF('QSO DB'!$D19=\"\",\"\",'QSO DB'!K19)","v":""},{"$f":"IF('QSO DB'!$D19=\"\",\"\",'QSO DB'!L19)","v":""},{"$f":"IF('QSO DB'!$D19=\"\",\"\",'QSO DB'!M19)","v":""},{"$f":"IF('QSO DB'!$D19=\"\",\"\",'QSO DB'!F19)","v":""},{"$f":"IF('QSO DB'!$D19=\"\",\"\",'QSO DB'!G19)","v":""},{"$f":"IF('QSO DB'!$D19=\"\",\"\",'QSO DB'!H19)","v":""}]
[{"$f":"IF('QSO DB'!$D20=\"\",\"\",'QSO DB'!A20)","v":""},{"$f":"IF('QSO DB'!$D20=\"\",\"\",'QSO DB'!B20)","v":""},{"$f":"IF('QSO DB'!$D20=\"\",\"\",'QSO DB'!D20)","v":""},{"$f":"IF('QSO DB'!$D20=\"\",\"\",'QSO DB'!E20)","v":""},{"$f":"IF('QSO DB'!$D20=\"\",\"\",'QSO DB'!I20)","v":""},{"$f":"IF('QSO DB'!$D20=\"\",\"\",'QSO DB'!J20)","v":""},{"$f":"IF('QSO DB'!$D20=\"\",\"\",'QSO DB'!K20)","v":""},{"$f":"IF('QSO DB'!$D20=\"\",\"\",'QSO DB'!L20)","v":""},{"$f":"IF('QSO DB'!$D20=\"\",\"\",'QSO DB'!M20)","v":""},{"$f":"IF('QSO DB'!$D20=\"\",\"\",'QSO DB'!F20)","v":""},{"$f":"IF('QSO DB'!$D20=\"\",\"\",'QSO DB'!G20)","v":""},{"$f":"IF('QSO DB'!$D20=\"\",\"\",'QSO DB'!H20)","v":""}]
[{"$f":"IF('QSO DB'!$D21=\"\",\"\",'QSO DB'!A21)","v":""},{"$f":"IF('QSO DB'!$D21=\"\",\"\",'QSO DB'!B21)","v":""},{"$f":"IF('QSO DB'!$D21=\"\",\"\",'QSO DB'!D21)","v":""},{"$f":"IF('QSO DB'!$D21=\"\",\"\",'QSO DB'!E21)","v":""},{"$f":"IF('QSO DB'!$D21=\"\",\"\",'QSO DB'!I21)","v":""},{"$f":"IF('QSO DB'!$D21=\"\",\"\",'QSO DB'!J21)","v":""},{"$f":"IF('QSO DB'!$D21=\"\",\"\",'QSO DB'!K21)","v":""},{"$f":"IF('QSO DB'!$D21=\"\",\"\",'QSO DB'!L21)","v":""},{"$f":"IF('QSO DB'!$D21=\"\",\"\",'QSO DB'!M21)","v":""},{"$f":"IF('QSO DB'!$D21=\"\",\"\",'QSO DB'!F21)","v":""},{"$f":"IF('QSO DB'!$D21=\"\",\"\",'QSO DB'!G21)","v":""},{"$f":"IF('QSO DB'!$D21=\"\",\"\",'QSO DB'!H21)","v":""}]
[{"$f":"IF('QSO DB'!$D22=\"\",\"\",'QSO DB'!A22)","v":""},{"$f":"IF('QSO DB'!$D22=\"\",\"\",'QSO DB'!B22)","v":""},{"$f":"IF('QSO DB'!$D22=\"\",\"\",'QSO DB'!D22)","v":""},{"$f":"IF('QSO DB'!$D22=\"\",\"\",'QSO DB'!E22)","v":""},{"$f":"IF('QSO DB'!$D22=\"\",\"\",'QSO DB'!I22)","v":""},{"$f":"IF('QSO DB'!$D22=\"\",\"\",'QSO DB'!J22)","v":""},{"$f":"IF('QSO DB'!$D22=\"\",\"\",'QSO DB'!K22)","v":""},{"$f":"IF('QSO DB'!$D22=\"\",\"\",'QSO DB'!L22)","v":""},{"$f":"IF('QSO DB'!$D22=\"\",\"\",'QSO DB'!M22)","v":""},{"$f":"IF('QSO DB'!$D22=\"\",\"\",'QSO DB'!F22)","v":""},{"$f":"IF('QSO DB'!$D22=\"\",\"\",'QSO DB'!G22)","v":""},{"$f":"IF('QSO DB'!$D22=\"\",\"\",'QSO DB'!H22)","v":""}]
[{"$f":"IF('QSO DB'!$D23=\"\",\"\",'QSO DB'!A23)","v":""},{"$f":"IF('QSO DB'!$D23=\"\",\"\",'QSO DB'!B23)","v":""},{"$f":"IF('QSO DB'!$D23=\"\",\"\",'QSO DB'!D23)","v":""},{"$f":"IF('QSO DB'!$D23=\"\",\"\",'QSO DB'!E23)","v":""},{"$f":"IF('QSO DB'!$D23=\"\",\"\",'QSO DB'!I23)","v":""},{"$f":"IF('QSO DB'!$D23=\"\",\"\",'QSO DB'!J23)","v":""},{"$f":"IF('QSO DB'!$D23=\"\",\"\",'QSO DB'!K23)","v":""},{"$f":"IF('QSO DB'!$D23=\"\",\"\",'QSO DB'!L23)","v":""},{"$f":"IF('QSO DB'!$D23=\"\",\"\",'QSO DB'!M23)","v":""},{"$f":"IF('QSO DB'!$D23=\"\",\"\",'QSO DB'!F23)","v":""},{"$f":"IF('QSO DB'!$D23=\"\",\"\",'QSO DB'!G23)","v":""},{"$f":"IF('QSO DB'!$D23=\"\",\"\",'QSO DB'!H23)","v":""}]
[{"$f":"IF('QSO DB'!$D24=\"\",\"\",'QSO DB'!A24)","v":""},{"$f":"IF('QSO DB'!$D24=\"\",\"\",'QSO DB'!B24)","v":""},{"$f":"IF('QSO DB'!$D24=\"\",\"\",'QSO DB'!D24)","v":""},{"$f":"IF('QSO DB'!$D24=\"\",\"\",'QSO DB'!E24)","v":""},{"$f":"IF('QSO DB'!$D24=\"\",\"\",'QSO DB'!I24)","v":""},{"$f":"IF('QSO DB'!$D24=\"\",\"\",'QSO DB'!J24)","v":""},{"$f":"IF('QSO DB'!$D24=\"\",\"\",'QSO DB'!K24)","v":""},{"$f":"IF('QSO DB'!$D24=\"\",\"\",'QSO DB'!L24)","v":""},{"$f":"IF('QSO DB'!$D24=\"\",\"\",'QSO DB'!M24)","v":""},{"$f":"IF('QSO DB'!$D24=\"\",\"\",'QSO DB'!F24)","v":""},{"$f":"IF('QSO DB'!$D24=\"\",\"\",'QSO DB'!G24)","v":""},{"$f":"IF('QSO DB'!$D24=\"\",\"\",'QSO DB'!H24)","v":""}]
[{"$f":"IF('QSO DB'!$D25=\"\",\"\",'QSO DB'!A25)","v":""},{"$f":"IF('QSO DB'!$D25=\"\",\"\",'QSO DB'!B25)","v":""},{"$f":"IF('QSO DB'!$D25=\"\",\"\",'QSO DB'!D25)","v":""},{"$f":"IF('QSO DB'!$D25=\"\",\"\",'QSO DB'!E25)","v":""},{"$f":"IF('QSO DB'!$D25=\"\",\"\",'QSO DB'!I25)","v":""},{"$f":"IF('QSO DB'!$D25=\"\",\"\",'QSO DB'!J25)","v":""},{"$f":"IF('QSO DB'!$D25=\"\",\"\",'QSO DB'!K25)","v":""},{"$f":"IF('QSO DB'!$D25=\"\",\"\",'QSO DB'!L25)","v":""},{"$f":"IF('QSO DB'!$D25=\"\",\"\",'QSO DB'!M25)","v":""},{"$f":"IF('QSO DB'!$D25=\"\",\"\",'QSO DB'!F25)","v":""},{"$f":"IF('QSO DB'!$D25=\"\",\"\",'QSO DB'!G25)","v":""},{"$f":"IF('QSO DB'!$D25=\"\",\"\",'QSO DB'!H25)","v":""}]
[{"$f":"IF('QSO DB'!$D26=\"\",\"\",'QSO DB'!A26)","v":""},{"$f":"IF('QSO DB'!$D26=\"\",\"\",'QSO DB'!B26)","v":""},{"$f":"IF('QSO DB'!$D26=\"\",\"\",'QSO DB'!D26)","v":""},{"$f":"IF('QSO DB'!$D26=\"\",\"\",'QSO DB'!E26)","v":""},{"$f":"IF('QSO DB'!$D26=\"\",\"\",'QSO DB'!I26)","v":""},{"$f":"IF('QSO DB'!$D26=\"\",\"\",'QSO DB'!J26)","v":""},{"$f":"IF('QSO DB'!$D26=\"\",\"\",'QSO DB'!K26)","v":""},{"$f":"IF('QSO DB'!$D26=\"\",\"\",'QSO DB'!L26)","v":""},{"$f":"IF('QSO DB'!$D26=\"\",\"\",'QSO DB'!M26)","v":""},{"$f":"IF('QSO DB'!$D26=\"\",\"\",'QSO DB'!F26)","v":""},{"$f":"IF('QSO DB'!$D26=\"\",\"\",'QSO DB'!G26)","v":""},{"$f":"IF('QSO DB'!$D26=\"\",\"\",'QSO DB'!H26)","v":""}]
[{"$f":"IF('QSO DB'!$D27=\"\",\"\",'QSO DB'!A27)","v":""},{"$f":"IF('QSO DB'!$D27=\"\",\"\",'QSO DB'!B27)","v":""},{"$f":"IF('QSO DB'!$D27=\"\",\"\",'QSO DB'!D27)","v":""},{"$f":"IF('QSO DB'!$D27=\"\",\"\",'QSO DB'!E27)","v":""},{"$f":"IF('QSO DB'!$D27=\"\",\"\",'QSO DB'!I27)","v":""},{"$f":"IF('QSO DB'!$D27=\"\",\"\",'QSO DB'!J27)","v":""},{"$f":"IF('QSO DB'!$D27=\"\",\"\",'QSO DB'!K27)","v":""},{"$f":"IF('QSO DB'!$D27=\"\",\"\",'QSO DB'!L27)","v":""},{"$f":"IF('QSO DB'!$D27=\"\",\"\",'QSO DB'!M27)","v":""},{"$f":"IF('QSO DB'!$D27=\"\",\"\",'QSO DB'!F27)","v":""},{"$f":"IF('QSO DB'!$D27=\"\",\"\",'QSO DB'!G27)","v":""},{"$f":"IF('QSO DB'!$D27=\"\",\"\",'QSO DB'!H27)","v":""}]
[{"$f":"IF('QSO DB'!$D28=\"\",\"\",'QSO DB'!A28)","v":""},{"$f":"IF('QSO DB'!$D28=\"\",\"\",'QSO DB'!B28)","v":""},{"$f":"IF('QSO DB'!$D28=\"\",\"\",'QSO DB'!D28)","v":""},{"$f":"IF('QSO DB'!$D28=\"\",\"\",'QSO DB'!E28)","v":""},{"$f":"IF('QSO DB'!$D28=\"\",\"\",'QSO DB'!I28)","v":""},{"$f":"IF('QSO DB'!$D28=\"\",\"\",'QSO DB'!J28)","v":""},{"$f":"IF('QSO DB'!$D28=\"\",\"\",'QSO DB'!K28)","v":""},{"$f":"IF('QSO DB'!$D28=\"\",\"\",'QSO DB'!L28)","v":""},{"$f":"IF('QSO DB'!$D28=\"\",\"\",'QSO DB'!M28)","v":""},{"$f":"IF('QSO DB'!$D28=\"\",\"\",'QSO DB'!F28)","v":""},{"$f":"IF('QSO DB'!$D28=\"\",\"\",'QSO DB'!G28)","v":""},{"$f":"IF('QSO DB'!$D28=\"\",\"\",'QSO DB'!H28)","v":""}]
[{"$f":"IF('QSO DB'!$D29=\"\",\"\",'QSO DB'!A29)","v":""},{"$f":"IF('QSO DB'!$D29=\"\",\"\",'QSO DB'!B29)","v":""},{"$f":"IF('QSO DB'!$D29=\"\",\"\",'QSO DB'!D29)","v":""},{"$f":"IF('QSO DB'!$D29=\"\",\"\",'QSO DB'!E29)","v":""},{"$f":"IF('QSO DB'!$D29=\"\",\"\",'QSO DB'!I29)","v":""},{"$f":"IF('QSO DB'!$D29=\"\",\"\",'QSO DB'!J29)","v":""},{"$f":"IF('QSO DB'!$D29=\"\",\"\",'QSO DB'!K29)","v":""},{"$f":"IF('QSO DB'!$D29=\"\",\"\",'QSO DB'!L29)","v":""},{"$f":"IF('QSO DB'!$D29=\"\",\"\",'QSO DB'!M29)","v":""},{"$f":"IF('QSO DB'!$D29=\"\",\"\",'QSO DB'!F29)","v":""},{"$f":"IF('QSO DB'!$D29=\"\",\"\",'QSO DB'!G29)","v":""},{"$f":"IF('QSO DB'!$D29=\"\",\"\",'QSO DB'!H29)","v":""}]
[{"$f":"IF('QSO DB'!$D30=\"\",\"\",'QSO DB'!A30)","v":""},{"$f":"IF('QSO DB'!$D30=\"\",\"\",'QSO DB'!B30)","v":""},{"$f":"IF('QSO DB'!$D30=\"\",\"\",'QSO DB'!D30)","v":""},{"$f":"IF('QSO DB'!$D30=\"\",\"\",'QSO DB'!E30)","v":""},{"$f":"IF('QSO DB'!$D30=\"\",\"\",'QSO DB'!I30)","v":""},{"$f":"IF('QSO DB'!$D30=\"\",\"\",'QSO DB'!J30)","v":""},{"$f":"IF('QSO DB'!$D30=\"\",\"\",'QSO DB'!K30)","v":""},{"$f":"IF('QSO DB'!$D30=\"\",\"\",'QSO DB'!L30)","v":""},{"$f":"IF('QSO DB'!$D30=\"\",\"\",'QSO DB'!M30)","v":""},{"$f":"IF('QSO DB'!$D30=\"\",\"\",'QSO DB'!F30)","v":""},{"$f":"IF('QSO DB'!$D30=\"\",\"\",'QSO DB'!G30)","v":""},{"$f":"IF('QSO DB'!$D30=\"\",\"\",'QSO DB'!H30)","v":""}]
[{"$f":"IF('QSO DB'!$D31=\"\",\"\",'QSO DB'!A31)","v":""},{"$f":"IF('QSO DB'!$D31=\"\",\"\",'QSO DB'!B31)","v":""},{"$f":"IF('QSO DB'!$D31=\"\",\"\",'QSO DB'!D31)","v":""},{"$f":"IF('QSO DB'!$D31=\"\",\"\",'QSO DB'!E31)","v":""},{"$f":"IF('QSO DB'!$D31=\"\",\"\",'QSO DB'!I31)","v":""},{"$f":"IF('QSO DB'!$D31=\"\",\"\",'QSO DB'!J31)","v":""},{"$f":"IF('QSO DB'!$D31=\"\",\"\",'QSO DB'!K31)","v":""},{"$f":"IF('QSO DB'!$D31=\"\",\"\",'QSO DB'!L31)","v":""},{"$f":"IF('QSO DB'!$D31=\"\",\"\",'QSO DB'!M31)","v":""},{"$f":"IF('QSO DB'!$D31=\"\",\"\",'QSO DB'!F31)","v":""},{"$f":"IF('QSO DB'!$D31=\"\",\"\",'QSO DB'!G31)","v":""},{"$f":"IF('QSO DB'!$D31=\"\",\"\",'QSO DB'!H31)","v":""}]
[{"$f":"IF('QSO DB'!$D32=\"\",\"\",'QSO DB'!A32)","v":""},{"$f":"IF('QSO DB'!$D32=\"\",\"\",'QSO DB'!B32)","v":""},{"$f":"IF('QSO DB'!$D32=\"\",\"\",'QSO DB'!D32)","v":""},{"$f":"IF('QSO DB'!$D32=\"\",\"\",'QSO DB'!E32)","v":""},{"$f":"IF('QSO DB'!$D32=\"\",\"\",'QSO DB'!I32)","v":""},{"$f":"IF('QSO DB'!$D32=\"\",\"\",'QSO DB'!J32)","v":""},{"$f":"IF('QSO DB'!$D32=\"\",\"\",'QSO DB'!K32)","v":""},{"$f":"IF('QSO DB'!$D32=\"\",\"\",'QSO DB'!L32)","v":""},{"$f":"IF('QSO DB'!$D32=\"\",\"\",'QSO DB'!M32)","v":""},{"$f":"IF('QSO DB'!$D32=\"\",\"\",'QSO DB'!F32)","v":""},{"$f":"IF('QSO DB'!$D32=\"\",\"\",'QSO DB'!G32)","v":""},{"$f":"IF('QSO DB'!$D32=\"\",\"\",'QSO DB'!H32)","v":""}]
[{"$f":"IF('QSO DB'!$D33=\"\",\"\",'QSO DB'!A33)","v":""},{"$f":"IF('QSO DB'!$D33=\"\",\"\",'QSO DB'!B33)","v":""},{"$f":"IF('QSO DB'!$D33=\"\",\"\",'QSO DB'!D33)","v":""},{"$f":"IF('QSO DB'!$D33=\"\",\"\",'QSO DB'!E33)","v":""},{"$f":"IF('QSO DB'!$D33=\"\",\"\",'QSO DB'!I33)","v":""},{"$f":"IF('QSO DB'!$D33=\"\",\"\",'QSO DB'!J33)","v":""},{"$f":"IF('QSO DB'!$D33=\"\",\"\",'QSO DB'!K33)","v":""},{"$f":"IF('QSO DB'!$D33=\"\",\"\",'QSO DB'!L33)","v":""},{"$f":"IF('QSO DB'!$D33=\"\",\"\",'QSO DB'!M33)","v":""},{"$f":"IF('QSO DB'!$D33=\"\",\"\",'QSO DB'!F33)","v":""},{"$f":"IF('QSO DB'!$D33=\"\",\"\",'QSO DB'!G33)","v":""},{"$f":"IF('QSO DB'!$D33=\"\",\"\",'QSO DB'!H33)","v":""}]
[{"$f":"IF('QSO DB'!$D34=\"\",\"\",'QSO DB'!A34)","v":""},{"$f":"IF('QSO DB'!$D34=\"\",\"\",'QSO DB'!B34)","v":""},{"$f":"IF('QSO DB'!$D34=\"\",\"\",'QSO DB'!D34)","v":""},{"$f":"IF('QSO DB'!$D34=\"\",\"\",'QSO DB'!E34)","v":""},{"$f":"IF('QSO DB'!$D34=\"\",\"\",'QSO DB'!I34)","v":""},{"$f":"IF('QSO DB'!$D34=\"\",\"\",'QSO DB'!J34)","v":""},{"$f":"IF('QSO DB'!$D34=\"\",\"\",'QSO DB'!K34)","v":""},{"$f":"IF('QSO DB'!$D34=\"\",\"\",'QSO DB'!L34)","v":""},{"$f":"IF('QSO DB'!$D34=\"\",\"\",'QSO DB'!M34)","v":""},{"$f":"IF('QSO DB'!$D34=\"\",\"\",'QSO DB'!F34)","v":""},{"$f":"IF('QSO DB'!$D34=\"\",\"\",'QSO DB'!G34)","v":""},{"$f":"IF('QSO DB'!$D34=\"\",\"\",'QSO DB'!H34)","v":""}]
[{"$f":"IF('QSO DB'!$D35=\"\",\"\",'QSO DB'!A35)","v":""},{"$f":"IF('QSO DB'!$D35=\"\",\"\",'QSO DB'!B35)","v":""},{"$f":"IF('QSO DB'!$D35=\"\",\"\",'QSO DB'!D35)","v":""},{"$f":"IF('QSO DB'!$D35=\"\",\"\",'QSO DB'!E35)","v":""},{"$f":"IF('QSO DB'!$D35=\"\",\"\",'QSO DB'!I35)","v":""},{"$f":"IF('QSO DB'!$D35=\"\",\"\",'QSO DB'!J35)","v":""},{"$f":"IF('QSO DB'!$D35=\"\",\"\",'QSO DB'!K35)","v":""},{"$f":"IF('QSO DB'!$D35=\"\",\"\",'QSO DB'!L35)","v":""},{"$f":"IF('QSO DB'!$D35=\"\",\"\",'QSO DB'!M35)","v":""},{"$f":"IF('QSO DB'!$D35=\"\",\"\",'QSO DB'!F35)","v":""},{"$f":"IF('QSO DB'!$D35=\"\",\"\",'QSO DB'!G35)","v":""},{"$f":"IF('QSO DB'!$D35=\"\",\"\",'QSO DB'!H35)","v":""}]
[{"$f":"IF('QSO DB'!$D36=\"\",\"\",'QSO DB'!A36)","v":""},{"$f":"IF('QSO DB'!$D36=\"\",\"\",'QSO DB'!B36)","v":""},{"$f":"IF('QSO DB'!$D36=\"\",\"\",'QSO DB'!D36)","v":""},{"$f":"IF('QSO DB'!$D36=\"\",\"\",'QSO DB'!E36)","v":""},{"$f":"IF('QSO DB'!$D36=\"\",\"\",'QSO DB'!I36)","v":""},{"$f":"IF('QSO DB'!$D36=\"\",\"\",'QSO DB'!J36)","v":""},{"$f":"IF('QSO DB'!$D36=\"\",\"\",'QSO DB'!K36)","v":""},{"$f":"IF('QSO DB'!$D36=\"\",\"\",'QSO DB'!L36)","v":""},{"$f":"IF('QSO DB'!$D36=\"\",\"\",'QSO DB'!M36)","v":""},{"$f":"IF('QSO DB'!$D36=\"\",\"\",'QSO DB'!F36)","v":""},{"$f":"IF('QSO DB'!$D36=\"\",\"\",'QSO DB'!G36)","v":""},{"$f":"IF('QSO DB'!$D36=\"\",\"\",'QSO DB'!H36)","v":""}]
[{"$f":"IF('QSO DB'!$D37=\"\",\"\",'QSO DB'!A37)","v":""},{"$f":"IF('QSO DB'!$D37=\"\",\"\",'QSO DB'!B37)","v":""},{"$f":"IF('QSO DB'!$D37=\"\",\"\",'QSO DB'!D37)","v":""},{"$f":"IF('QSO DB'!$D37=\"\",\"\",'QSO DB'!E37)","v":""},{"$f":"IF('QSO DB'!$D37=\"\",\"\",'QSO DB'!I37)","v":""},{"$f":"IF('QSO DB'!$D37=\"\",\"\",'QSO DB'!J37)","v":""},{"$f":"IF('QSO DB'!$D37=\"\",\"\",'QSO DB'!K37)","v":""},{"$f":"IF('QSO DB'!$D37=\"\",\"\",'QSO DB'!L37)","v":""},{"$f":"IF('QSO DB'!$D37=\"\",\"\",'QSO DB'!M37)","v":""},{"$f":"IF('QSO DB'!$D37=\"\",\"\",'QSO DB'!F37)","v":""},{"$f":"IF('QSO DB'!$D37=\"\",\"\",'QSO DB'!G37)","v":""},{"$f":"IF('QSO DB'!$D37=\"\",\"\",'QSO DB'!H37)","v":""}]
[{"$f":"IF('QSO DB'!$D38=\"\",\"\",'QSO DB'!A38)","v":""},{"$f":"IF('QSO DB'!$D38=\"\",\"\",'QSO DB'!B38)","v":""},{"$f":"IF('QSO DB'!$D38=\"\",\"\",'QSO DB'!D38)","v":""},{"$f":"IF('QSO DB'!$D38=\"\",\"\",'QSO DB'!E38)","v":""},{"$f":"IF('QSO DB'!$D38=\"\",\"\",'QSO DB'!I38)","v":""},{"$f":"IF('QSO DB'!$D38=\"\",\"\",'QSO DB'!J38)","v":""},{"$f":"IF('QSO DB'!$D38=\"\",\"\",'QSO DB'!K38)","v":""},{"$f":"IF('QSO DB'!$D38=\"\",\"\",'QSO DB'!L38)","v":""},{"$f":"IF('QSO DB'!$D38=\"\",\"\",'QSO DB'!M38)","v":""},{"$f":"IF('QSO DB'!$D38=\"\",\"\",'QSO DB'!F38)","v":""},{"$f":"IF('QSO DB'!$D38=\"\",\"\",'QSO DB'!G38)","v":""},{"$f":"IF('QSO DB'!$D38=\"\",\"\",'QSO DB'!H38)","v":""}]
[{"$f":"IF('QSO DB'!$D39=\"\",\"\",'QSO DB'!A39)","v":""},{"$f":"IF('QSO DB'!$D39=\"\",\"\",'QSO DB'!B39)","v":""},{"$f":"IF('QSO DB'!$D39=\"\",\"\",'QSO DB'!D39)","v":""},{"$f":"IF('QSO DB'!$D39=\"\",\"\",'QSO DB'!E39)","v":""},{"$f":"IF('QSO DB'!$D39=\"\",\"\",'QSO DB'!I39)","v":""},{"$f":"IF('QSO DB'!$D39=\"\",\"\",'QSO DB'!J39)","v":""},{"$f":"IF('QSO DB'!$D39=\"\",\"\",'QSO DB'!K39)","v":""},{"$f":"IF('QSO DB'!$D39=\"\",\"\",'QSO DB'!L39)","v":""},{"$f":"IF('QSO DB'!$D39=\"\",\"\",'QSO DB'!M39)","v":""},{"$f":"IF('QSO DB'!$D39=\"\",\"\",'QSO DB'!F39)","v":""},{"$f":"IF('QSO DB'!$D39=\"\",\"\",'QSO DB'!G39)","v":""},{"$f":"IF('QSO DB'!$D39=\"\",\"\",'QSO DB'!H39)","v":""}]
[{"$f":"IF('QSO DB'!$D40=\"\",\"\",'QSO DB'!A40)","v":""},{"$f":"IF('QSO DB'!$D40=\"\",\"\",'QSO DB'!B40)","v":""},{"$f":"IF('QSO DB'!$D40=\"\",\"\",'QSO DB'!D40)","v":""},{"$f":"IF('QSO DB'!$D40=\"\",\"\",'QSO DB'!E40)","v":""},{"$f":"IF('QSO DB'!$D40=\"\",\"\",'QSO DB'!I40)","v":""},{"$f":"IF('QSO DB'!$D40=\"\",\"\",'QSO DB'!J40)","v":""},{"$f":"IF('QSO DB'!$D40=\"\",\"\",'QSO DB'!K40)","v":""},{"$f":"IF('QSO DB'!$D40=\"\",\"\",'QSO DB'!L40)","v":""},{"$f":"IF('QSO DB'!$D40=\"\",\"\",'QSO DB'!M40)","v":""},{"$f":"IF('QSO DB'!$D40=\"\",\"\",'QSO DB'!F40)","v":""},{"$f":"IF('QSO DB'!$D40=\"\",\"\",'QSO DB'!G40)","v":""},{"$f":"IF('QSO DB'!$D40=\"\",\"\",'QSO DB'!H40)","v":""}]
[{"$f":"IF('QSO DB'!$D41=\"\",\"\",'QSO DB'!A41)","v":""},{"$f":"IF('QSO DB'!$D41=\"\",\"\",'QSO DB'!B41)","v":""},{"$f":"IF('QSO DB'!$D41=\"\",\"\",'QSO DB'!D41)","v":""},{"$f":"IF('QSO DB'!$D41=\"\",\"\",'QSO DB'!E41)","v":""},{"$f":"IF('QSO DB'!$D41=\"\",\"\",'QSO DB'!I41)","v":""},{"$f":"IF('QSO DB'!$D41=\"\",\"\",'QSO DB'!J41)","v":""},{"$f":"IF('QSO DB'!$D41=\"\",\"\",'QSO DB'!K41)","v":""},{"$f":"IF('QSO DB'!$D41=\"\",\"\",'QSO DB'!L41)","v":""},{"$f":"IF('QSO DB'!$D41=\"\",\"\",'QSO DB'!M41)","v":""},{"$f":"IF('QSO DB'!$D41=\"\",\"\",'QSO DB'!F41)","v":""},{"$f":"IF('QSO DB'!$D41=\"\",\"\",'QSO DB'!G41)","v":""},{"$f":"IF('QSO DB'!$D41=\"\",\"\",'QSO DB'!H41)","v":""}]
[{"$f":"IF('QSO DB'!$D42=\"\",\"\",'QSO DB'!A42)","v":""},{"$f":"IF('QSO DB'!$D42=\"\",\"\",'QSO DB'!B42)","v":""},{"$f":"IF('QSO DB'!$D42=\"\",\"\",'QSO DB'!D42)","v":""},{"$f":"IF('QSO DB'!$D42=\"\",\"\",'QSO DB'!E42)","v":""},{"$f":"IF('QSO DB'!$D42=\"\",\"\",'QSO DB'!I42)","v":""},{"$f":"IF('QSO DB'!$D42=\"\",\"\",'QSO DB'!J42)","v":""},{"$f":"IF('QSO DB'!$D42=\"\",\"\",'QSO DB'!K42)","v":""},{"$f":"IF('QSO DB'!$D42=\"\",\"\",'QSO DB'!L42)","v":""},{"$f":"IF('QSO DB'!$D42=\"\",\"\",'QSO DB'!M42)","v":""},{"$f":"IF('QSO DB'!$D42=\"\",\"\",'QSO DB'!F42)","v":""},{"$f":"IF('QSO DB'!$D42=\"\",\"\",'QSO DB'!G42)","v":""},{"$f":"IF('QSO DB'!$D42=\"\",\"\",'QSO DB'!H42)","v":""}]
[{"$f":"IF('QSO DB'!$D43=\"\",\"\",'QSO DB'!A43)","v":""},{"$f":"IF('QSO DB'!$D43=\"\",\"\",'QSO DB'!B43)","v":""},{"$f":"IF('QSO DB'!$D43=\"\",\"\",'QSO DB'!D43)","v":""},{"$f":"IF('QSO DB'!$D43=\"\",\"\",'QSO DB'!E43)","v":""},{"$f":"IF('QSO DB'!$D43=\"\",\"\",'QSO DB'!I43)","v":""},{"$f":"IF('QSO DB'!$D43=\"\",\"\",'QSO DB'!J43)","v":""},{"$f":"IF('QSO DB'!$D43=\"\",\"\",'QSO DB'!K43)","v":""},{"$f":"IF('QSO DB'!$D43=\"\",\"\",'QSO DB'!L43)","v":""},{"$f":"IF('QSO DB'!$D43=\"\",\"\",'QSO DB'!M43)","v":""},{"$f":"IF('QSO DB'!$D43=\"\",\"\",'QSO DB'!F43)","v":""},{"$f":"IF('QSO DB'!$D43=\"\",\"\",'QSO DB'!G43)","v":""},{"$f":"IF('QSO DB'!$D43=\"\",\"\",'QSO DB'!H43)","v":""}]
[{"$f":"IF('QSO DB'!$D44=\"\",\"\",'QSO DB'!A44)","v":""},{"$f":"IF('QSO DB'!$D44=\"\",\"\",'QSO DB'!B44)","v":""},{"$f":"IF('QSO DB'!$D44=\"\",\"\",'QSO DB'!D44)","v":""},{"$f":"IF('QSO DB'!$D44=\"\",\"\",'QSO DB'!E44)","v":""},{"$f":"IF('QSO DB'!$D44=\"\",\"\",'QSO DB'!I44)","v":""},{"$f":"IF('QSO DB'!$D44=\"\",\"\",'QSO DB'!J44)","v":""},{"$f":"IF('QSO DB'!$D44=\"\",\"\",'QSO DB'!K44)","v":""},{"$f":"IF('QSO DB'!$D44=\"\",\"\",'QSO DB'!L44)","v":""},{"$f":"IF('QSO DB'!$D44=\"\",\"\",'QSO DB'!M44)","v":""},{"$f":"IF('QSO DB'!$D44=\"\",\"\",'QSO DB'!F44)","v":""},{"$f":"IF('QSO DB'!$D44=\"\",\"\",'QSO DB'!G44)","v":""},{"$f":"IF('QSO DB'!$D44=\"\",\"\",'QSO DB'!H44)","v":""}]
[{"$f":"IF('QSO DB'!$D45=\"\",\"\",'QSO DB'!A45)","v":""},{"$f":"IF('QSO DB'!$D45=\"\",\"\",'QSO DB'!B45)","v":""},{"$f":"IF('QSO DB'!$D45=\"\",\"\",'QSO DB'!D45)","v":""},{"$f":"IF('QSO DB'!$D45=\"\",\"\",'QSO DB'!E45)","v":""},{"$f":"IF('QSO DB'!$D45=\"\",\"\",'QSO DB'!I45)","v":""},{"$f":"IF('QSO DB'!$D45=\"\",\"\",'QSO DB'!J45)","v":""},{"$f":"IF('QSO DB'!$D45=\"\",\"\",'QSO DB'!K45)","v":""},{"$f":"IF('QSO DB'!$D45=\"\",\"\",'QSO DB'!L45)","v":""},{"$f":"IF('QSO DB'!$D45=\"\",\"\",'QSO DB'!M45)","v":""},{"$f":"IF('QSO DB'!$D45=\"\",\"\",'QSO DB'!F45)","v":""},{"$f":"IF('QSO DB'!$D45=\"\",\"\",'QSO DB'!G45)","v":""},{"$f":"IF('QSO DB'!$D45=\"\",\"\",'QSO DB'!H45)","v":""}]
[{"$f":"IF('QSO DB'!$D46=\"\",\"\",'QSO DB'!A46)","v":""},{"$f":"IF('QSO DB'!$D46=\"\",\"\",'QSO DB'!B46)","v":""},{"$f":"IF('QSO DB'!$D46=\"\",\"\",'QSO DB'!D46)","v":""},{"$f":"IF('QSO DB'!$D46=\"\",\"\",'QSO DB'!E46)","v":""},{"$f":"IF('QSO DB'!$D46=\"\",\"\",'QSO DB'!I46)","v":""},{"$f":"IF('QSO DB'!$D46=\"\",\"\",'QSO DB'!J46)","v":""},{"$f":"IF('QSO DB'!$D46=\"\",\"\",'QSO DB'!K46)","v":""},{"$f":"IF('QSO DB'!$D46=\"\",\"\",'QSO DB'!L46)","v":""},{"$f":"IF('QSO DB'!$D46=\"\",\"\",'QSO DB'!M46)","v":""},{"$f":"IF('QSO DB'!$D46=\"\",\"\",'QSO DB'!F46)","v":""},{"$f":"IF('QSO DB'!$D46=\"\",\"\",'QSO DB'!G46)","v":""},{"$f":"IF('QSO DB'!$D46=\"\",\"\",'QSO DB'!H46)","v":""}]
[{"$f":"IF('QSO DB'!$D47=\"\",\"\",'QSO DB'!A47)","v":""},{"$f":"IF('QSO DB'!$D47=\"\",\"\",'QSO DB'!B47)","v":""},{"$f":"IF('QSO DB'!$D47=\"\",\"\",'QSO DB'!D47)","v":""},{"$f":"IF('QSO DB'!$D47=\"\",\"\",'QSO DB'!E47)","v":""},{"$f":"IF('QSO DB'!$D47=\"\",\"\",'QSO DB'!I47)","v":""},{"$f":"IF('QSO DB'!$D47=\"\",\"\",'QSO DB'!J47)","v":""},{"$f":"IF('QSO DB'!$D47=\"\",\"\",'QSO DB'!K47)","v":""},{"$f":"IF('QSO DB'!$D47=\"\",\"\",'QSO DB'!L47)","v":""},{"$f":"IF('QSO DB'!$D47=\"\",\"\",'QSO DB'!M47)","v":""},{"$f":"IF('QSO DB'!$D47=\"\",\"\",'QSO DB'!F47)","v":""},{"$f":"IF('QSO DB'!$D47=\"\",\"\",'QSO DB'!G47)","v":""},{"$f":"IF('QSO DB'!$D47=\"\",\"\",'QSO DB'!H47)","v":""}]
[{"$f":"IF('QSO DB'!$D48=\"\",\"\",'QSO DB'!A48)","v":""},{"$f":"IF('QSO DB'!$D48=\"\",\"\",'QSO DB'!B48)","v":""},{"$f":"IF('QSO DB'!$D48=\"\",\"\",'QSO DB'!D48)","v":""},{"$f":"IF('QSO DB'!$D48=\"\",\"\",'QSO DB'!E48)","v":""},{"$f":"IF('QSO DB'!$D48=\"\",\"\",'QSO DB'!I48)","v":""},{"$f":"IF('QSO DB'!$D48=\"\",\"\",'QSO DB'!J48)","v":""},{"$f":"IF('QSO DB'!$D48=\"\",\"\",'QSO DB'!K48)","v":""},{"$f":"IF('QSO DB'!$D48=\"\",\"\",'QSO DB'!L48)","v":""},{"$f":"IF('QSO DB'!$D48=\"\",\"\",'QSO DB'!M48)","v":""},{"$f":"IF('QSO DB'!$D48=\"\",\"\",'QSO DB'!F48)","v":""},{"$f":"IF('QSO DB'!$D48=\"\",\"\",'QSO DB'!G48)","v":""},{"$f":"IF('QSO DB'!$D48=\"\",\"\",'QSO DB'!H48)","v":""}]
[{"$f":"IF('QSO DB'!$D49=\"\",\"\",'QSO DB'!A49)","v":""},{"$f":"IF('QSO DB'!$D49=\"\",\"\",'QSO DB'!B49)","v":""},{"$f":"IF('QSO DB'!$D49=\"\",\"\",'QSO DB'!D49)","v":""},{"$f":"IF('QSO DB'!$D49=\"\",\"\",'QSO DB'!E49)","v":""},{"$f":"IF('QSO DB'!$D49=\"\",\"\",'QSO DB'!I49)","v":""},{"$f":"IF('QSO DB'!$D49=\"\",\"\",'QSO DB'!J49)","v":""},{"$f":"IF('QSO DB'!$D49=\"\",\"\",'QSO DB'!K49)","v":""},{"$f":"IF('QSO DB'!$D49=\"\",\"\",'QSO DB'!L49)","v":""},{"$f":"IF('QSO DB'!$D49=\"\",\"\",'QSO DB'!M49)","v":""},{"$f":"IF('QSO DB'!$D49=\"\",\"\",'QSO DB'!F49)","v":""},{"$f":"IF('QSO DB'!$D49=\"\",\"\",'QSO DB'!G49)","v":""},{"$f":"IF('QSO DB'!$D49=\"\",\"\",'QSO DB'!H49)","v":""}]
[{"$f":"IF('QSO DB'!$D50=\"\",\"\",'QSO DB'!A50)","v":""},{"$f":"IF('QSO DB'!$D50=\"\",\"\",'QSO DB'!B50)","v":""},{"$f":"IF('QSO DB'!$D50=\"\",\"\",'QSO DB'!D50)","v":""},{"$f":"IF('QSO DB'!$D50=\"\",\"\",'QSO DB'!E50)","v":""},{"$f":"IF('QSO DB'!$D50=\"\",\"\",'QSO DB'!I50)","v":""},{"$f":"IF('QSO DB'!$D50=\"\",\"\",'QSO DB'!J50)","v":""},{"$f":"IF('QSO DB'!$D50=\"\",\"\",'QSO DB'!K50)","v":""},{"$f":"IF('QSO DB'!$D50=\"\",\"\",'QSO DB'!L50)","v":""},{"$f":"IF('QSO DB'!$D50=\"\",\"\",'QSO DB'!M50)","v":""},{"$f":"IF('QSO DB'!$D50=\"\",\"\",'QSO DB'!F50)","v":""},{"$f":"IF('QSO DB'!$D50=\"\",\"\",'QSO DB'!G50)","v":""},{"$f":"IF('QSO DB'!$D50=\"\",\"\",'QSO DB'!H50)","v":""}]
[{"$f":"IF('QSO DB'!$D51=\"\",\"\",'QSO DB'!A51)","v":""},{"$f":"IF('QSO DB'!$D51=\"\",\"\",'QSO DB'!B51)","v":""},{"$f":"IF('QSO DB'!$D51=\"\",\"\",'QSO DB'!D51)","v":""},{"$f":"IF('QSO DB'!$D51=\"\",\"\",'QSO DB'!E51)","v":""},{"$f":"IF('QSO DB'!$D51=\"\",\"\",'QSO DB'!I51)","v":""},{"$f":"IF('QSO DB'!$D51=\"\",\"\",'QSO DB'!J51)","v":""},{"$f":"IF('QSO DB'!$D51=\"\",\"\",'QSO DB'!K51)","v":""},{"$f":"IF('QSO DB'!$D51=\"\",\"\",'QSO DB'!L51)","v":""},{"$f":"IF('QSO DB'!$D51=\"\",\"\",'QSO DB'!M51)","v":""},{"$f":"IF('QSO DB'!$D51=\"\",\"\",'QSO DB'!F51)","v":""},{"$f":"IF('QSO DB'!$D51=\"\",\"\",'QSO DB'!G51)","v":""},{"$f":"IF('QSO DB'!$D51=\"\",\"\",'QSO DB'!H51)","v":""}]
[{"$f":"IF('QSO DB'!$D52=\"\",\"\",'QSO DB'!A52)","v":""},{"$f":"IF('QSO DB'!$D52=\"\",\"\",'QSO DB'!B52)","v":""},{"$f":"IF('QSO DB'!$D52=\"\",\"\",'QSO DB'!D52)","v":""},{"$f":"IF('QSO DB'!$D52=\"\",\"\",'QSO DB'!E52)","v":""},{"$f":"IF('QSO DB'!$D52=\"\",\"\",'QSO DB'!I52)","v":""},{"$f":"IF('QSO DB'!$D52=\"\",\"\",'QSO DB'!J52)","v":""},{"$f":"IF('QSO DB'!$D52=\"\",\"\",'QSO DB'!K52)","v":""},{"$f":"IF('QSO DB'!$D52=\"\",\"\",'QSO DB'!L52)","v":""},{"$f":"IF('QSO DB'!$D52=\"\",\"\",'QSO DB'!M52)","v":""},{"$f":"IF('QSO DB'!$D52=\"\",\"\",'QSO DB'!F52)","v":""},{"$f":"IF('QSO DB'!$D52=\"\",\"\",'QSO DB'!G52)","v":""},{"$f":"IF('QSO DB'!$D52=\"\",\"\",'QSO DB'!H52)","v":""}]
[{"$f":"IF('QSO DB'!$D53=\"\",\"\",'QSO DB'!A53)","v":""},{"$f":"IF('QSO DB'!$D53=\"\",\"\",'QSO DB'!B53)","v":""},{"$f":"IF('QSO DB'!$D53=\"\",\"\",'QSO DB'!D53)","v":""},{"$f":"IF('QSO DB'!$D53=\"\",\"\",'QSO DB'!E53)","v":""},{"$f":"IF('QSO DB'!$D53=\"\",\"\",'QSO DB'!I53)","v":""},{"$f":"IF('QSO DB'!$D53=\"\",\"\",'QSO DB'!J53)","v":""},{"$f":"IF('QSO DB'!$D53=\"\",\"\",'QSO DB'!K53)","v":""},{"$f":"IF('QSO DB'!$D53=\"\",\"\",'QSO DB'!L53)","v":""},{"$f":"IF('QSO DB'!$D53=\"\",\"\",'QSO DB'!M53)","v":""},{"$f":"IF('QSO DB'!$D53=\"\",\"\",'QSO DB'!F53)","v":""},{"$f":"IF('QSO DB'!$D53=\"\",\"\",'QSO DB'!G53)","v":""},{"$f":"IF('QSO DB'!$D53=\"\",\"\",'QSO DB'!H53)","v":""}]
[{"$f":"IF('QSO DB'!$D54=\"\",\"\",'QSO DB'!A54)","v":""},{"$f":"IF('QSO DB'!$D54=\"\",\"\",'QSO DB'!B54)","v":""},{"$f":"IF('QSO DB'!$D54=\"\",\"\",'QSO DB'!D54)","v":""},{"$f":"IF('QSO DB'!$D54=\"\",\"\",'QSO DB'!E54)","v":""},{"$f":"IF('QSO DB'!$D54=\"\",\"\",'QSO DB'!I54)","v":""},{"$f":"IF('QSO DB'!$D54=\"\",\"\",'QSO DB'!J54)","v":""},{"$f":"IF('QSO DB'!$D54=\"\",\"\",'QSO DB'!K54)","v":""},{"$f":"IF('QSO DB'!$D54=\"\",\"\",'QSO DB'!L54)","v":""},{"$f":"IF('QSO DB'!$D54=\"\",\"\",'QSO DB'!M54)","v":""},{"$f":"IF('QSO DB'!$D54=\"\",\"\",'QSO DB'!F54)","v":""},{"$f":"IF('QSO DB'!$D54=\"\",\"\",'QSO DB'!G54)","v":""},{"$f":"IF('QSO DB'!$D54=\"\",\"\",'QSO DB'!H54)","v":""}]
[{"$f":"IF('QSO DB'!$D55=\"\",\"\",'QSO DB'!A55)","v":""},{"$f":"IF('QSO DB'!$D55=\"\",\"\",'QSO DB'!B55)","v":""},{"$f":"IF('QSO DB'!$D55=\"\",\"\",'QSO DB'!D55)","v":""},{"$f":"IF('QSO DB'!$D55=\"\",\"\",'QSO DB'!E55)","v":""},{"$f":"IF('QSO DB'!$D55=\"\",\"\",'QSO DB'!I55)","v":""},{"$f":"IF('QSO DB'!$D55=\"\",\"\",'QSO DB'!J55)","v":""},{"$f":"IF('QSO DB'!$D55=\"\",\"\",'QSO DB'!K55)","v":""},{"$f":"IF('QSO DB'!$D55=\"\",\"\",'QSO DB'!L55)","v":""},{"$f":"IF('QSO DB'!$D55=\"\",\"\",'QSO DB'!M55)","v":""},{"$f":"IF('QSO DB'!$D55=\"\",\"\",'QSO DB'!F55)","v":""},{"$f":"IF('QSO DB'!$D55=\"\",\"\",'QSO DB'!G55)","v":""},{"$f":"IF('QSO DB'!$D55=\"\",\"\",'QSO DB'!H55)","v":""}]
[{"$f":"IF('QSO DB'!$D56=\"\",\"\",'QSO DB'!A56)","v":""},{"$f":"IF('QSO DB'!$D56=\"\",\"\",'QSO DB'!B56)","v":""},{"$f":"IF('QSO DB'!$D56=\"\",\"\",'QSO DB'!D56)","v":""},{"$f":"IF('QSO DB'!$D56=\"\",\"\",'QSO DB'!E56)","v":""},{"$f":"IF('QSO DB'!$D56=\"\",\"\",'QSO DB'!I56)","v":""},{"$f":"IF('QSO DB'!$D56=\"\",\"\",'QSO DB'!J56)","v":""},{"$f":"IF('QSO DB'!$D56=\"\",\"\",'QSO DB'!K56)","v":""},{"$f":"IF('QSO DB'!$D56=\"\",\"\",'QSO DB'!L56)","v":""},{"$f":"IF('QSO DB'!$D56=\"\",\"\",'QSO DB'!M56)","v":""},{"$f":"IF('QSO DB'!$D56=\"\",\"\",'QSO DB'!F56)","v":""},{"$f":"IF('QSO DB'!$D56=\"\",\"\",'QSO DB'!G56)","v":""},{"$f":"IF('QSO DB'!$D56=\"\",\"\",'QSO DB'!H56)","v":""}]
[{"$f":"IF('QSO DB'!$D57=\"\",\"\",'QSO DB'!A57)","v":""},{"$f":"IF('QSO DB'!$D57=\"\",\"\",'QSO DB'!B57)","v":""},{"$f":"IF('QSO DB'!$D57=\"\",\"\",'QSO DB'!D57)","v":""},{"$f":"IF('QSO DB'!$D57=\"\",\"\",'QSO DB'!E57)","v":""},{"$f":"IF('QSO DB'!$D57=\"\",\"\",'QSO DB'!I57)","v":""},{"$f":"IF('QSO DB'!$D57=\"\",\"\",'QSO DB'!J57)","v":""},{"$f":"IF('QSO DB'!$D57=\"\",\"\",'QSO DB'!K57)","v":""},{"$f":"IF('QSO DB'!$D57=\"\",\"\",'QSO DB'!L57)","v":""},{"$f":"IF('QSO DB'!$D57=\"\",\"\",'QSO DB'!M57)","v":""},{"$f":"IF('QSO DB'!$D57=\"\",\"\",'QSO DB'!F57)","v":""},{"$f":"IF('QSO DB'!$D57=\"\",\"\",'QSO DB'!G57)","v":""},{"$f":"IF('QSO DB'!$D57=\"\",\"\",'QSO DB'!H57)","v":""}]
[{"$f":"IF('QSO DB'!$D58=\"\",\"\",'QSO DB'!A58)","v":""},{"$f":"IF('QSO DB'!$D58=\"\",\"\",'QSO DB'!B58)","v":""},{"$f":"IF('QSO DB'!$D58=\"\",\"\",'QSO DB'!D58)","v":""},{"$f":"IF('QSO DB'!$D58=\"\",\"\",'QSO DB'!E58)","v":""},{"$f":"IF('QSO DB'!$D58=\"\",\"\",'QSO DB'!I58)","v":""},{"$f":"IF('QSO DB'!$D58=\"\",\"\",'QSO DB'!J58)","v":""},{"$f":"IF('QSO DB'!$D58=\"\",\"\",'QSO DB'!K58)","v":""},{"$f":"IF('QSO DB'!$D58=\"\",\"\",'QSO DB'!L58)","v":""},{"$f":"IF('QSO DB'!$D58=\"\",\"\",'QSO DB'!M58)","v":""},{"$f":"IF('QSO DB'!$D58=\"\",\"\",'QSO DB'!F58)","v":""},{"$f":"IF('QSO DB'!$D58=\"\",\"\",'QSO DB'!G58)","v":""},{"$f":"IF('QSO DB'!$D58=\"\",\"\",'QSO DB'!H58)","v":""}]
[{"$f":"IF('QSO DB'!$D59=\"\",\"\",'QSO DB'!A59)","v":""},{"$f":"IF('QSO DB'!$D59=\"\",\"\",'QSO DB'!B59)","v":""},{"$f":"IF('QSO DB'!$D59=\"\",\"\",'QSO DB'!D59)","v":""},{"$f":"IF('QSO DB'!$D59=\"\",\"\",'QSO DB'!E59)","v":""},{"$f":"IF('QSO DB'!$D59=\"\",\"\",'QSO DB'!I59)","v":""},{"$f":"IF('QSO DB'!$D59=\"\",\"\",'QSO DB'!J59)","v":""},{"$f":"IF('QSO DB'!$D59=\"\",\"\",'QSO DB'!K59)","v":""},{"$f":"IF('QSO DB'!$D59=\"\",\"\",'QSO DB'!L59)","v":""},{"$f":"IF('QSO DB'!$D59=\"\",\"\",'QSO DB'!M59)","v":""},{"$f":"IF('QSO DB'!$D59=\"\",\"\",'QSO DB'!F59)","v":""},{"$f":"IF('QSO DB'!$D59=\"\",\"\",'QSO DB'!G59)","v":""},{"$f":"IF('QSO DB'!$D59=\"\",\"\",'QSO DB'!H59)","v":""}]
[{"$f":"IF('QSO DB'!$D60=\"\",\"\",'QSO DB'!A60)","v":""},{"$f":"IF('QSO DB'!$D60=\"\",\"\",'QSO DB'!B60)","v":""},{"$f":"IF('QSO DB'!$D60=\"\",\"\",'QSO DB'!D60)","v":""},{"$f":"IF('QSO DB'!$D60=\"\",\"\",'QSO DB'!E60)","v":""},{"$f":"IF('QSO DB'!$D60=\"\",\"\",'QSO DB'!I60)","v":""},{"$f":"IF('QSO DB'!$D60=\"\",\"\",'QSO DB'!J60)","v":""},{"$f":"IF('QSO DB'!$D60=\"\",\"\",'QSO DB'!K60)","v":""},{"$f":"IF('QSO DB'!$D60=\"\",\"\",'QSO DB'!L60)","v":""},{"$f":"IF('QSO DB'!$D60=\"\",\"\",'QSO DB'!M60)","v":""},{"$f":"IF('QSO DB'!$D60=\"\",\"\",'QSO DB'!F60)","v":""},{"$f":"IF('QSO DB'!$D60=\"\",\"\",'QSO DB'!G60)","v":""},{"$f":"IF('QSO DB'!$D60=\"\",\"\",'QSO DB'!H60)","v":""}]
[{"$f":"IF('QSO DB'!$D61=\"\",\"\",'QSO DB'!A61)","v":""},{"$f":"IF('QSO DB'!$D61=\"\",\"\",'QSO DB'!B61)","v":""},{"$f":"IF('QSO DB'!$D61=\"\",\"\",'QSO DB'!D61)","v":""},{"$f":"IF('QSO DB'!$D61=\"\",\"\",'QSO DB'!E61)","v":""},{"$f":"IF('QSO DB'!$D61=\"\",\"\",'QSO DB'!I61)","v":""},{"$f":"IF('QSO DB'!$D61=\"\",\"\",'QSO DB'!J61)","v":""},{"$f":"IF('QSO DB'!$D61=\"\",\"\",'QSO DB'!K61)","v":""},{"$f":"IF('QSO DB'!$D61=\"\",\"\",'QSO DB'!L61)","v":""},{"$f":"IF('QSO DB'!$D61=\"\",\"\",'QSO DB'!M61)","v":""},{"$f":"IF('QSO DB'!$D61=\"\",\"\",'QSO DB'!F61)","v":""},{"$f":"IF('QSO DB'!$D61=\"\",\"\",'QSO DB'!G61)","v":""},{"$f":"IF('QSO DB'!$D61=\"\",\"\",'QSO DB'!H61)","v":""}]
[{"$f":"IF('QSO DB'!$D62=\"\",\"\",'QSO DB'!A62)","v":""},{"$f":"IF('QSO DB'!$D62=\"\",\"\",'QSO DB'!B62)","v":""},{"$f":"IF('QSO DB'!$D62=\"\",\"\",'QSO DB'!D62)","v":""},{"$f":"IF('QSO DB'!$D62=\"\",\"\",'QSO DB'!E62)","v":""},{"$f":"IF('QSO DB'!$D62=\"\",\"\",'QSO DB'!I62)","v":""},{"$f":"IF('QSO DB'!$D62=\"\",\"\",'QSO DB'!J62)","v":""},{"$f":"IF('QSO DB'!$D62=\"\",\"\",'QSO DB'!K62)","v":""},{"$f":"IF('QSO DB'!$D62=\"\",\"\",'QSO DB'!L62)","v":""},{"$f":"IF('QSO DB'!$D62=\"\",\"\",'QSO DB'!M62)","v":""},{"$f":"IF('QSO DB'!$D62=\"\",\"\",'QSO DB'!F62)","v":""},{"$f":"IF('QSO DB'!$D62=\"\",\"\",'QSO DB'!G62)","v":""},{"$f":"IF('QSO DB'!$D62=\"\",\"\",'QSO DB'!H62)","v":""}]
[{"$f":"IF('QSO DB'!$D63=\"\",\"\",'QSO DB'!A63)","v":""},{"$f":"IF('QSO DB'!$D63=\"\",\"\",'QSO DB'!B63)","v":""},{"$f":"IF('QSO DB'!$D63=\"\",\"\",'QSO DB'!D63)","v":""},{"$f":"IF('QSO DB'!$D63=\"\",\"\",'QSO DB'!E63)","v":""},{"$f":"IF('QSO DB'!$D63=\"\",\"\",'QSO DB'!I63)","v":""},{"$f":"IF('QSO DB'!$D63=\"\",\"\",'QSO DB'!J63)","v":""},{"$f":"IF('QSO DB'!$D63=\"\",\"\",'QSO DB'!K63)","v":""},{"$f":"IF('QSO DB'!$D63=\"\",\"\",'QSO DB'!L63)","v":""},{"$f":"IF('QSO DB'!$D63=\"\",\"\",'QSO DB'!M63)","v":""},{"$f":"IF('QSO DB'!$D63=\"\",\"\",'QSO DB'!F63)","v":""},{"$f":"IF('QSO DB'!$D63=\"\",\"\",'QSO DB'!G63)","v":""},{"$f":"IF('QSO DB'!$D63=\"\",\"\",'QSO DB'!H63)","v":""}]
[{"$f":"IF('QSO DB'!$D64=\"\",\"\",'QSO DB'!A64)","v":""},{"$f":"IF('QSO DB'!$D64=\"\",\"\",'QSO DB'!B64)","v":""},{"$f":"IF('QSO DB'!$D64=\"\",\"\",'QSO DB'!D64)","v":""},{"$f":"IF('QSO DB'!$D64=\"\",\"\",'QSO DB'!E64)","v":""},{"$f":"IF('QSO DB'!$D64=\"\",\"\",'QSO DB'!I64)","v":""},{"$f":"IF('QSO DB'!$D64=\"\",\"\",'QSO DB'!J64)","v":""},{"$f":"IF('QSO DB'!$D64=\"\",\"\",'QSO DB'!K64)","v":""},{"$f":"IF('QSO DB'!$D64=\"\",\"\",'QSO DB'!L64)","v":""},{"$f":"IF('QSO DB'!$D64=\"\",\"\",'QSO DB'!M64)","v":""},{"$f":"IF('QSO DB'!$D64=\"\",\"\",'QSO DB'!F64)","v":""},{"$f":"IF('QSO DB'!$D64=\"\",\"\",'QSO DB'!G64)","v":""},{"$f":"IF('QSO DB'!$D64=\"\",\"\",'QSO DB'!H64)","v":""}]
[{"$f":"IF('QSO DB'!$D65=\"\",\"\",'QSO DB'!A65)","v":""},{"$f":"IF('QSO DB'!$D65=\"\",\"\",'QSO DB'!B65)","v":""},{"$f":"IF('QSO DB'!$D65=\"\",\"\",'QSO DB'!D65)","v":""},{"$f":"IF('QSO DB'!$D65=\"\",\"\",'QSO DB'!E65)","v":""},{"$f":"IF('QSO DB'!$D65=\"\",\"\",'QSO DB'!I65)","v":""},{"$f":"IF('QSO DB'!$D65=\"\",\"\",'QSO DB'!J65)","v":""},{"$f":"IF('QSO DB'!$D65=\"\",\"\",'QSO DB'!K65)","v":""},{"$f":"IF('QSO DB'!$D65=\"\",\"\",'QSO DB'!L65)","v":""},{"$f":"IF('QSO DB'!$D65=\"\",\"\",'QSO DB'!M65)","v":""},{"$f":"IF('QSO DB'!$D65=\"\",\"\",'QSO DB'!F65)","v":""},{"$f":"IF('QSO DB'!$D65=\"\",\"\",'QSO DB'!G65)","v":""},{"$f":"IF('QSO DB'!$D65=\"\",\"\",'QSO DB'!H65)","v":""}]
[{"$f":"IF('QSO DB'!$D66=\"\",\"\",'QSO DB'!A66)","v":""},{"$f":"IF('QSO DB'!$D66=\"\",\"\",'QSO DB'!B66)","v":""},{"$f":"IF('QSO DB'!$D66=\"\",\"\",'QSO DB'!D66)","v":""},{"$f":"IF('QSO DB'!$D66=\"\",\"\",'QSO DB'!E66)","v":""},{"$f":"IF('QSO DB'!$D66=\"\",\"\",'QSO DB'!I66)","v":""},{"$f":"IF('QSO DB'!$D66=\"\",\"\",'QSO DB'!J66)","v":""},{"$f":"IF('QSO DB'!$D66=\"\",\"\",'QSO DB'!K66)","v":""},{"$f":"IF('QSO DB'!$D66=\"\",\"\",'QSO DB'!L66)","v":""},{"$f":"IF('QSO DB'!$D66=\"\",\"\",'QSO DB'!M66)","v":""},{"$f":"IF('QSO DB'!$D66=\"\",\"\",'QSO DB'!F66)","v":""},{"$f":"IF('QSO DB'!$D66=\"\",\"\",'QSO DB'!G66)","v":""},{"$f":"IF('QSO DB'!$D66=\"\",\"\",'QSO DB'!H66)","v":""}]
[{"$f":"IF('QSO DB'!$D67=\"\",\"\",'QSO DB'!A67)","v":""},{"$f":"IF('QSO DB'!$D67=\"\",\"\",'QSO DB'!B67)","v":""},{"$f":"IF('QSO DB'!$D67=\"\",\"\",'QSO DB'!D67)","v":""},{"$f":"IF('QSO DB'!$D67=\"\",\"\",'QSO DB'!E67)","v":""},{"$f":"IF('QSO DB'!$D67=\"\",\"\",'QSO DB'!I67)","v":""},{"$f":"IF('QSO DB'!$D67=\"\",\"\",'QSO DB'!J67)","v":""},{"$f":"IF('QSO DB'!$D67=\"\",\"\",'QSO DB'!K67)","v":""},{"$f":"IF('QSO DB'!$D67=\"\",\"\",'QSO DB'!L67)","v":""},{"$f":"IF('QSO DB'!$D67=\"\",\"\",'QSO DB'!M67)","v":""},{"$f":"IF('QSO DB'!$D67=\"\",\"\",'QSO DB'!F67)","v":""},{"$f":"IF('QSO DB'!$D67=\"\",\"\",'QSO DB'!G67)","v":""},{"$f":"IF('QSO DB'!$D67=\"\",\"\",'QSO DB'!H67)","v":""}]
[{"$f":"IF('QSO DB'!$D68=\"\",\"\",'QSO DB'!A68)","v":""},{"$f":"IF('QSO DB'!$D68=\"\",\"\",'QSO DB'!B68)","v":""},{"$f":"IF('QSO DB'!$D68=\"\",\"\",'QSO DB'!D68)","v":""},{"$f":"IF('QSO DB'!$D68=\"\",\"\",'QSO DB'!E68)","v":""},{"$f":"IF('QSO DB'!$D68=\"\",\"\",'QSO DB'!I68)","v":""},{"$f":"IF('QSO DB'!$D68=\"\",\"\",'QSO DB'!J68)","v":""},{"$f":"IF('QSO DB'!$D68=\"\",\"\",'QSO DB'!K68)","v":""},{"$f":"IF('QSO DB'!$D68=\"\",\"\",'QSO DB'!L68)","v":""},{"$f":"IF('QSO DB'!$D68=\"\",\"\",'QSO DB'!M68)","v":""},{"$f":"IF('QSO DB'!$D68=\"\",\"\",'QSO DB'!F68)","v":""},{"$f":"IF('QSO DB'!$D68=\"\",\"\",'QSO DB'!G68)","v":""},{"$f":"IF('QSO DB'!$D68=\"\",\"\",'QSO DB'!H68)","v":""}]
[{"$f":"IF('QSO DB'!$D69=\"\",\"\",'QSO DB'!A69)","v":""},{"$f":"IF('QSO DB'!$D69=\"\",\"\",'QSO DB'!B69)","v":""},{"$f":"IF('QSO DB'!$D69=\"\",\"\",'QSO DB'!D69)","v":""},{"$f":"IF('QSO DB'!$D69=\"\",\"\",'QSO DB'!E69)","v":""},{"$f":"IF('QSO DB'!$D69=\"\",\"\",'QSO DB'!I69)","v":""},{"$f":"IF('QSO DB'!$D69=\"\",\"\",'QSO DB'!J69)","v":""},{"$f":"IF('QSO DB'!$D69=\"\",\"\",'QSO DB'!K69)","v":""},{"$f":"IF('QSO DB'!$D69=\"\",\"\",'QSO DB'!L69)","v":""},{"$f":"IF('QSO DB'!$D69=\"\",\"\",'QSO DB'!M69)","v":""},{"$f":"IF('QSO DB'!$D69=\"\",\"\",'QSO DB'!F69)","v":""},{"$f":"IF('QSO DB'!$D69=\"\",\"\",'QSO DB'!G69)","v":""},{"$f":"IF('QSO DB'!$D69=\"\",\"\",'QSO DB'!H69)","v":""}]
[{"$f":"IF('QSO DB'!$D70=\"\",\"\",'QSO DB'!A70)","v":""},{"$f":"IF('QSO DB'!$D70=\"\",\"\",'QSO DB'!B70)","v":""},{"$f":"IF('QSO DB'!$D70=\"\",\"\",'QSO DB'!D70)","v":""},{"$f":"IF('QSO DB'!$D70=\"\",\"\",'QSO DB'!E70)","v":""},{"$f":"IF('QSO DB'!$D70=\"\",\"\",'QSO DB'!I70)","v":""},{"$f":"IF('QSO DB'!$D70=\"\",\"\",'QSO DB'!J70)","v":""},{"$f":"IF('QSO DB'!$D70=\"\",\"\",'QSO DB'!K70)","v":""},{"$f":"IF('QSO DB'!$D70=\"\",\"\",'QSO DB'!L70)","v":""},{"$f":"IF('QSO DB'!$D70=\"\",\"\",'QSO DB'!M70)","v":""},{"$f":"IF('QSO DB'!$D70=\"\",\"\",'QSO DB'!F70)","v":""},{"$f":"IF('QSO DB'!$D70=\"\",\"\",'QSO DB'!G70)","v":""},{"$f":"IF('QSO DB'!$D70=\"\",\"\",'QSO DB'!H70)","v":""}]
[{"$f":"IF('QSO DB'!$D71=\"\",\"\",'QSO DB'!A71)","v":""},{"$f":"IF('QSO DB'!$D71=\"\",\"\",'QSO DB'!B71)","v":""},{"$f":"IF('QSO DB'!$D71=\"\",\"\",'QSO DB'!D71)","v":""},{"$f":"IF('QSO DB'!$D71=\"\",\"\",'QSO DB'!E71)","v":""},{"$f":"IF('QSO DB'!$D71=\"\",\"\",'QSO DB'!I71)","v":""},{"$f":"IF('QSO DB'!$D71=\"\",\"\",'QSO DB'!J71)","v":""},{"$f":"IF('QSO DB'!$D71=\"\",\"\",'QSO DB'!K71)","v":""},{"$f":"IF('QSO DB'!$D71=\"\",\"\",'QSO DB'!L71)","v":""},{"$f":"IF('QSO DB'!$D71=\"\",\"\",'QSO DB'!M71)","v":""},{"$f":"IF('QSO DB'!$D71=\"\",\"\",'QSO DB'!F71)","v":""},{"$f":"IF('QSO DB'!$D71=\"\",\"\",'QSO DB'!G71)","v":""},{"$f":"IF('QSO DB'!$D71=\"\",\"\",'QSO DB'!H71)","v":""}]
[{"$f":"IF('QSO DB'!$D72=\"\",\"\",'QSO DB'!A72)","v":""},{"$f":"IF('QSO DB'!$D72=\"\",\"\",'QSO DB'!B72)","v":""},{"$f":"IF('QSO DB'!$D72=\"\",\"\",'QSO DB'!D72)","v":""},{"$f":"IF('QSO DB'!$D72=\"\",\"\",'QSO DB'!E72)","v":""},{"$f":"IF('QSO DB'!$D72=\"\",\"\",'QSO DB'!I72)","v":""},{"$f":"IF('QSO DB'!$D72=\"\",\"\",'QSO DB'!J72)","v":""},{"$f":"IF('QSO DB'!$D72=\"\",\"\",'QSO DB'!K72)","v":""},{"$f":"IF('QSO DB'!$D72=\"\",\"\",'QSO DB'!L72)","v":""},{"$f":"IF('QSO DB'!$D72=\"\",\"\",'QSO DB'!M72)","v":""},{"$f":"IF('QSO DB'!$D72=\"\",\"\",'QSO DB'!F72)","v":""},{"$f":"IF('QSO DB'!$D72=\"\",\"\",'QSO DB'!G72)","v":""},{"$f":"IF('QSO DB'!$D72=\"\",\"\",'QSO DB'!H72)","v":""}]
[{"$f":"IF('QSO DB'!$D73=\"\",\"\",'QSO DB'!A73)","v":""},{"$f":"IF('QSO DB'!$D73=\"\",\"\",'QSO DB'!B73)","v":""},{"$f":"IF('QSO DB'!$D73=\"\",\"\",'QSO DB'!D73)","v":""},{"$f":"IF('QSO DB'!$D73=\"\",\"\",'QSO DB'!E73)","v":""},{"$f":"IF('QSO DB'!$D73=\"\",\"\",'QSO DB'!I73)","v":""},{"$f":"IF('QSO DB'!$D73=\"\",\"\",'QSO DB'!J73)","v":""},{"$f":"IF('QSO DB'!$D73=\"\",\"\",'QSO DB'!K73)","v":""},{"$f":"IF('QSO DB'!$D73=\"\",\"\",'QSO DB'!L73)","v":""},{"$f":"IF('QSO DB'!$D73=\"\",\"\",'QSO DB'!M73)","v":""},{"$f":"IF('QSO DB'!$D73=\"\",\"\",'QSO DB'!F73)","v":""},{"$f":"IF('QSO DB'!$D73=\"\",\"\",'QSO DB'!G73)","v":""},{"$f":"IF('QSO DB'!$D73=\"\",\"\",'QSO DB'!H73)","v":""}]
[{"$f":"IF('QSO DB'!$D74=\"\",\"\",'QSO DB'!A74)","v":""},{"$f":"IF('QSO DB'!$D74=\"\",\"\",'QSO DB'!B74)","v":""},{"$f":"IF('QSO DB'!$D74=\"\",\"\",'QSO DB'!D74)","v":""},{"$f":"IF('QSO DB'!$D74=\"\",\"\",'QSO DB'!E74)","v":""},{"$f":"IF('QSO DB'!$D74=\"\",\"\",'QSO DB'!I74)","v":""},{"$f":"IF('QSO DB'!$D74=\"\",\"\",'QSO DB'!J74)","v":""},{"$f":"IF('QSO DB'!$D74=\"\",\"\",'QSO DB'!K74)","v":""},{"$f":"IF('QSO DB'!$D74=\"\",\"\",'QSO DB'!L74)","v":""},{"$f":"IF('QSO DB'!$D74=\"\",\"\",'QSO DB'!M74)","v":""},{"$f":"IF('QSO DB'!$D74=\"\",\"\",'QSO DB'!F74)","v":""},{"$f":"IF('QSO DB'!$D74=\"\",\"\",'QSO DB'!G74)","v":""},{"$f":"IF('QSO DB'!$D74=\"\",\"\",'QSO DB'!H74)","v":""}]
[{"$f":"IF('QSO DB'!$D75=\"\",\"\",'QSO DB'!A75)","v":""},{"$f":"IF('QSO DB'!$D75=\"\",\"\",'QSO DB'!B75)","v":""},{"$f":"IF('QSO DB'!$D75=\"\",\"\",'QSO DB'!D75)","v":""},{"$f":"IF('QSO DB'!$D75=\"\",\"\",'QSO DB'!E75)","v":""},{"$f":"IF('QSO DB'!$D75=\"\",\"\",'QSO DB'!I75)","v":""},{"$f":"IF('QSO DB'!$D75=\"\",\"\",'QSO DB'!J75)","v":""},{"$f":"IF('QSO DB'!$D75=\"\",\"\",'QSO DB'!K75)","v":""},{"$f":"IF('QSO DB'!$D75=\"\",\"\",'QSO DB'!L75)","v":""},{"$f":"IF('QSO DB'!$D75=\"\",\"\",'QSO DB'!M75)","v":""},{"$f":"IF('QSO DB'!$D75=\"\",\"\",'QSO DB'!F75)","v":""},{"$f":"IF('QSO DB'!$D75=\"\",\"\",'QSO DB'!G75)","v":""},{"$f":"IF('QSO DB'!$D75=\"\",\"\",'QSO DB'!H75)","v":""}]
[{"$f":"IF('QSO DB'!$D76=\"\",\"\",'QSO DB'!A76)","v":""},{"$f":"IF('QSO DB'!$D76=\"\",\"\",'QSO DB'!B76)","v":""},{"$f":"IF('QSO DB'!$D76=\"\",\"\",'QSO DB'!D76)","v":""},{"$f":"IF('QSO DB'!$D76=\"\",\"\",'QSO DB'!E76)","v":""},{"$f":"IF('QSO DB'!$D76=\"\",\"\",'QSO DB'!I76)","v":""},{"$f":"IF('QSO DB'!$D76=\"\",\"\",'QSO DB'!J76)","v":""},{"$f":"IF('QSO DB'!$D76=\"\",\"\",'QSO DB'!K76)","v":""},{"$f":"IF('QSO DB'!$D76=\"\",\"\",'QSO DB'!L76)","v":""},{"$f":"IF('QSO DB'!$D76=\"\",\"\",'QSO DB'!M76)","v":""},{"$f":"IF('QSO DB'!$D76=\"\",\"\",'QSO DB'!F76)","v":""},{"$f":"IF('QSO DB'!$D76=\"\",\"\",'QSO DB'!G76)","v":""},{"$f":"IF('QSO DB'!$D76=\"\",\"\",'QSO DB'!H76)","v":""}]
[{"$f":"IF('QSO DB'!$D77=\"\",\"\",'QSO DB'!A77)","v":""},{"$f":"IF('QSO DB'!$D77=\"\",\"\",'QSO DB'!B77)","v":""},{"$f":"IF('QSO DB'!$D77=\"\",\"\",'QSO DB'!D77)","v":""},{"$f":"IF('QSO DB'!$D77=\"\",\"\",'QSO DB'!E77)","v":""},{"$f":"IF('QSO DB'!$D77=\"\",\"\",'QSO DB'!I77)","v":""},{"$f":"IF('QSO DB'!$D77=\"\",\"\",'QSO DB'!J77)","v":""},{"$f":"IF('QSO DB'!$D77=\"\",\"\",'QSO DB'!K77)","v":""},{"$f":"IF('QSO DB'!$D77=\"\",\"\",'QSO DB'!L77)","v":""},{"$f":"IF('QSO DB'!$D77=\"\",\"\",'QSO DB'!M77)","v":""},{"$f":"IF('QSO DB'!$D77=\"\",\"\",'QSO DB'!F77)","v":""},{"$f":"IF('QSO DB'!$D77=\"\",\"\",'QSO DB'!G77)","v":""},{"$f":"IF('QSO DB'!$D77=\"\",\"\",'QSO DB'!H77)","v":""}]
[{"$f":"IF('QSO DB'!$D78=\"\",\"\",'QSO DB'!A78)","v":""},{"$f":"IF('QSO DB'!$D78=\"\",\"\",'QSO DB'!B78)","v":""},{"$f":"IF('QSO DB'!$D78=\"\",\"\",'QSO DB'!D78)","v":""},{"$f":"IF('QSO DB'!$D78=\"\",\"\",'QSO DB'!E78)","v":""},{"$f":"IF('QSO DB'!$D78=\"\",\"\",'QSO DB'!I78)","v":""},{"$f":"IF('QSO DB'!$D78=\"\",\"\",'QSO DB'!J78)","v":""},{"$f":"IF('QSO DB'!$D78=\"\",\"\",'QSO DB'!K78)","v":""},{"$f":"IF('QSO DB'!$D78=\"\",\"\",'QSO DB'!L78)","v":""},{"$f":"IF('QSO DB'!$D78=\"\",\"\",'QSO DB'!M78)","v":""},{"$f":"IF('QSO DB'!$D78=\"\",\"\",'QSO DB'!F78)","v":""},{"$f":"IF('QSO DB'!$D78=\"\",\"\",'QSO DB'!G78)","v":""},{"$f":"IF('QSO DB'!$D78=\"\",\"\",'QSO DB'!H78)","v":""}]
[{"$f":"IF('QSO DB'!$D79=\"\",\"\",'QSO DB'!A79)","v":""},{"$f":"IF('QSO DB'!$D79=\"\",\"\",'QSO DB'!B79)","v":""},{"$f":"IF('QSO DB'!$D79=\"\",\"\",'QSO DB'!D79)","v":""},{"$f":"IF('QSO DB'!$D79=\"\",\"\",'QSO DB'!E79)","v":""},{"$f":"IF('QSO DB'!$D79=\"\",\"\",'QSO DB'!I79)","v":""},{"$f":"IF('QSO DB'!$D79=\"\",\"\",'QSO DB'!J79)","v":""},{"$f":"IF('QSO DB'!$D79=\"\",\"\",'QSO DB'!K79)","v":""},{"$f":"IF('QSO DB'!$D79=\"\",\"\",'QSO DB'!L79)","v":""},{"$f":"IF('QSO DB'!$D79=\"\",\"\",'QSO DB'!M79)","v":""},{"$f":"IF('QSO DB'!$D79=\"\",\"\",'QSO DB'!F79)","v":""},{"$f":"IF('QSO DB'!$D79=\"\",\"\",'QSO DB'!G79)","v":""},{"$f":"IF('QSO DB'!$D79=\"\",\"\",'QSO DB'!H79)","v":""}]
[{"$f":"IF('QSO DB'!$D80=\"\",\"\",'QSO DB'!A80)","v":""},{"$f":"IF('QSO DB'!$D80=\"\",\"\",'QSO DB'!B80)","v":""},{"$f":"IF('QSO DB'!$D80=\"\",\"\",'QSO DB'!D80)","v":""},{"$f":"IF('QSO DB'!$D80=\"\",\"\",'QSO DB'!E80)","v":""},{"$f":"IF('QSO DB'!$D80=\"\",\"\",'QSO DB'!I80)","v":""},{"$f":"IF('QSO DB'!$D80=\"\",\"\",'QSO DB'!J80)","v":""},{"$f":"IF('QSO DB'!$D80=\"\",\"\",'QSO DB'!K80)","v":""},{"$f":"IF('QSO DB'!$D80=\"\",\"\",'QSO DB'!L80)","v":""},{"$f":"IF('QSO DB'!$D80=\"\",\"\",'QSO DB'!M80)","v":""},{"$f":"IF('QSO DB'!$D80=\"\",\"\",'QSO DB'!F80)","v":""},{"$f":"IF('QSO DB'!$D80=\"\",\"\",'QSO DB'!G80)","v":""},{"$f":"IF('QSO DB'!$D80=\"\",\"\",'QSO DB'!H80)","v":""}]
[{"$f":"IF('QSO DB'!$D81=\"\",\"\",'QSO DB'!A81)","v":""},{"$f":"IF('QSO DB'!$D81=\"\",\"\",'QSO DB'!B81)","v":""},{"$f":"IF('QSO DB'!$D81=\"\",\"\",'QSO DB'!D81)","v":""},{"$f":"IF('QSO DB'!$D81=\"\",\"\",'QSO DB'!E81)","v":""},{"$f":"IF('QSO DB'!$D81=\"\",\"\",'QSO DB'!I81)","v":""},{"$f":"IF('QSO DB'!$D81=\"\",\"\",'QSO DB'!J81)","v":""},{"$f":"IF('QSO DB'!$D81=\"\",\"\",'QSO DB'!K81)","v":""},{"$f":"IF('QSO DB'!$D81=\"\",\"\",'QSO DB'!L81)","v":""},{"$f":"IF('QSO DB'!$D81=\"\",\"\",'QSO DB'!M81)","v":""},{"$f":"IF('QSO DB'!$D81=\"\",\"\",'QSO DB'!F81)","v":""},{"$f":"IF('QSO DB'!$D81=\"\",\"\",'QSO DB'!G81)","v":""},{"$f":"IF('QSO DB'!$D81=\"\",\"\",'QSO DB'!H81)","v":""}]
[{"$f":"IF('QSO DB'!$D82=\"\",\"\",'QSO DB'!A82)","v":""},{"$f":"IF('QSO DB'!$D82=\"\",\"\",'QSO DB'!B82)","v":""},{"$f":"IF('QSO DB'!$D82=\"\",\"\",'QSO DB'!D82)","v":""},{"$f":"IF('QSO DB'!$D82=\"\",\"\",'QSO DB'!E82)","v":""},{"$f":"IF('QSO DB'!$D82=\"\",\"\",'QSO DB'!I82)","v":""},{"$f":"IF('QSO DB'!$D82=\"\",\"\",'QSO DB'!J82)","v":""},{"$f":"IF('QSO DB'!$D82=\"\",\"\",'QSO DB'!K82)","v":""},{"$f":"IF('QSO DB'!$D82=\"\",\"\",'QSO DB'!L82)","v":""},{"$f":"IF('QSO DB'!$D82=\"\",\"\",'QSO DB'!M82)","v":""},{"$f":"IF('QSO DB'!$D82=\"\",\"\",'QSO DB'!F82)","v":""},{"$f":"IF('QSO DB'!$D82=\"\",\"\",'QSO DB'!G82)","v":""},{"$f":"IF('QSO DB'!$D82=\"\",\"\",'QSO DB'!H82)","v":""}]
[{"$f":"IF('QSO DB'!$D83=\"\",\"\",'QSO DB'!A83)","v":""},{"$f":"IF('QSO DB'!$D83=\"\",\"\",'QSO DB'!B83)","v":""},{"$f":"IF('QSO DB'!$D83=\"\",\"\",'QSO DB'!D83)","v":""},{"$f":"IF('QSO DB'!$D83=\"\",\"\",'QSO DB'!E83)","v":""},{"$f":"IF('QSO DB'!$D83=\"\",\"\",'QSO DB'!I83)","v":""},{"$f":"IF('QSO DB'!$D83=\"\",\"\",'QSO DB'!J83)","v":""},{"$f":"IF('QSO DB'!$D83=\"\",\"\",'QSO DB'!K83)","v":""},{"$f":"IF('QSO DB'!$D83=\"\",\"\",'QSO DB'!L83)","v":""},{"$f":"IF('QSO DB'!$D83=\"\",\"\",'QSO DB'!M83)","v":""},{"$f":"IF('QSO DB'!$D83=\"\",\"\",'QSO DB'!F83)","v":""},{"$f":"IF('QSO DB'!$D83=\"\",\"\",'QSO DB'!G83)","v":""},{"$f":"IF('QSO DB'!$D83=\"\",\"\",'QSO DB'!H83)","v":""}]
[{"$f":"IF('QSO DB'!$D84=\"\",\"\",'QSO DB'!A84)","v":""},{"$f":"IF('QSO DB'!$D84=\"\",\"\",'QSO DB'!B84)","v":""},{"$f":"IF('QSO DB'!$D84=\"\",\"\",'QSO DB'!D84)","v":""},{"$f":"IF('QSO DB'!$D84=\"\",\"\",'QSO DB'!E84)","v":""},{"$f":"IF('QSO DB'!$D84=\"\",\"\",'QSO DB'!I84)","v":""},{"$f":"IF('QSO DB'!$D84=\"\",\"\",'QSO DB'!J84)","v":""},{"$f":"IF('QSO DB'!$D84=\"\",\"\",'QSO DB'!K84)","v":""},{"$f":"IF('QSO DB'!$D84=\"\",\"\",'QSO DB'!L84)","v":""},{"$f":"IF('QSO DB'!$D84=\"\",\"\",'QSO DB'!M84)","v":""},{"$f":"IF('QSO DB'!$D84=\"\",\"\",'QSO DB'!F84)","v":""},{"$f":"IF('QSO DB'!$D84=\"\",\"\",'QSO DB'!G84)","v":""},{"$f":"IF('QSO DB'!$D84=\"\",\"\",'QSO DB'!H84)","v":""}]
[{"$f":"IF('QSO DB'!$D85=\"\",\"\",'QSO DB'!A85)","v":""},{"$f":"IF('QSO DB'!$D85=\"\",\"\",'QSO DB'!B85)","v":""},{"$f":"IF('QSO DB'!$D85=\"\",\"\",'QSO DB'!D85)","v":""},{"$f":"IF('QSO DB'!$D85=\"\",\"\",'QSO DB'!E85)","v":""},{"$f":"IF('QSO DB'!$D85=\"\",\"\",'QSO DB'!I85)","v":""},{"$f":"IF('QSO DB'!$D85=\"\",\"\",'QSO DB'!J85)","v":""},{"$f":"IF('QSO DB'!$D85=\"\",\"\",'QSO DB'!K85)","v":""},{"$f":"IF('QSO DB'!$D85=\"\",\"\",'QSO DB'!L85)","v":""},{"$f":"IF('QSO DB'!$D85=\"\",\"\",'QSO DB'!M85)","v":""},{"$f":"IF('QSO DB'!$D85=\"\",\"\",'QSO DB'!F85)","v":""},{"$f":"IF('QSO DB'!$D85=\"\",\"\",'QSO DB'!G85)","v":""},{"$f":"IF('QSO DB'!$D85=\"\",\"\",'QSO DB'!H85)","v":""}]
[{"$f":"IF('QSO DB'!$D86=\"\",\"\",'QSO DB'!A86)","v":""},{"$f":"IF('QSO DB'!$D86=\"\",\"\",'QSO DB'!B86)","v":""},{"$f":"IF('QSO DB'!$D86=\"\",\"\",'QSO DB'!D86)","v":""},{"$f":"IF('QSO DB'!$D86=\"\",\"\",'QSO DB'!E86)","v":""},{"$f":"IF('QSO DB'!$D86=\"\",\"\",'QSO DB'!I86)","v":""},{"$f":"IF('QSO DB'!$D86=\"\",\"\",'QSO DB'!J86)","v":""},{"$f":"IF('QSO DB'!$D86=\"\",\"\",'QSO DB'!K86)","v":""},{"$f":"IF('QSO DB'!$D86=\"\",\"\",'QSO DB'!L86)","v":""},{"$f":"IF('QSO DB'!$D86=\"\",\"\",'QSO DB'!M86)","v":""},{"$f":"IF('QSO DB'!$D86=\"\",\"\",'QSO DB'!F86)","v":""},{"$f":"IF('QSO DB'!$D86=\"\",\"\",'QSO DB'!G86)","v":""},{"$f":"IF('QSO DB'!$D86=\"\",\"\",'QSO DB'!H86)","v":""}]
[{"$f":"IF('QSO DB'!$D87=\"\",\"\",'QSO DB'!A87)","v":""},{"$f":"IF('QSO DB'!$D87=\"\",\"\",'QSO DB'!B87)","v":""},{"$f":"IF('QSO DB'!$D87=\"\",\"\",'QSO DB'!D87)","v":""},{"$f":"IF('QSO DB'!$D87=\"\",\"\",'QSO DB'!E87)","v":""},{"$f":"IF('QSO DB'!$D87=\"\",\"\",'QSO DB'!I87)","v":""},{"$f":"IF('QSO DB'!$D87=\"\",\"\",'QSO DB'!J87)","v":""},{"$f":"IF('QSO DB'!$D87=\"\",\"\",'QSO DB'!K87)","v":""},{"$f":"IF('QSO DB'!$D87=\"\",\"\",'QSO DB'!L87)","v":""},{"$f":"IF('QSO DB'!$D87=\"\",\"\",'QSO DB'!M87)","v":""},{"$f":"IF('QSO DB'!$D87=\"\",\"\",'QSO DB'!F87)","v":""},{"$f":"IF('QSO DB'!$D87=\"\",\"\",'QSO DB'!G87)","v":""},{"$f":"IF('QSO DB'!$D87=\"\",\"\",'QSO DB'!H87)","v":""}]
[{"$f":"IF('QSO DB'!$D88=\"\",\"\",'QSO DB'!A88)","v":""},{"$f":"IF('QSO DB'!$D88=\"\",\"\",'QSO DB'!B88)","v":""},{"$f":"IF('QSO DB'!$D88=\"\",\"\",'QSO DB'!D88)","v":""},{"$f":"IF('QSO DB'!$D88=\"\",\"\",'QSO DB'!E88)","v":""},{"$f":"IF('QSO DB'!$D88=\"\",\"\",'QSO DB'!I88)","v":""},{"$f":"IF('QSO DB'!$D88=\"\",\"\",'QSO DB'!J88)","v":""},{"$f":"IF('QSO DB'!$D88=\"\",\"\",'QSO DB'!K88)","v":""},{"$f":"IF('QSO DB'!$D88=\"\",\"\",'QSO DB'!L88)","v":""},{"$f":"IF('QSO DB'!$D88=\"\",\"\",'QSO DB'!M88)","v":""},{"$f":"IF('QSO DB'!$D88=\"\",\"\",'QSO DB'!F88)","v":""},{"$f":"IF('QSO DB'!$D88=\"\",\"\",'QSO DB'!G88)","v":""},{"$f":"IF('QSO DB'!$D88=\"\",\"\",'QSO DB'!H88)","v":""}]
[{"$f":"IF('QSO DB'!$D89=\"\",\"\",'QSO DB'!A89)","v":""},{"$f":"IF('QSO DB'!$D89=\"\",\"\",'QSO DB'!B89)","v":""},{"$f":"IF('QSO DB'!$D89=\"\",\"\",'QSO DB'!D89)","v":""},{"$f":"IF('QSO DB'!$D89=\"\",\"\",'QSO DB'!E89)","v":""},{"$f":"IF('QSO DB'!$D89=\"\",\"\",'QSO DB'!I89)","v":""},{"$f":"IF('QSO DB'!$D89=\"\",\"\",'QSO DB'!J89)","v":""},{"$f":"IF('QSO DB'!$D89=\"\",\"\",'QSO DB'!K89)","v":""},{"$f":"IF('QSO DB'!$D89=\"\",\"\",'QSO DB'!L89)","v":""},{"$f":"IF('QSO DB'!$D89=\"\",\"\",'QSO DB'!M89)","v":""},{"$f":"IF('QSO DB'!$D89=\"\",\"\",'QSO DB'!F89)","v":""},{"$f":"IF('QSO DB'!$D89=\"\",\"\",'QSO DB'!G89)","v":""},{"$f":"IF('QSO DB'!$D89=\"\",\"\",'QSO DB'!H89)","v":""}]
[{"$f":"IF('QSO DB'!$D90=\"\",\"\",'QSO DB'!A90)","v":""},{"$f":"IF('QSO DB'!$D90=\"\",\"\",'QSO DB'!B90)","v":""},{"$f":"IF('QSO DB'!$D90=\"\",\"\",'QSO DB'!D90)","v":""},{"$f":"IF('QSO DB'!$D90=\"\",\"\",'QSO DB'!E90)","v":""},{"$f":"IF('QSO DB'!$D90=\"\",\"\",'QSO DB'!I90)","v":""},{"$f":"IF('QSO DB'!$D90=\"\",\"\",'QSO DB'!J90)","v":""},{"$f":"IF('QSO DB'!$D90=\"\",\"\",'QSO DB'!K90)","v":""},{"$f":"IF('QSO DB'!$D90=\"\",\"\",'QSO DB'!L90)","v":""},{"$f":"IF('QSO DB'!$D90=\"\",\"\",'QSO DB'!M90)","v":""},{"$f":"IF('QSO DB'!$D90=\"\",\"\",'QSO DB'!F90)","v":""},{"$f":"IF('QSO DB'!$D90=\"\",\"\",'QSO DB'!G90)","v":""},{"$f":"IF('QSO DB'!$D90=\"\",\"\",'QSO DB'!H90)","v":""}]
[{"$f":"IF('QSO DB'!$D91=\"\",\"\",'QSO DB'!A91)","v":""},{"$f":"IF('QSO DB'!$D91=\"\",\"\",'QSO DB'!B91)","v":""},{"$f":"IF('QSO DB'!$D91=\"\",\"\",'QSO DB'!D91)","v":""},{"$f":"IF('QSO DB'!$D91=\"\",\"\",'QSO DB'!E91)","v":""},{"$f":"IF('QSO DB'!$D91=\"\",\"\",'QSO DB'!I91)","v":""},{"$f":"IF('QSO DB'!$D91=\"\",\"\",'QSO DB'!J91)","v":""},{"$f":"IF('QSO DB'!$D91=\"\",\"\",'QSO DB'!K91)","v":""},{"$f":"IF('QSO DB'!$D91=\"\",\"\",'QSO DB'!L91)","v":""},{"$f":"IF('QSO DB'!$D91=\"\",\"\",'QSO DB'!M91)","v":""},{"$f":"IF('QSO DB'!$D91=\"\",\"\",'QSO DB'!F91)","v":""},{"$f":"IF('QSO DB'!$D91=\"\",\"\",'QSO DB'!G91)","v":""},{"$f":"IF('QSO DB'!$D91=\"\",\"\",'QSO DB'!H91)","v":""}]
[{"$f":"IF('QSO DB'!$D92=\"\",\"\",'QSO DB'!A92)","v":""},{"$f":"IF('QSO DB'!$D92=\"\",\"\",'QSO DB'!B92)","v":""},{"$f":"IF('QSO DB'!$D92=\"\",\"\",'QSO DB'!D92)","v":""},{"$f":"IF('QSO DB'!$D92=\"\",\"\",'QSO DB'!E92)","v":""},{"$f":"IF('QSO DB'!$D92=\"\",\"\",'QSO DB'!I92)","v":""},{"$f":"IF('QSO DB'!$D92=\"\",\"\",'QSO DB'!J92)","v":""},{"$f":"IF('QSO DB'!$D92=\"\",\"\",'QSO DB'!K92)","v":""},{"$f":"IF('QSO DB'!$D92=\"\",\"\",'QSO DB'!L92)","v":""},{"$f":"IF('QSO DB'!$D92=\"\",\"\",'QSO DB'!M92)","v":""},{"$f":"IF('QSO DB'!$D92=\"\",\"\",'QSO DB'!F92)","v":""},{"$f":"IF('QSO DB'!$D92=\"\",\"\",'QSO DB'!G92)","v":""},{"$f":"IF('QSO DB'!$D92=\"\",\"\",'QSO DB'!H92)","v":""}]
[{"$f":"IF('QSO DB'!$D93=\"\",\"\",'QSO DB'!A93)","v":""},{"$f":"IF('QSO DB'!$D93=\"\",\"\",'QSO DB'!B93)","v":""},{"$f":"IF('QSO DB'!$D93=\"\",\"\",'QSO DB'!D93)","v":""},{"$f":"IF('QSO DB'!$D93=\"\",\"\",'QSO DB'!E93)","v":""},{"$f":"IF('QSO DB'!$D93=\"\",\"\",'QSO DB'!I93)","v":""},{"$f":"IF('QSO DB'!$D93=\"\",\"\",'QSO DB'!J93)","v":""},{"$f":"IF('QSO DB'!$D93=\"\",\"\",'QSO DB'!K93)","v":""},{"$f":"IF('QSO DB'!$D93=\"\",\"\",'QSO DB'!L93)","v":""},{"$f":"IF('QSO DB'!$D93=\"\",\"\",'QSO DB'!M93)","v":""},{"$f":"IF('QSO DB'!$D93=\"\",\"\",'QSO DB'!F93)","v":""},{"$f":"IF('QSO DB'!$D93=\"\",\"\",'QSO DB'!G93)","v":""},{"$f":"IF('QSO DB'!$D93=\"\",\"\",'QSO DB'!H93)","v":""}]
[{"$f":"IF('QSO DB'!$D94=\"\",\"\",'QSO DB'!A94)","v":""},{"$f":"IF('QSO DB'!$D94=\"\",\"\",'QSO DB'!B94)","v":""},{"$f":"IF('QSO DB'!$D94=\"\",\"\",'QSO DB'!D94)","v":""},{"$f":"IF('QSO DB'!$D94=\"\",\"\",'QSO DB'!E94)","v":""},{"$f":"IF('QSO DB'!$D94=\"\",\"\",'QSO DB'!I94)","v":""},{"$f":"IF('QSO DB'!$D94=\"\",\"\",'QSO DB'!J94)","v":""},{"$f":"IF('QSO DB'!$D94=\"\",\"\",'QSO DB'!K94)","v":""},{"$f":"IF('QSO DB'!$D94=\"\",\"\",'QSO DB'!L94)","v":""},{"$f":"IF('QSO DB'!$D94=\"\",\"\",'QSO DB'!M94)","v":""},{"$f":"IF('QSO DB'!$D94=\"\",\"\",'QSO DB'!F94)","v":""},{"$f":"IF('QSO DB'!$D94=\"\",\"\",'QSO DB'!G94)","v":""},{"$f":"IF('QSO DB'!$D94=\"\",\"\",'QSO DB'!H94)","v":""}]
[{"$f":"IF('QSO DB'!$D95=\"\",\"\",'QSO DB'!A95)","v":""},{"$f":"IF('QSO DB'!$D95=\"\",\"\",'QSO DB'!B95)","v":""},{"$f":"IF('QSO DB'!$D95=\"\",\"\",'QSO DB'!D95)","v":""},{"$f":"IF('QSO DB'!$D95=\"\",\"\",'QSO DB'!E95)","v":""},{"$f":"IF('QSO DB'!$D95=\"\",\"\",'QSO DB'!I95)","v":""},{"$f":"IF('QSO DB'!$D95=\"\",\"\",'QSO DB'!J95)","v":""},{"$f":"IF('QSO DB'!$D95=\"\",\"\",'QSO DB'!K95)","v":""},{"$f":"IF('QSO DB'!$D95=\"\",\"\",'QSO DB'!L95)","v":""},{"$f":"IF('QSO DB'!$D95=\"\",\"\",'QSO DB'!M95)","v":""},{"$f":"IF('QSO DB'!$D95=\"\",\"\",'QSO DB'!F95)","v":""},{"$f":"IF('QSO DB'!$D95=\"\",\"\",'QSO DB'!G95)","v":""},{"$f":"IF('QSO DB'!$D95=\"\",\"\",'QSO DB'!H95)","v":""}]
[{"$f":"IF('QSO DB'!$D96=\"\",\"\",'QSO DB'!A96)","v":""},{"$f":"IF('QSO DB'!$D96=\"\",\"\",'QSO DB'!B96)","v":""},{"$f":"IF('QSO DB'!$D96=\"\",\"\",'QSO DB'!D96)","v":""},{"$f":"IF('QSO DB'!$D96=\"\",\"\",'QSO DB'!E96)","v":""},{"$f":"IF('QSO DB'!$D96=\"\",\"\",'QSO DB'!I96)","v":""},{"$f":"IF('QSO DB'!$D96=\"\",\"\",'QSO DB'!J96)","v":""},{"$f":"IF('QSO DB'!$D96=\"\",\"\",'QSO DB'!K96)","v":""},{"$f":"IF('QSO DB'!$D96=\"\",\"\",'QSO DB'!L96)","v":""},{"$f":"IF('QSO DB'!$D96=\"\",\"\",'QSO DB'!M96)","v":""},{"$f":"IF('QSO DB'!$D96=\"\",\"\",'QSO DB'!F96)","v":""},{"$f":"IF('QSO DB'!$D96=\"\",\"\",'QSO DB'!G96)","v":""},{"$f":"IF('QSO DB'!$D96=\"\",\"\",'QSO DB'!H96)","v":""}]
[{"$f":"IF('QSO DB'!$D97=\"\",\"\",'QSO DB'!A97)","v":""},{"$f":"IF('QSO DB'!$D97=\"\",\"\",'QSO DB'!B97)","v":""},{"$f":"IF('QSO DB'!$D97=\"\",\"\",'QSO DB'!D97)","v":""},{"$f":"IF('QSO DB'!$D97=\"\",\"\",'QSO DB'!E97)","v":""},{"$f":"IF('QSO DB'!$D97=\"\",\"\",'QSO DB'!I97)","v":""},{"$f":"IF('QSO DB'!$D97=\"\",\"\",'QSO DB'!J97)","v":""},{"$f":"IF('QSO DB'!$D97=\"\",\"\",'QSO DB'!K97)","v":""},{"$f":"IF('QSO DB'!$D97=\"\",\"\",'QSO DB'!L97)","v":""},{"$f":"IF('QSO DB'!$D97=\"\",\"\",'QSO DB'!M97)","v":""},{"$f":"IF('QSO DB'!$D97=\"\",\"\",'QSO DB'!F97)","v":""},{"$f":"IF('QSO DB'!$D97=\"\",\"\",'QSO DB'!G97)","v":""},{"$f":"IF('QSO DB'!$D97=\"\",\"\",'QSO DB'!H97)","v":""}]
[{"$f":"IF('QSO DB'!$D98=\"\",\"\",'QSO DB'!A98)","v":""},{"$f":"IF('QSO DB'!$D98=\"\",\"\",'QSO DB'!B98)","v":""},{"$f":"IF('QSO DB'!$D98=\"\",\"\",'QSO DB'!D98)","v":""},{"$f":"IF('QSO DB'!$D98=\"\",\"\",'QSO DB'!E98)","v":""},{"$f":"IF('QSO DB'!$D98=\"\",\"\",'QSO DB'!I98)","v":""},{"$f":"IF('QSO DB'!$D98=\"\",\"\",'QSO DB'!J98)","v":""},{"$f":"IF('QSO DB'!$D98=\"\",\"\",'QSO DB'!K98)","v":""},{"$f":"IF('QSO DB'!$D98=\"\",\"\",'QSO DB'!L98)","v":""},{"$f":"IF('QSO DB'!$D98=\"\",\"\",'QSO DB'!M98)","v":""},{"$f":"IF('QSO DB'!$D98=\"\",\"\",'QSO DB'!F98)","v":""},{"$f":"IF('QSO DB'!$D98=\"\",\"\",'QSO DB'!G98)","v":""},{"$f":"IF('QSO DB'!$D98=\"\",\"\",'QSO DB'!H98)","v":""}]
[{"$f":"IF('QSO DB'!$D99=\"\",\"\",'QSO DB'!A99)","v":""},{"$f":"IF('QSO DB'!$D99=\"\",\"\",'QSO DB'!B99)","v":""},{"$f":"IF('QSO DB'!$D99=\"\",\"\",'QSO DB'!D99)","v":""},{"$f":"IF('QSO DB'!$D99=\"\",\"\",'QSO DB'!E99)","v":""},{"$f":"IF('QSO DB'!$D99=\"\",\"\",'QSO DB'!I99)","v":""},{"$f":"IF('QSO DB'!$D99=\"\",\"\",'QSO DB'!J99)","v":""},{"$f":"IF('QSO DB'!$D99=\"\",\"\",'QSO DB'!K99)","v":""},{"$f":"IF('QSO DB'!$D99=\"\",\"\",'QSO DB'!L99)","v":""},{"$f":"IF('QSO DB'!$D99=\"\",\"\",'QSO DB'!M99)","v":""},{"$f":"IF('QSO DB'!$D99=\"\",\"\",'QSO DB'!F99)","v":""},{"$f":"IF('QSO DB'!$D99=\"\",\"\",'QSO DB'!G99)","v":""},{"$f":"IF('QSO DB'!$D99=\"\",\"\",'QSO DB'!H99)","v":""}]
[{"$f":"IF('QSO DB'!$D100=\"\",\"\",'QSO DB'!A100)","v":""},{"$f":"IF('QSO DB'!$D100=\"\",\"\",'QSO DB'!B100)","v":""},{"$f":"IF('QSO DB'!$D100=\"\",\"\",'QSO DB'!D100)","v":""},{"$f":"IF('QSO DB'!$D100=\"\",\"\",'QSO DB'!E100)","v":""},{"$f":"IF('QSO DB'!$D100=\"\",\"\",'QSO DB'!I100)","v":""},{"$f":"IF('QSO DB'!$D100=\"\",\"\",'QSO DB'!J100)","v":""},{"$f":"IF('QSO DB'!$D100=\"\",\"\",'QSO DB'!K100)","v":""},{"$f":"IF('QSO DB'!$D100=\"\",\"\",'QSO DB'!L100)","v":""},{"$f":"IF('QSO DB'!$D100=\"\",\"\",'QSO DB'!M100)","v":""},{"$f":"IF('QSO DB'!$D100=\"\",\"\",'QSO DB'!F100)","v":""},{"$f":"IF('QSO DB'!$D100=\"\",\"\",'QSO DB'!G100)","v":""},{"$f":"IF('QSO DB'!$D100=\"\",\"\",'QSO DB'!H100)","v":""}]
[{"$f":"IF('QSO DB'!$D101=\"\",\"\",'QSO DB'!A101)","v":""},{"$f":"IF('QSO DB'!$D101=\"\",\"\",'QSO DB'!B101)","v":""},{"$f":"IF('QSO DB'!$D101=\"\",\"\",'QSO DB'!D101)","v":""},{"$f":"IF('QSO DB'!$D101=\"\",\"\",'QSO DB'!E101)","v":""},{"$f":"IF('QSO DB'!$D101=\"\",\"\",'QSO DB'!I101)","v":""},{"$f":"IF('QSO DB'!$D101=\"\",\"\",'QSO DB'!J101)","v":""},{"$f":"IF('QSO DB'!$D101=\"\",\"\",'QSO DB'!K101)","v":""},{"$f":"IF('QSO DB'!$D101=\"\",\"\",'QSO DB'!L101)","v":""},{"$f":"IF('QSO DB'!$D101=\"\",\"\",'QSO DB'!M101)","v":""},{"$f":"IF('QSO DB'!$D101=\"\",\"\",'QSO DB'!F101)","v":""},{"$f":"IF('QSO DB'!$D101=\"\",\"\",'QSO DB'!G101)","v":""},{"$f":"IF('QSO DB'!$D101=\"\",\"\",'QSO DB'!H101)","v":""}]
[{"$f":"IF('QSO DB'!$D102=\"\",\"\",'QSO DB'!A102)","v":""},{"$f":"IF('QSO DB'!$D102=\"\",\"\",'QSO DB'!B102)","v":""},{"$f":"IF('QSO DB'!$D102=\"\",\"\",'QSO DB'!D102)","v":""},{"$f":"IF('QSO DB'!$D102=\"\",\"\",'QSO DB'!E102)","v":""},{"$f":"IF('QSO DB'!$D102=\"\",\"\",'QSO DB'!I102)","v":""},{"$f":"IF('QSO DB'!$D102=\"\",\"\",'QSO DB'!J102)","v":""},{"$f":"IF('QSO DB'!$D102=\"\",\"\",'QSO DB'!K102)","v":""},{"$f":"IF('QSO DB'!$D102=\"\",\"\",'QSO DB'!L102)","v":""},{"$f":"IF('QSO DB'!$D102=\"\",\"\",'QSO DB'!M102)","v":""},{"$f":"IF('QSO DB'!$D102=\"\",\"\",'QSO DB'!F102)","v":""},{"$f":"IF('QSO DB'!$D102=\"\",\"\",'QSO DB'!G102)","v":""},{"$f":"IF('QSO DB'!$D102=\"\",\"\",'QSO DB'!H102)","v":""}]
[{"$f":"IF('QSO DB'!$D103=\"\",\"\",'QSO DB'!A103)","v":""},{"$f":"IF('QSO DB'!$D103=\"\",\"\",'QSO DB'!B103)","v":""},{"$f":"IF('QSO DB'!$D103=\"\",\"\",'QSO DB'!D103)","v":""},{"$f":"IF('QSO DB'!$D103=\"\",\"\",'QSO DB'!E103)","v":""},{"$f":"IF('QSO DB'!$D103=\"\",\"\",'QSO DB'!I103)","v":""},{"$f":"IF('QSO DB'!$D103=\"\",\"\",'QSO DB'!J103)","v":""},{"$f":"IF('QSO DB'!$D103=\"\",\"\",'QSO DB'!K103)","v":""},{"$f":"IF('QSO DB'!$D103=\"\",\"\",'QSO DB'!L103)","v":""},{"$f":"IF('QSO DB'!$D103=\"\",\"\",'QSO DB'!M103)","v":""},{"$f":"IF('QSO DB'!$D103=\"\",\"\",'QSO DB'!F103)","v":""},{"$f":"IF('QSO DB'!$D103=\"\",\"\",'QSO DB'!G103)","v":""},{"$f":"IF('QSO DB'!$D103=\"\",\"\",'QSO DB'!H103)","v":""}]
[{"$f":"IF('QSO DB'!$D104=\"\",\"\",'QSO DB'!A104)","v":""},{"$f":"IF('QSO DB'!$D104=\"\",\"\",'QSO DB'!B104)","v":""},{"$f":"IF('QSO DB'!$D104=\"\",\"\",'QSO DB'!D104)","v":""},{"$f":"IF('QSO DB'!$D104=\"\",\"\",'QSO DB'!E104)","v":""},{"$f":"IF('QSO DB'!$D104=\"\",\"\",'QSO DB'!I104)","v":""},{"$f":"IF('QSO DB'!$D104=\"\",\"\",'QSO DB'!J104)","v":""},{"$f":"IF('QSO DB'!$D104=\"\",\"\",'QSO DB'!K104)","v":""},{"$f":"IF('QSO DB'!$D104=\"\",\"\",'QSO DB'!L104)","v":""},{"$f":"IF('QSO DB'!$D104=\"\",\"\",'QSO DB'!M104)","v":""},{"$f":"IF('QSO DB'!$D104=\"\",\"\",'QSO DB'!F104)","v":""},{"$f":"IF('QSO DB'!$D104=\"\",\"\",'QSO DB'!G104)","v":""},{"$f":"IF('QSO DB'!$D104=\"\",\"\",'QSO DB'!H104)","v":""}]
[{"$f":"IF('QSO DB'!$D105=\"\",\"\",'QSO DB'!A105)","v":""},{"$f":"IF('QSO DB'!$D105=\"\",\"\",'QSO DB'!B105)","v":""},{"$f":"IF('QSO DB'!$D105=\"\",\"\",'QSO DB'!D105)","v":""},{"$f":"IF('QSO DB'!$D105=\"\",\"\",'QSO DB'!E105)","v":""},{"$f":"IF('QSO DB'!$D105=\"\",\"\",'QSO DB'!I105)","v":""},{"$f":"IF('QSO DB'!$D105=\"\",\"\",'QSO DB'!J105)","v":""},{"$f":"IF('QSO DB'!$D105=\"\",\"\",'QSO DB'!K105)","v":""},{"$f":"IF('QSO DB'!$D105=\"\",\"\",'QSO DB'!L105)","v":""},{"$f":"IF('QSO DB'!$D105=\"\",\"\",'QSO DB'!M105)","v":""},{"$f":"IF('QSO DB'!$D105=\"\",\"\",'QSO DB'!F105)","v":""},{"$f":"IF('QSO DB'!$D105=\"\",\"\",'QSO DB'!G105)","v":""},{"$f":"IF('QSO DB'!$D105=\"\",\"\",'QSO DB'!H105)","v":""}]
[{"$f":"IF('QSO DB'!$D106=\"\",\"\",'QSO DB'!A106)","v":""},{"$f":"IF('QSO DB'!$D106=\"\",\"\",'QSO DB'!B106)","v":""},{"$f":"IF('QSO DB'!$D106=\"\",\"\",'QSO DB'!D106)","v":""},{"$f":"IF('QSO DB'!$D106=\"\",\"\",'QSO DB'!E106)","v":""},{"$f":"IF('QSO DB'!$D106=\"\",\"\",'QSO DB'!I106)","v":""},{"$f":"IF('QSO DB'!$D106=\"\",\"\",'QSO DB'!J106)","v":""},{"$f":"IF('QSO DB'!$D106=\"\",\"\",'QSO DB'!K106)","v":""},{"$f":"IF('QSO DB'!$D106=\"\",\"\",'QSO DB'!L106)","v":""},{"$f":"IF('QSO DB'!$D106=\"\",\"\",'QSO DB'!M106)","v":""},{"$f":"IF('QSO DB'!$D106=\"\",\"\",'QSO DB'!F106)","v":""},{"$f":"IF('QSO DB'!$D106=\"\",\"\",'QSO DB'!G106)","v":""},{"$f":"IF('QSO DB'!$D106=\"\",\"\",'QSO DB'!H106)","v":""}]
[{"$f":"IF('QSO DB'!$D107=\"\",\"\",'QSO DB'!A107)","v":""},{"$f":"IF('QSO DB'!$D107=\"\",\"\",'QSO DB'!B107)","v":""},{"$f":"IF('QSO DB'!$D107=\"\",\"\",'QSO DB'!D107)","v":""},{"$f":"IF('QSO DB'!$D107=\"\",\"\",'QSO DB'!E107)","v":""},{"$f":"IF('QSO DB'!$D107=\"\",\"\",'QSO DB'!I107)","v":""},{"$f":"IF('QSO DB'!$D107=\"\",\"\",'QSO DB'!J107)","v":""},{"$f":"IF('QSO DB'!$D107=\"\",\"\",'QSO DB'!K107)","v":""},{"$f":"IF('QSO DB'!$D107=\"\",\"\",'QSO DB'!L107)","v":""},{"$f":"IF('QSO DB'!$D107=\"\",\"\",'QSO DB'!M107)","v":""},{"$f":"IF('QSO DB'!$D107=\"\",\"\",'QSO DB'!F107)","v":""},{"$f":"IF('QSO DB'!$D107=\"\",\"\",'QSO DB'!G107)","v":""},{"$f":"IF('QSO DB'!$D107=\"\",\"\",'QSO DB'!H107)","v":""}]
[{"$f":"IF('QSO DB'!$D108=\"\",\"\",'QSO DB'!A108)","v":""},{"$f":"IF('QSO DB'!$D108=\"\",\"\",'QSO DB'!B108)","v":""},{"$f":"IF('QSO DB'!$D108=\"\",\"\",'QSO DB'!D108)","v":""},{"$f":"IF('QSO DB'!$D108=\"\",\"\",'QSO DB'!E108)","v":""},{"$f":"IF('QSO DB'!$D108=\"\",\"\",'QSO DB'!I108)","v":""},{"$f":"IF('QSO DB'!$D108=\"\",\"\",'QSO DB'!J108)","v":""},{"$f":"IF('QSO DB'!$D108=\"\",\"\",'QSO DB'!K108)","v":""},{"$f":"IF('QSO DB'!$D108=\"\",\"\",'QSO DB'!L108)","v":""},{"$f":"IF('QSO DB'!$D108=\"\",\"\",'QSO DB'!M108)","v":""},{"$f":"IF('QSO DB'!$D108=\"\",\"\",'QSO DB'!F108)","v":""},{"$f":"IF('QSO DB'!$D108=\"\",\"\",'QSO DB'!G108)","v":""},{"$f":"IF('QSO DB'!$D108=\"\",\"\",'QSO DB'!H108)","v":""}]
[{"$f":"IF('QSO DB'!$D109=\"\",\"\",'QSO DB'!A109)","v":""},{"$f":"IF('QSO DB'!$D109=\"\",\"\",'QSO DB'!B109)","v":""},{"$f":"IF('QSO DB'!$D109=\"\",\"\",'QSO DB'!D109)","v":""},{"$f":"IF('QSO DB'!$D109=\"\",\"\",'QSO DB'!E109)","v":""},{"$f":"IF('QSO DB'!$D109=\"\",\"\",'QSO DB'!I109)","v":""},{"$f":"IF('QSO DB'!$D109=\"\",\"\",'QSO DB'!J109)","v":""},{"$f":"IF('QSO DB'!$D109=\"\",\"\",'QSO DB'!K109)","v":""},{"$f":"IF('QSO DB'!$D109=\"\",\"\",'QSO DB'!L109)","v":""},{"$f":"IF('QSO DB'!$D109=\"\",\"\",'QSO DB'!M109)","v":""},{"$f":"IF('QSO DB'!$D109=\"\",\"\",'QSO DB'!F109)","v":""},{"$f":"IF('QSO DB'!$D109=\"\",\"\",'QSO DB'!G109)","v":""},{"$f":"IF('QSO DB'!$D109=\"\",\"\",'QSO DB'!H109)","v":""}]
[{"$f":"IF('QSO DB'!$D110=\"\",\"\",'QSO DB'!A110)","v":""},{"$f":"IF('QSO DB'!$D110=\"\",\"\",'QSO DB'!B110)","v":""},{"$f":"IF('QSO DB'!$D110=\"\",\"\",'QSO DB'!D110)","v":""},{"$f":"IF('QSO DB'!$D110=\"\",\"\",'QSO DB'!E110)","v":""},{"$f":"IF('QSO DB'!$D110=\"\",\"\",'QSO DB'!I110)","v":""},{"$f":"IF('QSO DB'!$D110=\"\",\"\",'QSO DB'!J110)","v":""},{"$f":"IF('QSO DB'!$D110=\"\",\"\",'QSO DB'!K110)","v":""},{"$f":"IF('QSO DB'!$D110=\"\",\"\",'QSO DB'!L110)","v":""},{"$f":"IF('QSO DB'!$D110=\"\",\"\",'QSO DB'!M110)","v":""},{"$f":"IF('QSO DB'!$D110=\"\",\"\",'QSO DB'!F110)","v":""},{"$f":"IF('QSO DB'!$D110=\"\",\"\",'QSO DB'!G110)","v":""},{"$f":"IF('QSO DB'!$D110=\"\",\"\",'QSO DB'!H110)","v":""}]
[{"$f":"IF('QSO DB'!$D111=\"\",\"\",'QSO DB'!A111)","v":""},{"$f":"IF('QSO DB'!$D111=\"\",\"\",'QSO DB'!B111)","v":""},{"$f":"IF('QSO DB'!$D111=\"\",\"\",'QSO DB'!D111)","v":""},{"$f":"IF('QSO DB'!$D111=\"\",\"\",'QSO DB'!E111)","v":""},{"$f":"IF('QSO DB'!$D111=\"\",\"\",'QSO DB'!I111)","v":""},{"$f":"IF('QSO DB'!$D111=\"\",\"\",'QSO DB'!J111)","v":""},{"$f":"IF('QSO DB'!$D111=\"\",\"\",'QSO DB'!K111)","v":""},{"$f":"IF('QSO DB'!$D111=\"\",\"\",'QSO DB'!L111)","v":""},{"$f":"IF('QSO DB'!$D111=\"\",\"\",'QSO DB'!M111)","v":""},{"$f":"IF('QSO DB'!$D111=\"\",\"\",'QSO DB'!F111)","v":""},{"$f":"IF('QSO DB'!$D111=\"\",\"\",'QSO DB'!G111)","v":""},{"$f":"IF('QSO DB'!$D111=\"\",\"\",'QSO DB'!H111)","v":""}]
[{"$f":"IF('QSO DB'!$D112=\"\",\"\",'QSO DB'!A112)","v":""},{"$f":"IF('QSO DB'!$D112=\"\",\"\",'QSO DB'!B112)","v":""},{"$f":"IF('QSO DB'!$D112=\"\",\"\",'QSO DB'!D112)","v":""},{"$f":"IF('QSO DB'!$D112=\"\",\"\",'QSO DB'!E112)","v":""},{"$f":"IF('QSO DB'!$D112=\"\",\"\",'QSO DB'!I112)","v":""},{"$f":"IF('QSO DB'!$D112=\"\",\"\",'QSO DB'!J112)","v":""},{"$f":"IF('QSO DB'!$D112=\"\",\"\",'QSO DB'!K112)","v":""},{"$f":"IF('QSO DB'!$D112=\"\",\"\",'QSO DB'!L112)","v":""},{"$f":"IF('QSO DB'!$D112=\"\",\"\",'QSO DB'!M112)","v":""},{"$f":"IF('QSO DB'!$D112=\"\",\"\",'QSO DB'!F112)","v":""},{"$f":"IF('QSO DB'!$D112=\"\",\"\",'QSO DB'!G112)","v":""},{"$f":"IF('QSO DB'!$D112=\"\",\"\",'QSO DB'!H112)","v":""}]
[{"$f":"IF('QSO DB'!$D113=\"\",\"\",'QSO DB'!A113)","v":""},{"$f":"IF('QSO DB'!$D113=\"\",\"\",'QSO DB'!B113)","v":""},{"$f":"IF('QSO DB'!$D113=\"\",\"\",'QSO DB'!D113)","v":""},{"$f":"IF('QSO DB'!$D113=\"\",\"\",'QSO DB'!E113)","v":""},{"$f":"IF('QSO DB'!$D113=\"\",\"\",'QSO DB'!I113)","v":""},{"$f":"IF('QSO DB'!$D113=\"\",\"\",'QSO DB'!J113)","v":""},{"$f":"IF('QSO DB'!$D113=\"\",\"\",'QSO DB'!K113)","v":""},{"$f":"IF('QSO DB'!$D113=\"\",\"\",'QSO DB'!L113)","v":""},{"$f":"IF('QSO DB'!$D113=\"\",\"\",'QSO DB'!M113)","v":""},{"$f":"IF('QSO DB'!$D113=\"\",\"\",'QSO DB'!F113)","v":""},{"$f":"IF('QSO DB'!$D113=\"\",\"\",'QSO DB'!G113)","v":""},{"$f":"IF('QSO DB'!$D113=\"\",\"\",'QSO DB'!H113)","v":""}]
[{"$f":"IF('QSO DB'!$D114=\"\",\"\",'QSO DB'!A114)","v":""},{"$f":"IF('QSO DB'!$D114=\"\",\"\",'QSO DB'!B114)","v":""},{"$f":"IF('QSO DB'!$D114=\"\",\"\",'QSO DB'!D114)","v":""},{"$f":"IF('QSO DB'!$D114=\"\",\"\",'QSO DB'!E114)","v":""},{"$f":"IF('QSO DB'!$D114=\"\",\"\",'QSO DB'!I114)","v":""},{"$f":"IF('QSO DB'!$D114=\"\",\"\",'QSO DB'!J114)","v":""},{"$f":"IF('QSO DB'!$D114=\"\",\"\",'QSO DB'!K114)","v":""},{"$f":"IF('QSO DB'!$D114=\"\",\"\",'QSO DB'!L114)","v":""},{"$f":"IF('QSO DB'!$D114=\"\",\"\",'QSO DB'!M114)","v":""},{"$f":"IF('QSO DB'!$D114=\"\",\"\",'QSO DB'!F114)","v":""},{"$f":"IF('QSO DB'!$D114=\"\",\"\",'QSO DB'!G114)","v":""},{"$f":"IF('QSO DB'!$D114=\"\",\"\",'QSO DB'!H114)","v":""}]
[{"$f":"IF('QSO DB'!$D115=\"\",\"\",'QSO DB'!A115)","v":""},{"$f":"IF('QSO DB'!$D115=\"\",\"\",'QSO DB'!B115)","v":""},{"$f":"IF('QSO DB'!$D115=\"\",\"\",'QSO DB'!D115)","v":""},{"$f":"IF('QSO DB'!$D115=\"\",\"\",'QSO DB'!E115)","v":""},{"$f":"IF('QSO DB'!$D115=\"\",\"\",'QSO DB'!I115)","v":""},{"$f":"IF('QSO DB'!$D115=\"\",\"\",'QSO DB'!J115)","v":""},{"$f":"IF('QSO DB'!$D115=\"\",\"\",'QSO DB'!K115)","v":""},{"$f":"IF('QSO DB'!$D115=\"\",\"\",'QSO DB'!L115)","v":""},{"$f":"IF('QSO DB'!$D115=\"\",\"\",'QSO DB'!M115)","v":""},{"$f":"IF('QSO DB'!$D115=\"\",\"\",'QSO DB'!F115)","v":""},{"$f":"IF('QSO DB'!$D115=\"\",\"\",'QSO DB'!G115)","v":""},{"$f":"IF('QSO DB'!$D115=\"\",\"\",'QSO DB'!H115)","v":""}]
[{"$f":"IF('QSO DB'!$D116=\"\",\"\",'QSO DB'!A116)","v":""},{"$f":"IF('QSO DB'!$D116=\"\",\"\",'QSO DB'!B116)","v":""},{"$f":"IF('QSO DB'!$D116=\"\",\"\",'QSO DB'!D116)","v":""},{"$f":"IF('QSO DB'!$D116=\"\",\"\",'QSO DB'!E116)","v":""},{"$f":"IF('QSO DB'!$D116=\"\",\"\",'QSO DB'!I116)","v":""},{"$f":"IF('QSO DB'!$D116=\"\",\"\",'QSO DB'!J116)","v":""},{"$f":"IF('QSO DB'!$D116=\"\",\"\",'QSO DB'!K116)","v":""},{"$f":"IF('QSO DB'!$D116=\"\",\"\",'QSO DB'!L116)","v":""},{"$f":"IF('QSO DB'!$D116=\"\",\"\",'QSO DB'!M116)","v":""},{"$f":"IF('QSO DB'!$D116=\"\",\"\",'QSO DB'!F116)","v":""},{"$f":"IF('QSO DB'!$D116=\"\",\"\",'QSO DB'!G116)","v":""},{"$f":"IF('QSO DB'!$D116=\"\",\"\",'QSO DB'!H116)","v":""}]
[{"$f":"IF('QSO DB'!$D117=\"\",\"\",'QSO DB'!A117)","v":""},{"$f":"IF('QSO DB'!$D117=\"\",\"\",'QSO DB'!B117)","v":""},{"$f":"IF('QSO DB'!$D117=\"\",\"\",'QSO DB'!D117)","v":""},{"$f":"IF('QSO DB'!$D117=\"\",\"\",'QSO DB'!E117)","v":""},{"$f":"IF('QSO DB'!$D117=\"\",\"\",'QSO DB'!I117)","v":""},{"$f":"IF('QSO DB'!$D117=\"\",\"\",'QSO DB'!J117)","v":""},{"$f":"IF('QSO DB'!$D117=\"\",\"\",'QSO DB'!K117)","v":""},{"$f":"IF('QSO DB'!$D117=\"\",\"\",'QSO DB'!L117)","v":""},{"$f":"IF('QSO DB'!$D117=\"\",\"\",'QSO DB'!M117)","v":""},{"$f":"IF('QSO DB'!$D117=\"\",\"\",'QSO DB'!F117)","v":""},{"$f":"IF('QSO DB'!$D117=\"\",\"\",'QSO DB'!G117)","v":""},{"$f":"IF('QSO DB'!$D117=\"\",\"\",'QSO DB'!H117)","v":""}]
[{"$f":"IF('QSO DB'!$D118=\"\",\"\",'QSO DB'!A118)","v":""},{"$f":"IF('QSO DB'!$D118=\"\",\"\",'QSO DB'!B118)","v":""},{"$f":"IF('QSO DB'!$D118=\"\",\"\",'QSO DB'!D118)","v":""},{"$f":"IF('QSO DB'!$D118=\"\",\"\",'QSO DB'!E118)","v":""},{"$f":"IF('QSO DB'!$D118=\"\",\"\",'QSO DB'!I118)","v":""},{"$f":"IF('QSO DB'!$D118=\"\",\"\",'QSO DB'!J118)","v":""},{"$f":"IF('QSO DB'!$D118=\"\",\"\",'QSO DB'!K118)","v":""},{"$f":"IF('QSO DB'!$D118=\"\",\"\",'QSO DB'!L118)","v":""},{"$f":"IF('QSO DB'!$D118=\"\",\"\",'QSO DB'!M118)","v":""},{"$f":"IF('QSO DB'!$D118=\"\",\"\",'QSO DB'!F118)","v":""},{"$f":"IF('QSO DB'!$D118=\"\",\"\",'QSO DB'!G118)","v":""},{"$f":"IF('QSO DB'!$D118=\"\",\"\",'QSO DB'!H118)","v":""}]
[{"$f":"IF('QSO DB'!$D119=\"\",\"\",'QSO DB'!A119)","v":""},{"$f":"IF('QSO DB'!$D119=\"\",\"\",'QSO DB'!B119)","v":""},{"$f":"IF('QSO DB'!$D119=\"\",\"\",'QSO DB'!D119)","v":""},{"$f":"IF('QSO DB'!$D119=\"\",\"\",'QSO DB'!E119)","v":""},{"$f":"IF('QSO DB'!$D119=\"\",\"\",'QSO DB'!I119)","v":""},{"$f":"IF('QSO DB'!$D119=\"\",\"\",'QSO DB'!J119)","v":""},{"$f":"IF('QSO DB'!$D119=\"\",\"\",'QSO DB'!K119)","v":""},{"$f":"IF('QSO DB'!$D119=\"\",\"\",'QSO DB'!L119)","v":""},{"$f":"IF('QSO DB'!$D119=\"\",\"\",'QSO DB'!M119)","v":""},{"$f":"IF('QSO DB'!$D119=\"\",\"\",'QSO DB'!F119)","v":""},{"$f":"IF('QSO DB'!$D119=\"\",\"\",'QSO DB'!G119)","v":""},{"$f":"IF('QSO DB'!$D119=\"\",\"\",'QSO DB'!H119)","v":""}]
[{"$f":"IF('QSO DB'!$D120=\"\",\"\",'QSO DB'!A120)","v":""},{"$f":"IF('QSO DB'!$D120=\"\",\"\",'QSO DB'!B120)","v":""},{"$f":"IF('QSO DB'!$D120=\"\",\"\",'QSO DB'!D120)","v":""},{"$f":"IF('QSO DB'!$D120=\"\",\"\",'QSO DB'!E120)","v":""},{"$f":"IF('QSO DB'!$D120=\"\",\"\",'QSO DB'!I120)","v":""},{"$f":"IF('QSO DB'!$D120=\"\",\"\",'QSO DB'!J120)","v":""},{"$f":"IF('QSO DB'!$D120=\"\",\"\",'QSO DB'!K120)","v":""},{"$f":"IF('QSO DB'!$D120=\"\",\"\",'QSO DB'!L120)","v":""},{"$f":"IF('QSO DB'!$D120=\"\",\"\",'QSO DB'!M120)","v":""},{"$f":"IF('QSO DB'!$D120=\"\",\"\",'QSO DB'!F120)","v":""},{"$f":"IF('QSO DB'!$D120=\"\",\"\",'QSO DB'!G120)","v":""},{"$f":"IF('QSO DB'!$D120=\"\",\"\",'QSO DB'!H120)","v":""}]
[{"$f":"IF('QSO DB'!$D121=\"\",\"\",'QSO DB'!A121)","v":""},{"$f":"IF('QSO DB'!$D121=\"\",\"\",'QSO DB'!B121)","v":""},{"$f":"IF('QSO DB'!$D121=\"\",\"\",'QSO DB'!D121)","v":""},{"$f":"IF('QSO DB'!$D121=\"\",\"\",'QSO DB'!E121)","v":""},{"$f":"IF('QSO DB'!$D121=\"\",\"\",'QSO DB'!I121)","v":""},{"$f":"IF('QSO DB'!$D121=\"\",\"\",'QSO DB'!J121)","v":""},{"$f":"IF('QSO DB'!$D121=\"\",\"\",'QSO DB'!K121)","v":""},{"$f":"IF('QSO DB'!$D121=\"\",\"\",'QSO DB'!L121)","v":""},{"$f":"IF('QSO DB'!$D121=\"\",\"\",'QSO DB'!M121)","v":""},{"$f":"IF('QSO DB'!$D121=\"\",\"\",'QSO DB'!F121)","v":""},{"$f":"IF('QSO DB'!$D121=\"\",\"\",'QSO DB'!G121)","v":""},{"$f":"IF('QSO DB'!$D121=\"\",\"\",'QSO DB'!H121)","v":""}]
[{"$f":"IF('QSO DB'!$D122=\"\",\"\",'QSO DB'!A122)","v":""},{"$f":"IF('QSO DB'!$D122=\"\",\"\",'QSO DB'!B122)","v":""},{"$f":"IF('QSO DB'!$D122=\"\",\"\",'QSO DB'!D122)","v":""},{"$f":"IF('QSO DB'!$D122=\"\",\"\",'QSO DB'!E122)","v":""},{"$f":"IF('QSO DB'!$D122=\"\",\"\",'QSO DB'!I122)","v":""},{"$f":"IF('QSO DB'!$D122=\"\",\"\",'QSO DB'!J122)","v":""},{"$f":"IF('QSO DB'!$D122=\"\",\"\",'QSO DB'!K122)","v":""},{"$f":"IF('QSO DB'!$D122=\"\",\"\",'QSO DB'!L122)","v":""},{"$f":"IF('QSO DB'!$D122=\"\",\"\",'QSO DB'!M122)","v":""},{"$f":"IF('QSO DB'!$D122=\"\",\"\",'QSO DB'!F122)","v":""},{"$f":"IF('QSO DB'!$D122=\"\",\"\",'QSO DB'!G122)","v":""},{"$f":"IF('QSO DB'!$D122=\"\",\"\",'QSO DB'!H122)","v":""}]
[{"$f":"IF('QSO DB'!$D123=\"\",\"\",'QSO DB'!A123)","v":""},{"$f":"IF('QSO DB'!$D123=\"\",\"\",'QSO DB'!B123)","v":""},{"$f":"IF('QSO DB'!$D123=\"\",\"\",'QSO DB'!D123)","v":""},{"$f":"IF('QSO DB'!$D123=\"\",\"\",'QSO DB'!E123)","v":""},{"$f":"IF('QSO DB'!$D123=\"\",\"\",'QSO DB'!I123)","v":""},{"$f":"IF('QSO DB'!$D123=\"\",\"\",'QSO DB'!J123)","v":""},{"$f":"IF('QSO DB'!$D123=\"\",\"\",'QSO DB'!K123)","v":""},{"$f":"IF('QSO DB'!$D123=\"\",\"\",'QSO DB'!L123)","v":""},{"$f":"IF('QSO DB'!$D123=\"\",\"\",'QSO DB'!M123)","v":""},{"$f":"IF('QSO DB'!$D123=\"\",\"\",'QSO DB'!F123)","v":""},{"$f":"IF('QSO DB'!$D123=\"\",\"\",'QSO DB'!G123)","v":""},{"$f":"IF('QSO DB'!$D123=\"\",\"\",'QSO DB'!H123)","v":""}]
[{"$f":"IF('QSO DB'!$D124=\"\",\"\",'QSO DB'!A124)","v":""},{"$f":"IF('QSO DB'!$D124=\"\",\"\",'QSO DB'!B124)","v":""},{"$f":"IF('QSO DB'!$D124=\"\",\"\",'QSO DB'!D124)","v":""},{"$f":"IF('QSO DB'!$D124=\"\",\"\",'QSO DB'!E124)","v":""},{"$f":"IF('QSO DB'!$D124=\"\",\"\",'QSO DB'!I124)","v":""},{"$f":"IF('QSO DB'!$D124=\"\",\"\",'QSO DB'!J124)","v":""},{"$f":"IF('QSO DB'!$D124=\"\",\"\",'QSO DB'!K124)","v":""},{"$f":"IF('QSO DB'!$D124=\"\",\"\",'QSO DB'!L124)","v":""},{"$f":"IF('QSO DB'!$D124=\"\",\"\",'QSO DB'!M124)","v":""},{"$f":"IF('QSO DB'!$D124=\"\",\"\",'QSO DB'!F124)","v":""},{"$f":"IF('QSO DB'!$D124=\"\",\"\",'QSO DB'!G124)","v":""},{"$f":"IF('QSO DB'!$D124=\"\",\"\",'QSO DB'!H124)","v":""}]
[{"$f":"IF('QSO DB'!$D125=\"\",\"\",'QSO DB'!A125)","v":""},{"$f":"IF('QSO DB'!$D125=\"\",\"\",'QSO DB'!B125)","v":""},{"$f":"IF('QSO DB'!$D125=\"\",\"\",'QSO DB'!D125)","v":""},{"$f":"IF('QSO DB'!$D125=\"\",\"\",'QSO DB'!E125)","v":""},{"$f":"IF('QSO DB'!$D125=\"\",\"\",'QSO DB'!I125)","v":""},{"$f":"IF('QSO DB'!$D125=\"\",\"\",'QSO DB'!J125)","v":""},{"$f":"IF('QSO DB'!$D125=\"\",\"\",'QSO DB'!K125)","v":""},{"$f":"IF('QSO DB'!$D125=\"\",\"\",'QSO DB'!L125)","v":""},{"$f":"IF('QSO DB'!$D125=\"\",\"\",'QSO DB'!M125)","v":""},{"$f":"IF('QSO DB'!$D125=\"\",\"\",'QSO DB'!F125)","v":""},{"$f":"IF('QSO DB'!$D125=\"\",\"\",'QSO DB'!G125)","v":""},{"$f":"IF('QSO DB'!$D125=\"\",\"\",'QSO DB'!H125)","v":""}]
[{"$f":"IF('QSO DB'!$D126=\"\",\"\",'QSO DB'!A126)","v":""},{"$f":"IF('QSO DB'!$D126=\"\",\"\",'QSO DB'!B126)","v":""},{"$f":"IF('QSO DB'!$D126=\"\",\"\",'QSO DB'!D126)","v":""},{"$f":"IF('QSO DB'!$D126=\"\",\"\",'QSO DB'!E126)","v":""},{"$f":"IF('QSO DB'!$D126=\"\",\"\",'QSO DB'!I126)","v":""},{"$f":"IF('QSO DB'!$D126=\"\",\"\",'QSO DB'!J126)","v":""},{"$f":"IF('QSO DB'!$D126=\"\",\"\",'QSO DB'!K126)","v":""},{"$f":"IF('QSO DB'!$D126=\"\",\"\",'QSO DB'!L126)","v":""},{"$f":"IF('QSO DB'!$D126=\"\",\"\",'QSO DB'!M126)","v":""},{"$f":"IF('QSO DB'!$D126=\"\",\"\",'QSO DB'!F126)","v":""},{"$f":"IF('QSO DB'!$D126=\"\",\"\",'QSO DB'!G126)","v":""},{"$f":"IF('QSO DB'!$D126=\"\",\"\",'QSO DB'!H126)","v":""}]
[{"$f":"IF('QSO DB'!$D127=\"\",\"\",'QSO DB'!A127)","v":""},{"$f":"IF('QSO DB'!$D127=\"\",\"\",'QSO DB'!B127)","v":""},{"$f":"IF('QSO DB'!$D127=\"\",\"\",'QSO DB'!D127)","v":""},{"$f":"IF('QSO DB'!$D127=\"\",\"\",'QSO DB'!E127)","v":""},{"$f":"IF('QSO DB'!$D127=\"\",\"\",'QSO DB'!I127)","v":""},{"$f":"IF('QSO DB'!$D127=\"\",\"\",'QSO DB'!J127)","v":""},{"$f":"IF('QSO DB'!$D127=\"\",\"\",'QSO DB'!K127)","v":""},{"$f":"IF('QSO DB'!$D127=\"\",\"\",'QSO DB'!L127)","v":""},{"$f":"IF('QSO DB'!$D127=\"\",\"\",'QSO DB'!M127)","v":""},{"$f":"IF('QSO DB'!$D127=\"\",\"\",'QSO DB'!F127)","v":""},{"$f":"IF('QSO DB'!$D127=\"\",\"\",'QSO DB'!G127)","v":""},{"$f":"IF('QSO DB'!$D127=\"\",\"\",'QSO DB'!H127)","v":""}]
[{"$f":"IF('QSO DB'!$D128=\"\",\"\",'QSO DB'!A128)","v":""},{"$f":"IF('QSO DB'!$D128=\"\",\"\",'QSO DB'!B128)","v":""},{"$f":"IF('QSO DB'!$D128=\"\",\"\",'QSO DB'!D128)","v":""},{"$f":"IF('QSO DB'!$D128=\"\",\"\",'QSO DB'!E128)","v":""},{"$f":"IF('QSO DB'!$D128=\"\",\"\",'QSO DB'!I128)","v":""},{"$f":"IF('QSO DB'!$D128=\"\",\"\",'QSO DB'!J128)","v":""},{"$f":"IF('QSO DB'!$D128=\"\",\"\",'QSO DB'!K128)","v":""},{"$f":"IF('QSO DB'!$D128=\"\",\"\",'QSO DB'!L128)","v":""},{"$f":"IF('QSO DB'!$D128=\"\",\"\",'QSO DB'!M128)","v":""},{"$f":"IF('QSO DB'!$D128=\"\",\"\",'QSO DB'!F128)","v":""},{"$f":"IF('QSO DB'!$D128=\"\",\"\",'QSO DB'!G128)","v":""},{"$f":"IF('QSO DB'!$D128=\"\",\"\",'QSO DB'!H128)","v":""}]
[{"$f":"IF('QSO DB'!$D129=\"\",\"\",'QSO DB'!A129)","v":""},{"$f":"IF('QSO DB'!$D129=\"\",\"\",'QSO DB'!B129)","v":""},{"$f":"IF('QSO DB'!$D129=\"\",\"\",'QSO DB'!D129)","v":""},{"$f":"IF('QSO DB'!$D129=\"\",\"\",'QSO DB'!E129)","v":""},{"$f":"IF('QSO DB'!$D129=\"\",\"\",'QSO DB'!I129)","v":""},{"$f":"IF('QSO DB'!$D129=\"\",\"\",'QSO DB'!J129)","v":""},{"$f":"IF('QSO DB'!$D129=\"\",\"\",'QSO DB'!K129)","v":""},{"$f":"IF('QSO DB'!$D129=\"\",\"\",'QSO DB'!L129)","v":""},{"$f":"IF('QSO DB'!$D129=\"\",\"\",'QSO DB'!M129)","v":""},{"$f":"IF('QSO DB'!$D129=\"\",\"\",'QSO DB'!F129)","v":""},{"$f":"IF('QSO DB'!$D129=\"\",\"\",'QSO DB'!G129)","v":""},{"$f":"IF('QSO DB'!$D129=\"\",\"\",'QSO DB'!H129)","v":""}]
[{"$f":"IF('QSO DB'!$D130=\"\",\"\",'QSO DB'!A130)","v":""},{"$f":"IF('QSO DB'!$D130=\"\",\"\",'QSO DB'!B130)","v":""},{"$f":"IF('QSO DB'!$D130=\"\",\"\",'QSO DB'!D130)","v":""},{"$f":"IF('QSO DB'!$D130=\"\",\"\",'QSO DB'!E130)","v":""},{"$f":"IF('QSO DB'!$D130=\"\",\"\",'QSO DB'!I130)","v":""},{"$f":"IF('QSO DB'!$D130=\"\",\"\",'QSO DB'!J130)","v":""},{"$f":"IF('QSO DB'!$D130=\"\",\"\",'QSO DB'!K130)","v":""},{"$f":"IF('QSO DB'!$D130=\"\",\"\",'QSO DB'!L130)","v":""},{"$f":"IF('QSO DB'!$D130=\"\",\"\",'QSO DB'!M130)","v":""},{"$f":"IF('QSO DB'!$D130=\"\",\"\",'QSO DB'!F130)","v":""},{"$f":"IF('QSO DB'!$D130=\"\",\"\",'QSO DB'!G130)","v":""},{"$f":"IF('QSO DB'!$D130=\"\",\"\",'QSO DB'!H130)","v":""}]
[{"$f":"IF('QSO DB'!$D131=\"\",\"\",'QSO DB'!A131)","v":""},{"$f":"IF('QSO DB'!$D131=\"\",\"\",'QSO DB'!B131)","v":""},{"$f":"IF('QSO DB'!$D131=\"\",\"\",'QSO DB'!D131)","v":""},{"$f":"IF('QSO DB'!$D131=\"\",\"\",'QSO DB'!E131)","v":""},{"$f":"IF('QSO DB'!$D131=\"\",\"\",'QSO DB'!I131)","v":""},{"$f":"IF('QSO DB'!$D131=\"\",\"\",'QSO DB'!J131)","v":""},{"$f":"IF('QSO DB'!$D131=\"\",\"\",'QSO DB'!K131)","v":""},{"$f":"IF('QSO DB'!$D131=\"\",\"\",'QSO DB'!L131)","v":""},{"$f":"IF('QSO DB'!$D131=\"\",\"\",'QSO DB'!M131)","v":""},{"$f":"IF('QSO DB'!$D131=\"\",\"\",'QSO DB'!F131)","v":""},{"$f":"IF('QSO DB'!$D131=\"\",\"\",'QSO DB'!G131)","v":""},{"$f":"IF('QSO DB'!$D131=\"\",\"\",'QSO DB'!H131)","v":""}]
[{"$f":"IF('QSO DB'!$D132=\"\",\"\",'QSO DB'!A132)","v":""},{"$f":"IF('QSO DB'!$D132=\"\",\"\",'QSO DB'!B132)","v":""},{"$f":"IF('QSO DB'!$D132=\"\",\"\",'QSO DB'!D132)","v":""},{"$f":"IF('QSO DB'!$D132=\"\",\"\",'QSO DB'!E132)","v":""},{"$f":"IF('QSO DB'!$D132=\"\",\"\",'QSO DB'!I132)","v":""},{"$f":"IF('QSO DB'!$D132=\"\",\"\",'QSO DB'!J132)","v":""},{"$f":"IF('QSO DB'!$D132=\"\",\"\",'QSO DB'!K132)","v":""},{"$f":"IF('QSO DB'!$D132=\"\",\"\",'QSO DB'!L132)","v":""},{"$f":"IF('QSO DB'!$D132=\"\",\"\",'QSO DB'!M132)","v":""},{"$f":"IF('QSO DB'!$D132=\"\",\"\",'QSO DB'!F132)","v":""},{"$f":"IF('QSO DB'!$D132=\"\",\"\",'QSO DB'!G132)","v":""},{"$f":"IF('QSO DB'!$D132=\"\",\"\",'QSO DB'!H132)","v":""}]
[{"$f":"IF('QSO DB'!$D133=\"\",\"\",'QSO DB'!A133)","v":""},{"$f":"IF('QSO DB'!$D133=\"\",\"\",'QSO DB'!B133)","v":""},{"$f":"IF('QSO DB'!$D133=\"\",\"\",'QSO DB'!D133)","v":""},{"$f":"IF('QSO DB'!$D133=\"\",\"\",'QSO DB'!E133)","v":""},{"$f":"IF('QSO DB'!$D133=\"\",\"\",'QSO DB'!I133)","v":""},{"$f":"IF('QSO DB'!$D133=\"\",\"\",'QSO DB'!J133)","v":""},{"$f":"IF('QSO DB'!$D133=\"\",\"\",'QSO DB'!K133)","v":""},{"$f":"IF('QSO DB'!$D133=\"\",\"\",'QSO DB'!L133)","v":""},{"$f":"IF('QSO DB'!$D133=\"\",\"\",'QSO DB'!M133)","v":""},{"$f":"IF('QSO DB'!$D133=\"\",\"\",'QSO DB'!F133)","v":""},{"$f":"IF('QSO DB'!$D133=\"\",\"\",'QSO DB'!G133)","v":""},{"$f":"IF('QSO DB'!$D133=\"\",\"\",'QSO DB'!H133)","v":""}]
[{"$f":"IF('QSO DB'!$D134=\"\",\"\",'QSO DB'!A134)","v":""},{"$f":"IF('QSO DB'!$D134=\"\",\"\",'QSO DB'!B134)","v":""},{"$f":"IF('QSO DB'!$D134=\"\",\"\",'QSO DB'!D134)","v":""},{"$f":"IF('QSO DB'!$D134=\"\",\"\",'QSO DB'!E134)","v":""},{"$f":"IF('QSO DB'!$D134=\"\",\"\",'QSO DB'!I134)","v":""},{"$f":"IF('QSO DB'!$D134=\"\",\"\",'QSO DB'!J134)","v":""},{"$f":"IF('QSO DB'!$D134=\"\",\"\",'QSO DB'!K134)","v":""},{"$f":"IF('QSO DB'!$D134=\"\",\"\",'QSO DB'!L134)","v":""},{"$f":"IF('QSO DB'!$D134=\"\",\"\",'QSO DB'!M134)","v":""},{"$f":"IF('QSO DB'!$D134=\"\",\"\",'QSO DB'!F134)","v":""},{"$f":"IF('QSO DB'!$D134=\"\",\"\",'QSO DB'!G134)","v":""},{"$f":"IF('QSO DB'!$D134=\"\",\"\",'QSO DB'!H134)","v":""}]
[{"$f":"IF('QSO DB'!$D135=\"\",\"\",'QSO DB'!A135)","v":""},{"$f":"IF('QSO DB'!$D135=\"\",\"\",'QSO DB'!B135)","v":""},{"$f":"IF('QSO DB'!$D135=\"\",\"\",'QSO DB'!D135)","v":""},{"$f":"IF('QSO DB'!$D135=\"\",\"\",'QSO DB'!E135)","v":""},{"$f":"IF('QSO DB'!$D135=\"\",\"\",'QSO DB'!I135)","v":""},{"$f":"IF('QSO DB'!$D135=\"\",\"\",'QSO DB'!J135)","v":""},{"$f":"IF('QSO DB'!$D135=\"\",\"\",'QSO DB'!K135)","v":""},{"$f":"IF('QSO DB'!$D135=\"\",\"\",'QSO DB'!L135)","v":""},{"$f":"IF('QSO DB'!$D135=\"\",\"\",'QSO DB'!M135)","v":""},{"$f":"IF('QSO DB'!$D135=\"\",\"\",'QSO DB'!F135)","v":""},{"$f":"IF('QSO DB'!$D135=\"\",\"\",'QSO DB'!G135)","v":""},{"$f":"IF('QSO DB'!$D135=\"\",\"\",'QSO DB'!H135)","v":""}]
[{"$f":"IF('QSO DB'!$D136=\"\",\"\",'QSO DB'!A136)","v":""},{"$f":"IF('QSO DB'!$D136=\"\",\"\",'QSO DB'!B136)","v":""},{"$f":"IF('QSO DB'!$D136=\"\",\"\",'QSO DB'!D136)","v":""},{"$f":"IF('QSO DB'!$D136=\"\",\"\",'QSO DB'!E136)","v":""},{"$f":"IF('QSO DB'!$D136=\"\",\"\",'QSO DB'!I136)","v":""},{"$f":"IF('QSO DB'!$D136=\"\",\"\",'QSO DB'!J136)","v":""},{"$f":"IF('QSO DB'!$D136=\"\",\"\",'QSO DB'!K136)","v":""},{"$f":"IF('QSO DB'!$D136=\"\",\"\",'QSO DB'!L136)","v":""},{"$f":"IF('QSO DB'!$D136=\"\",\"\",'QSO DB'!M136)","v":""},{"$f":"IF('QSO DB'!$D136=\"\",\"\",'QSO DB'!F136)","v":""},{"$f":"IF('QSO DB'!$D136=\"\",\"\",'QSO DB'!G136)","v":""},{"$f":"IF('QSO DB'!$D136=\"\",\"\",'QSO DB'!H136)","v":""}]
[{"$f":"IF('QSO DB'!$D137=\"\",\"\",'QSO DB'!A137)","v":""},{"$f":"IF('QSO DB'!$D137=\"\",\"\",'QSO DB'!B137)","v":""},{"$f":"IF('QSO DB'!$D137=\"\",\"\",'QSO DB'!D137)","v":""},{"$f":"IF('QSO DB'!$D137=\"\",\"\",'QSO DB'!E137)","v":""},{"$f":"IF('QSO DB'!$D137=\"\",\"\",'QSO DB'!I137)","v":""},{"$f":"IF('QSO DB'!$D137=\"\",\"\",'QSO DB'!J137)","v":""},{"$f":"IF('QSO DB'!$D137=\"\",\"\",'QSO DB'!K137)","v":""},{"$f":"IF('QSO DB'!$D137=\"\",\"\",'QSO DB'!L137)","v":""},{"$f":"IF('QSO DB'!$D137=\"\",\"\",'QSO DB'!M137)","v":""},{"$f":"IF('QSO DB'!$D137=\"\",\"\",'QSO DB'!F137)","v":""},{"$f":"IF('QSO DB'!$D137=\"\",\"\",'QSO DB'!G137)","v":""},{"$f":"IF('QSO DB'!$D137=\"\",\"\",'QSO DB'!H137)","v":""}]
[{"$f":"IF('QSO DB'!$D138=\"\",\"\",'QSO DB'!A138)","v":""},{"$f":"IF('QSO DB'!$D138=\"\",\"\",'QSO DB'!B138)","v":""},{"$f":"IF('QSO DB'!$D138=\"\",\"\",'QSO DB'!D138)","v":""},{"$f":"IF('QSO DB'!$D138=\"\",\"\",'QSO DB'!E138)","v":""},{"$f":"IF('QSO DB'!$D138=\"\",\"\",'QSO DB'!I138)","v":""},{"$f":"IF('QSO DB'!$D138=\"\",\"\",'QSO DB'!J138)","v":""},{"$f":"IF('QSO DB'!$D138=\"\",\"\",'QSO DB'!K138)","v":""},{"$f":"IF('QSO DB'!$D138=\"\",\"\",'QSO DB'!L138)","v":""},{"$f":"IF('QSO DB'!$D138=\"\",\"\",'QSO DB'!M138)","v":""},{"$f":"IF('QSO DB'!$D138=\"\",\"\",'QSO DB'!F138)","v":""},{"$f":"IF('QSO DB'!$D138=\"\",\"\",'QSO DB'!G138)","v":""},{"$f":"IF('QSO DB'!$D138=\"\",\"\",'QSO DB'!H138)","v":""}]
[{"$f":"IF('QSO DB'!$D139=\"\",\"\",'QSO DB'!A139)","v":""},{"$f":"IF('QSO DB'!$D139=\"\",\"\",'QSO DB'!B139)","v":""},{"$f":"IF('QSO DB'!$D139=\"\",\"\",'QSO DB'!D139)","v":""},{"$f":"IF('QSO DB'!$D139=\"\",\"\",'QSO DB'!E139)","v":""},{"$f":"IF('QSO DB'!$D139=\"\",\"\",'QSO DB'!I139)","v":""},{"$f":"IF('QSO DB'!$D139=\"\",\"\",'QSO DB'!J139)","v":""},{"$f":"IF('QSO DB'!$D139=\"\",\"\",'QSO DB'!K139)","v":""},{"$f":"IF('QSO DB'!$D139=\"\",\"\",'QSO DB'!L139)","v":""},{"$f":"IF('QSO DB'!$D139=\"\",\"\",'QSO DB'!M139)","v":""},{"$f":"IF('QSO DB'!$D139=\"\",\"\",'QSO DB'!F139)","v":""},{"$f":"IF('QSO DB'!$D139=\"\",\"\",'QSO DB'!G139)","v":""},{"$f":"IF('QSO DB'!$D139=\"\",\"\",'QSO DB'!H139)","v":""}]
[{"$f":"IF('QSO DB'!$D140=\"\",\"\",'QSO DB'!A140)","v":""},{"$f":"IF('QSO DB'!$D140=\"\",\"\",'QSO DB'!B140)","v":""},{"$f":"IF('QSO DB'!$D140=\"\",\"\",'QSO DB'!D140)","v":""},{"$f":"IF('QSO DB'!$D140=\"\",\"\",'QSO DB'!E140)","v":""},{"$f":"IF('QSO DB'!$D140=\"\",\"\",'QSO DB'!I140)","v":""},{"$f":"IF('QSO DB'!$D140=\"\",\"\",'QSO DB'!J140)","v":""},{"$f":"IF('QSO DB'!$D140=\"\",\"\",'QSO DB'!K140)","v":""},{"$f":"IF('QSO DB'!$D140=\"\",\"\",'QSO DB'!L140)","v":""},{"$f":"IF('QSO DB'!$D140=\"\",\"\",'QSO DB'!M140)","v":""},{"$f":"IF('QSO DB'!$D140=\"\",\"\",'QSO DB'!F140)","v":""},{"$f":"IF('QSO DB'!$D140=\"\",\"\",'QSO DB'!G140)","v":""},{"$f":"IF('QSO DB'!$D140=\"\",\"\",'QSO DB'!H140)","v":""}]
[{"$f":"IF('QSO DB'!$D141=\"\",\"\",'QSO DB'!A141)","v":""},{"$f":"IF('QSO DB'!$D141=\"\",\"\",'QSO DB'!B141)","v":""},{"$f":"IF('QSO DB'!$D141=\"\",\"\",'QSO DB'!D141)","v":""},{"$f":"IF('QSO DB'!$D141=\"\",\"\",'QSO DB'!E141)","v":""},{"$f":"IF('QSO DB'!$D141=\"\",\"\",'QSO DB'!I141)","v":""},{"$f":"IF('QSO DB'!$D141=\"\",\"\",'QSO DB'!J141)","v":""},{"$f":"IF('QSO DB'!$D141=\"\",\"\",'QSO DB'!K141)","v":""},{"$f":"IF('QSO DB'!$D141=\"\",\"\",'QSO DB'!L141)","v":""},{"$f":"IF('QSO DB'!$D141=\"\",\"\",'QSO DB'!M141)","v":""},{"$f":"IF('QSO DB'!$D141=\"\",\"\",'QSO DB'!F141)","v":""},{"$f":"IF('QSO DB'!$D141=\"\",\"\",'QSO DB'!G141)","v":""},{"$f":"IF('QSO DB'!$D141=\"\",\"\",'QSO DB'!H141)","v":""}]
[{"$f":"IF('QSO DB'!$D142=\"\",\"\",'QSO DB'!A142)","v":""},{"$f":"IF('QSO DB'!$D142=\"\",\"\",'QSO DB'!B142)","v":""},{"$f":"IF('QSO DB'!$D142=\"\",\"\",'QSO DB'!D142)","v":""},{"$f":"IF('QSO DB'!$D142=\"\",\"\",'QSO DB'!E142)","v":""},{"$f":"IF('QSO DB'!$D142=\"\",\"\",'QSO DB'!I142)","v":""},{"$f":"IF('QSO DB'!$D142=\"\",\"\",'QSO DB'!J142)","v":""},{"$f":"IF('QSO DB'!$D142=\"\",\"\",'QSO DB'!K142)","v":""},{"$f":"IF('QSO DB'!$D142=\"\",\"\",'QSO DB'!L142)","v":""},{"$f":"IF('QSO DB'!$D142=\"\",\"\",'QSO DB'!M142)","v":""},{"$f":"IF('QSO DB'!$D142=\"\",\"\",'QSO DB'!F142)","v":""},{"$f":"IF('QSO DB'!$D142=\"\",\"\",'QSO DB'!G142)","v":""},{"$f":"IF('QSO DB'!$D142=\"\",\"\",'QSO DB'!H142)","v":""}]
[{"$f":"IF('QSO DB'!$D143=\"\",\"\",'QSO DB'!A143)","v":""},{"$f":"IF('QSO DB'!$D143=\"\",\"\",'QSO DB'!B143)","v":""},{"$f":"IF('QSO DB'!$D143=\"\",\"\",'QSO DB'!D143)","v":""},{"$f":"IF('QSO DB'!$D143=\"\",\"\",'QSO DB'!E143)","v":""},{"$f":"IF('QSO DB'!$D143=\"\",\"\",'QSO DB'!I143)","v":""},{"$f":"IF('QSO DB'!$D143=\"\",\"\",'QSO DB'!J143)","v":""},{"$f":"IF('QSO DB'!$D143=\"\",\"\",'QSO DB'!K143)","v":""},{"$f":"IF('QSO DB'!$D143=\"\",\"\",'QSO DB'!L143)","v":""},{"$f":"IF('QSO DB'!$D143=\"\",\"\",'QSO DB'!M143)","v":""},{"$f":"IF('QSO DB'!$D143=\"\",\"\",'QSO DB'!F143)","v":""},{"$f":"IF('QSO DB'!$D143=\"\",\"\",'QSO DB'!G143)","v":""},{"$f":"IF('QSO DB'!$D143=\"\",\"\",'QSO DB'!H143)","v":""}]
[{"$f":"IF('QSO DB'!$D144=\"\",\"\",'QSO DB'!A144)","v":""},{"$f":"IF('QSO DB'!$D144=\"\",\"\",'QSO DB'!B144)","v":""},{"$f":"IF('QSO DB'!$D144=\"\",\"\",'QSO DB'!D144)","v":""},{"$f":"IF('QSO DB'!$D144=\"\",\"\",'QSO DB'!E144)","v":""},{"$f":"IF('QSO DB'!$D144=\"\",\"\",'QSO DB'!I144)","v":""},{"$f":"IF('QSO DB'!$D144=\"\",\"\",'QSO DB'!J144)","v":""},{"$f":"IF('QSO DB'!$D144=\"\",\"\",'QSO DB'!K144)","v":""},{"$f":"IF('QSO DB'!$D144=\"\",\"\",'QSO DB'!L144)","v":""},{"$f":"IF('QSO DB'!$D144=\"\",\"\",'QSO DB'!M144)","v":""},{"$f":"IF('QSO DB'!$D144=\"\",\"\",'QSO DB'!F144)","v":""},{"$f":"IF('QSO DB'!$D144=\"\",\"\",'QSO DB'!G144)","v":""},{"$f":"IF('QSO DB'!$D144=\"\",\"\",'QSO DB'!H144)","v":""}]
[{"$f":"IF('QSO DB'!$D145=\"\",\"\",'QSO DB'!A145)","v":""},{"$f":"IF('QSO DB'!$D145=\"\",\"\",'QSO DB'!B145)","v":""},{"$f":"IF('QSO DB'!$D145=\"\",\"\",'QSO DB'!D145)","v":""},{"$f":"IF('QSO DB'!$D145=\"\",\"\",'QSO DB'!E145)","v":""},{"$f":"IF('QSO DB'!$D145=\"\",\"\",'QSO DB'!I145)","v":""},{"$f":"IF('QSO DB'!$D145=\"\",\"\",'QSO DB'!J145)","v":""},{"$f":"IF('QSO DB'!$D145=\"\",\"\",'QSO DB'!K145)","v":""},{"$f":"IF('QSO DB'!$D145=\"\",\"\",'QSO DB'!L145)","v":""},{"$f":"IF('QSO DB'!$D145=\"\",\"\",'QSO DB'!M145)","v":""},{"$f":"IF('QSO DB'!$D145=\"\",\"\",'QSO DB'!F145)","v":""},{"$f":"IF('QSO DB'!$D145=\"\",\"\",'QSO DB'!G145)","v":""},{"$f":"IF('QSO DB'!$D145=\"\",\"\",'QSO DB'!H145)","v":""}]
[{"$f":"IF('QSO DB'!$D146=\"\",\"\",'QSO DB'!A146)","v":""},{"$f":"IF('QSO DB'!$D146=\"\",\"\",'QSO DB'!B146)","v":""},{"$f":"IF('QSO DB'!$D146=\"\",\"\",'QSO DB'!D146)","v":""},{"$f":"IF('QSO DB'!$D146=\"\",\"\",'QSO DB'!E146)","v":""},{"$f":"IF('QSO DB'!$D146=\"\",\"\",'QSO DB'!I146)","v":""},{"$f":"IF('QSO DB'!$D146=\"\",\"\",'QSO DB'!J146)","v":""},{"$f":"IF('QSO DB'!$D146=\"\",\"\",'QSO DB'!K146)","v":""},{"$f":"IF('QSO DB'!$D146=\"\",\"\",'QSO DB'!L146)","v":""},{"$f":"IF('QSO DB'!$D146=\"\",\"\",'QSO DB'!M146)","v":""},{"$f":"IF('QSO DB'!$D146=\"\",\"\",'QSO DB'!F146)","v":""},{"$f":"IF('QSO DB'!$D146=\"\",\"\",'QSO DB'!G146)","v":""},{"$f":"IF('QSO DB'!$D146=\"\",\"\",'QSO DB'!H146)","v":""}]
[{"$f":"IF('QSO DB'!$D147=\"\",\"\",'QSO DB'!A147)","v":""},{"$f":"IF('QSO DB'!$D147=\"\",\"\",'QSO DB'!B147)","v":""},{"$f":"IF('QSO DB'!$D147=\"\",\"\",'QSO DB'!D147)","v":""},{"$f":"IF('QSO DB'!$D147=\"\",\"\",'QSO DB'!E147)","v":""},{"$f":"IF('QSO DB'!$D147=\"\",\"\",'QSO DB'!I147)","v":""},{"$f":"IF('QSO DB'!$D147=\"\",\"\",'QSO DB'!J147)","v":""},{"$f":"IF('QSO DB'!$D147=\"\",\"\",'QSO DB'!K147)","v":""},{"$f":"IF('QSO DB'!$D147=\"\",\"\",'QSO DB'!L147)","v":""},{"$f":"IF('QSO DB'!$D147=\"\",\"\",'QSO DB'!M147)","v":""},{"$f":"IF('QSO DB'!$D147=\"\",\"\",'QSO DB'!F147)","v":""},{"$f":"IF('QSO DB'!$D147=\"\",\"\",'QSO DB'!G147)","v":""},{"$f":"IF('QSO DB'!$D147=\"\",\"\",'QSO DB'!H147)","v":""}]
[{"$f":"IF('QSO DB'!$D148=\"\",\"\",'QSO DB'!A148)","v":""},{"$f":"IF('QSO DB'!$D148=\"\",\"\",'QSO DB'!B148)","v":""},{"$f":"IF('QSO DB'!$D148=\"\",\"\",'QSO DB'!D148)","v":""},{"$f":"IF('QSO DB'!$D148=\"\",\"\",'QSO DB'!E148)","v":""},{"$f":"IF('QSO DB'!$D148=\"\",\"\",'QSO DB'!I148)","v":""},{"$f":"IF('QSO DB'!$D148=\"\",\"\",'QSO DB'!J148)","v":""},{"$f":"IF('QSO DB'!$D148=\"\",\"\",'QSO DB'!K148)","v":""},{"$f":"IF('QSO DB'!$D148=\"\",\"\",'QSO DB'!L148)","v":""},{"$f":"IF('QSO DB'!$D148=\"\",\"\",'QSO DB'!M148)","v":""},{"$f":"IF('QSO DB'!$D148=\"\",\"\",'QSO DB'!F148)","v":""},{"$f":"IF('QSO DB'!$D148=\"\",\"\",'QSO DB'!G148)","v":""},{"$f":"IF('QSO DB'!$D148=\"\",\"\",'QSO DB'!H148)","v":""}]
[{"$f":"IF('QSO DB'!$D149=\"\",\"\",'QSO DB'!A149)","v":""},{"$f":"IF('QSO DB'!$D149=\"\",\"\",'QSO DB'!B149)","v":""},{"$f":"IF('QSO DB'!$D149=\"\",\"\",'QSO DB'!D149)","v":""},{"$f":"IF('QSO DB'!$D149=\"\",\"\",'QSO DB'!E149)","v":""},{"$f":"IF('QSO DB'!$D149=\"\",\"\",'QSO DB'!I149)","v":""},{"$f":"IF('QSO DB'!$D149=\"\",\"\",'QSO DB'!J149)","v":""},{"$f":"IF('QSO DB'!$D149=\"\",\"\",'QSO DB'!K149)","v":""},{"$f":"IF('QSO DB'!$D149=\"\",\"\",'QSO DB'!L149)","v":""},{"$f":"IF('QSO DB'!$D149=\"\",\"\",'QSO DB'!M149)","v":""},{"$f":"IF('QSO DB'!$D149=\"\",\"\",'QSO DB'!F149)","v":""},{"$f":"IF('QSO DB'!$D149=\"\",\"\",'QSO DB'!G149)","v":""},{"$f":"IF('QSO DB'!$D149=\"\",\"\",'QSO DB'!H149)","v":""}]
[{"$f":"IF('QSO DB'!$D150=\"\",\"\",'QSO DB'!A150)","v":""},{"$f":"IF('QSO DB'!$D150=\"\",\"\",'QSO DB'!B150)","v":""},{"$f":"IF('QSO DB'!$D150=\"\",\"\",'QSO DB'!D150)","v":""},{"$f":"IF('QSO DB'!$D150=\"\",\"\",'QSO DB'!E150)","v":""},{"$f":"IF('QSO DB'!$D150=\"\",\"\",'QSO DB'!I150)","v":""},{"$f":"IF('QSO DB'!$D150=\"\",\"\",'QSO DB'!J150)","v":""},{"$f":"IF('QSO DB'!$D150=\"\",\"\",'QSO DB'!K150)","v":""},{"$f":"IF('QSO DB'!$D150=\"\",\"\",'QSO DB'!L150)","v":""},{"$f":"IF('QSO DB'!$D150=\"\",\"\",'QSO DB'!M150)","v":""},{"$f":"IF('QSO DB'!$D150=\"\",\"\",'QSO DB'!F150)","v":""},{"$f":"IF('QSO DB'!$D150=\"\",\"\",'QSO DB'!G150)","v":""},{"$f":"IF('QSO DB'!$D150=\"\",\"\",'QSO DB'!H150)","v":""}]
[{"$f":"IF('QSO DB'!$D151=\"\",\"\",'QSO DB'!A151)","v":""},{"$f":"IF('QSO DB'!$D151=\"\",\"\",'QSO DB'!B151)","v":""},{"$f":"IF('QSO DB'!$D151=\"\",\"\",'QSO DB'!D151)","v":""},{"$f":"IF('QSO DB'!$D151=\"\",\"\",'QSO DB'!E151)","v":""},{"$f":"IF('QSO DB'!$D151=\"\",\"\",'QSO DB'!I151)","v":""},{"$f":"IF('QSO DB'!$D151=\"\",\"\",'QSO DB'!J151)","v":""},{"$f":"IF('QSO DB'!$D151=\"\",\"\",'QSO DB'!K151)","v":""},{"$f":"IF('QSO DB'!$D151=\"\",\"\",'QSO DB'!L151)","v":""},{"$f":"IF('QSO DB'!$D151=\"\",\"\",'QSO DB'!M151)","v":""},{"$f":"IF('QSO DB'!$D151=\"\",\"\",'QSO DB'!F151)","v":""},{"$f":"IF('QSO DB'!$D151=\"\",\"\",'QSO DB'!G151)","v":""},{"$f":"IF('QSO DB'!$D151=\"\",\"\",'QSO DB'!H151)","v":""}]
[{"$f":"IF('QSO DB'!$D152=\"\",\"\",'QSO DB'!A152)","v":""},{"$f":"IF('QSO DB'!$D152=\"\",\"\",'QSO DB'!B152)","v":""},{"$f":"IF('QSO DB'!$D152=\"\",\"\",'QSO DB'!D152)","v":""},{"$f":"IF('QSO DB'!$D152=\"\",\"\",'QSO DB'!E152)","v":""},{"$f":"IF('QSO DB'!$D152=\"\",\"\",'QSO DB'!I152)","v":""},{"$f":"IF('QSO DB'!$D152=\"\",\"\",'QSO DB'!J152)","v":""},{"$f":"IF('QSO DB'!$D152=\"\",\"\",'QSO DB'!K152)","v":""},{"$f":"IF('QSO DB'!$D152=\"\",\"\",'QSO DB'!L152)","v":""},{"$f":"IF('QSO DB'!$D152=\"\",\"\",'QSO DB'!M152)","v":""},{"$f":"IF('QSO DB'!$D152=\"\",\"\",'QSO DB'!F152)","v":""},{"$f":"IF('QSO DB'!$D152=\"\",\"\",'QSO DB'!G152)","v":""},{"$f":"IF('QSO DB'!$D152=\"\",\"\",'QSO DB'!H152)","v":""}]
[{"$f":"IF('QSO DB'!$D153=\"\",\"\",'QSO DB'!A153)","v":""},{"$f":"IF('QSO DB'!$D153=\"\",\"\",'QSO DB'!B153)","v":""},{"$f":"IF('QSO DB'!$D153=\"\",\"\",'QSO DB'!D153)","v":""},{"$f":"IF('QSO DB'!$D153=\"\",\"\",'QSO DB'!E153)","v":""},{"$f":"IF('QSO DB'!$D153=\"\",\"\",'QSO DB'!I153)","v":""},{"$f":"IF('QSO DB'!$D153=\"\",\"\",'QSO DB'!J153)","v":""},{"$f":"IF('QSO DB'!$D153=\"\",\"\",'QSO DB'!K153)","v":""},{"$f":"IF('QSO DB'!$D153=\"\",\"\",'QSO DB'!L153)","v":""},{"$f":"IF('QSO DB'!$D153=\"\",\"\",'QSO DB'!M153)","v":""},{"$f":"IF('QSO DB'!$D153=\"\",\"\",'QSO DB'!F153)","v":""},{"$f":"IF('QSO DB'!$D153=\"\",\"\",'QSO DB'!G153)","v":""},{"$f":"IF('QSO DB'!$D153=\"\",\"\",'QSO DB'!H153)","v":""}]
[{"$f":"IF('QSO DB'!$D154=\"\",\"\",'QSO DB'!A154)","v":""},{"$f":"IF('QSO DB'!$D154=\"\",\"\",'QSO DB'!B154)","v":""},{"$f":"IF('QSO DB'!$D154=\"\",\"\",'QSO DB'!D154)","v":""},{"$f":"IF('QSO DB'!$D154=\"\",\"\",'QSO DB'!E154)","v":""},{"$f":"IF('QSO DB'!$D154=\"\",\"\",'QSO DB'!I154)","v":""},{"$f":"IF('QSO DB'!$D154=\"\",\"\",'QSO DB'!J154)","v":""},{"$f":"IF('QSO DB'!$D154=\"\",\"\",'QSO DB'!K154)","v":""},{"$f":"IF('QSO DB'!$D154=\"\",\"\",'QSO DB'!L154)","v":""},{"$f":"IF('QSO DB'!$D154=\"\",\"\",'QSO DB'!M154)","v":""},{"$f":"IF('QSO DB'!$D154=\"\",\"\",'QSO DB'!F154)","v":""},{"$f":"IF('QSO DB'!$D154=\"\",\"\",'QSO DB'!G154)","v":""},{"$f":"IF('QSO DB'!$D154=\"\",\"\",'QSO DB'!H154)","v":""}]
[{"$f":"IF('QSO DB'!$D155=\"\",\"\",'QSO DB'!A155)","v":""},{"$f":"IF('QSO DB'!$D155=\"\",\"\",'QSO DB'!B155)","v":""},{"$f":"IF('QSO DB'!$D155=\"\",\"\",'QSO DB'!D155)","v":""},{"$f":"IF('QSO DB'!$D155=\"\",\"\",'QSO DB'!E155)","v":""},{"$f":"IF('QSO DB'!$D155=\"\",\"\",'QSO DB'!I155)","v":""},{"$f":"IF('QSO DB'!$D155=\"\",\"\",'QSO DB'!J155)","v":""},{"$f":"IF('QSO DB'!$D155=\"\",\"\",'QSO DB'!K155)","v":""},{"$f":"IF('QSO DB'!$D155=\"\",\"\",'QSO DB'!L155)","v":""},{"$f":"IF('QSO DB'!$D155=\"\",\"\",'QSO DB'!M155)","v":""},{"$f":"IF('QSO DB'!$D155=\"\",\"\",'QSO DB'!F155)","v":""},{"$f":"IF('QSO DB'!$D155=\"\",\"\",'QSO DB'!G155)","v":""},{"$f":"IF('QSO DB'!$D155=\"\",\"\",'QSO DB'!H155)","v":""}]
[{"$f":"IF('QSO DB'!$D156=\"\",\"\",'QSO DB'!A156)","v":""},{"$f":"IF('QSO DB'!$D156=\"\",\"\",'QSO DB'!B156)","v":""},{"$f":"IF('QSO DB'!$D156=\"\",\"\",'QSO DB'!D156)","v":""},{"$f":"IF('QSO DB'!$D156=\"\",\"\",'QSO DB'!E156)","v":""},{"$f":"IF('QSO DB'!$D156=\"\",\"\",'QSO DB'!I156)","v":""},{"$f":"IF('QSO DB'!$D156=\"\",\"\",'QSO DB'!J156)","v":""},{"$f":"IF('QSO DB'!$D156=\"\",\"\",'QSO DB'!K156)","v":""},{"$f":"IF('QSO DB'!$D156=\"\",\"\",'QSO DB'!L156)","v":""},{"$f":"IF('QSO DB'!$D156=\"\",\"\",'QSO DB'!M156)","v":""},{"$f":"IF('QSO DB'!$D156=\"\",\"\",'QSO DB'!F156)","v":""},{"$f":"IF('QSO DB'!$D156=\"\",\"\",'QSO DB'!G156)","v":""},{"$f":"IF('QSO DB'!$D156=\"\",\"\",'QSO DB'!H156)","v":""}]
[{"$f":"IF('QSO DB'!$D157=\"\",\"\",'QSO DB'!A157)","v":""},{"$f":"IF('QSO DB'!$D157=\"\",\"\",'QSO DB'!B157)","v":""},{"$f":"IF('QSO DB'!$D157=\"\",\"\",'QSO DB'!D157)","v":""},{"$f":"IF('QSO DB'!$D157=\"\",\"\",'QSO DB'!E157)","v":""},{"$f":"IF('QSO DB'!$D157=\"\",\"\",'QSO DB'!I157)","v":""},{"$f":"IF('QSO DB'!$D157=\"\",\"\",'QSO DB'!J157)","v":""},{"$f":"IF('QSO DB'!$D157=\"\",\"\",'QSO DB'!K157)","v":""},{"$f":"IF('QSO DB'!$D157=\"\",\"\",'QSO DB'!L157)","v":""},{"$f":"IF('QSO DB'!$D157=\"\",\"\",'QSO DB'!M157)","v":""},{"$f":"IF('QSO DB'!$D157=\"\",\"\",'QSO DB'!F157)","v":""},{"$f":"IF('QSO DB'!$D157=\"\",\"\",'QSO DB'!G157)","v":""},{"$f":"IF('QSO DB'!$D157=\"\",\"\",'QSO DB'!H157)","v":""}]
[{"$f":"IF('QSO DB'!$D158=\"\",\"\",'QSO DB'!A158)","v":""},{"$f":"IF('QSO DB'!$D158=\"\",\"\",'QSO DB'!B158)","v":""},{"$f":"IF('QSO DB'!$D158=\"\",\"\",'QSO DB'!D158)","v":""},{"$f":"IF('QSO DB'!$D158=\"\",\"\",'QSO DB'!E158)","v":""},{"$f":"IF('QSO DB'!$D158=\"\",\"\",'QSO DB'!I158)","v":""},{"$f":"IF('QSO DB'!$D158=\"\",\"\",'QSO DB'!J158)","v":""},{"$f":"IF('QSO DB'!$D158=\"\",\"\",'QSO DB'!K158)","v":""},{"$f":"IF('QSO DB'!$D158=\"\",\"\",'QSO DB'!L158)","v":""},{"$f":"IF('QSO DB'!$D158=\"\",\"\",'QSO DB'!M158)","v":""},{"$f":"IF('QSO DB'!$D158=\"\",\"\",'QSO DB'!F158)","v":""},{"$f":"IF('QSO DB'!$D158=\"\",\"\",'QSO DB'!G158)","v":""},{"$f":"IF('QSO DB'!$D158=\"\",\"\",'QSO DB'!H158)","v":""}]
[{"$f":"IF('QSO DB'!$D159=\"\",\"\",'QSO DB'!A159)","v":""},{"$f":"IF('QSO DB'!$D159=\"\",\"\",'QSO DB'!B159)","v":""},{"$f":"IF('QSO DB'!$D159=\"\",\"\",'QSO DB'!D159)","v":""},{"$f":"IF('QSO DB'!$D159=\"\",\"\",'QSO DB'!E159)","v":""},{"$f":"IF('QSO DB'!$D159=\"\",\"\",'QSO DB'!I159)","v":""},{"$f":"IF('QSO DB'!$D159=\"\",\"\",'QSO DB'!J159)","v":""},{"$f":"IF('QSO DB'!$D159=\"\",\"\",'QSO DB'!K159)","v":""},{"$f":"IF('QSO DB'!$D159=\"\",\"\",'QSO DB'!L159)","v":""},{"$f":"IF('QSO DB'!$D159=\"\",\"\",'QSO DB'!M159)","v":""},{"$f":"IF('QSO DB'!$D159=\"\",\"\",'QSO DB'!F159)","v":""},{"$f":"IF('QSO DB'!$D159=\"\",\"\",'QSO DB'!G159)","v":""},{"$f":"IF('QSO DB'!$D159=\"\",\"\",'QSO DB'!H159)","v":""}]
[{"$f":"IF('QSO DB'!$D160=\"\",\"\",'QSO DB'!A160)","v":""},{"$f":"IF('QSO DB'!$D160=\"\",\"\",'QSO DB'!B160)","v":""},{"$f":"IF('QSO DB'!$D160=\"\",\"\",'QSO DB'!D160)","v":""},{"$f":"IF('QSO DB'!$D160=\"\",\"\",'QSO DB'!E160)","v":""},{"$f":"IF('QSO DB'!$D160=\"\",\"\",'QSO DB'!I160)","v":""},{"$f":"IF('QSO DB'!$D160=\"\",\"\",'QSO DB'!J160)","v":""},{"$f":"IF('QSO DB'!$D160=\"\",\"\",'QSO DB'!K160)","v":""},{"$f":"IF('QSO DB'!$D160=\"\",\"\",'QSO DB'!L160)","v":""},{"$f":"IF('QSO DB'!$D160=\"\",\"\",'QSO DB'!M160)","v":""},{"$f":"IF('QSO DB'!$D160=\"\",\"\",'QSO DB'!F160)","v":""},{"$f":"IF('QSO DB'!$D160=\"\",\"\",'QSO DB'!G160)","v":""},{"$f":"IF('QSO DB'!$D160=\"\",\"\",'QSO DB'!H160)","v":""}]
[{"$f":"IF('QSO DB'!$D161=\"\",\"\",'QSO DB'!A161)","v":""},{"$f":"IF('QSO DB'!$D161=\"\",\"\",'QSO DB'!B161)","v":""},{"$f":"IF('QSO DB'!$D161=\"\",\"\",'QSO DB'!D161)","v":""},{"$f":"IF('QSO DB'!$D161=\"\",\"\",'QSO DB'!E161)","v":""},{"$f":"IF('QSO DB'!$D161=\"\",\"\",'QSO DB'!I161)","v":""},{"$f":"IF('QSO DB'!$D161=\"\",\"\",'QSO DB'!J161)","v":""},{"$f":"IF('QSO DB'!$D161=\"\",\"\",'QSO DB'!K161)","v":""},{"$f":"IF('QSO DB'!$D161=\"\",\"\",'QSO DB'!L161)","v":""},{"$f":"IF('QSO DB'!$D161=\"\",\"\",'QSO DB'!M161)","v":""},{"$f":"IF('QSO DB'!$D161=\"\",\"\",'QSO DB'!F161)","v":""},{"$f":"IF('QSO DB'!$D161=\"\",\"\",'QSO DB'!G161)","v":""},{"$f":"IF('QSO DB'!$D161=\"\",\"\",'QSO DB'!H161)","v":""}]
[{"$f":"IF('QSO DB'!$D162=\"\",\"\",'QSO DB'!A162)","v":""},{"$f":"IF('QSO DB'!$D162=\"\",\"\",'QSO DB'!B162)","v":""},{"$f":"IF('QSO DB'!$D162=\"\",\"\",'QSO DB'!D162)","v":""},{"$f":"IF('QSO DB'!$D162=\"\",\"\",'QSO DB'!E162)","v":""},{"$f":"IF('QSO DB'!$D162=\"\",\"\",'QSO DB'!I162)","v":""},{"$f":"IF('QSO DB'!$D162=\"\",\"\",'QSO DB'!J162)","v":""},{"$f":"IF('QSO DB'!$D162=\"\",\"\",'QSO DB'!K162)","v":""},{"$f":"IF('QSO DB'!$D162=\"\",\"\",'QSO DB'!L162)","v":""},{"$f":"IF('QSO DB'!$D162=\"\",\"\",'QSO DB'!M162)","v":""},{"$f":"IF('QSO DB'!$D162=\"\",\"\",'QSO DB'!F162)","v":""},{"$f":"IF('QSO DB'!$D162=\"\",\"\",'QSO DB'!G162)","v":""},{"$f":"IF('QSO DB'!$D162=\"\",\"\",'QSO DB'!H162)","v":""}]
[{"$f":"IF('QSO DB'!$D163=\"\",\"\",'QSO DB'!A163)","v":""},{"$f":"IF('QSO DB'!$D163=\"\",\"\",'QSO DB'!B163)","v":""},{"$f":"IF('QSO DB'!$D163=\"\",\"\",'QSO DB'!D163)","v":""},{"$f":"IF('QSO DB'!$D163=\"\",\"\",'QSO DB'!E163)","v":""},{"$f":"IF('QSO DB'!$D163=\"\",\"\",'QSO DB'!I163)","v":""},{"$f":"IF('QSO DB'!$D163=\"\",\"\",'QSO DB'!J163)","v":""},{"$f":"IF('QSO DB'!$D163=\"\",\"\",'QSO DB'!K163)","v":""},{"$f":"IF('QSO DB'!$D163=\"\",\"\",'QSO DB'!L163)","v":""},{"$f":"IF('QSO DB'!$D163=\"\",\"\",'QSO DB'!M163)","v":""},{"$f":"IF('QSO DB'!$D163=\"\",\"\",'QSO DB'!F163)","v":""},{"$f":"IF('QSO DB'!$D163=\"\",\"\",'QSO DB'!G163)","v":""},{"$f":"IF('QSO DB'!$D163=\"\",\"\",'QSO DB'!H163)","v":""}]
[{"$f":"IF('QSO DB'!$D164=\"\",\"\",'QSO DB'!A164)","v":""},{"$f":"IF('QSO DB'!$D164=\"\",\"\",'QSO DB'!B164)","v":""},{"$f":"IF('QSO DB'!$D164=\"\",\"\",'QSO DB'!D164)","v":""},{"$f":"IF('QSO DB'!$D164=\"\",\"\",'QSO DB'!E164)","v":""},{"$f":"IF('QSO DB'!$D164=\"\",\"\",'QSO DB'!I164)","v":""},{"$f":"IF('QSO DB'!$D164=\"\",\"\",'QSO DB'!J164)","v":""},{"$f":"IF('QSO DB'!$D164=\"\",\"\",'QSO DB'!K164)","v":""},{"$f":"IF('QSO DB'!$D164=\"\",\"\",'QSO DB'!L164)","v":""},{"$f":"IF('QSO DB'!$D164=\"\",\"\",'QSO DB'!M164)","v":""},{"$f":"IF('QSO DB'!$D164=\"\",\"\",'QSO DB'!F164)","v":""},{"$f":"IF('QSO DB'!$D164=\"\",\"\",'QSO DB'!G164)","v":""},{"$f":"IF('QSO DB'!$D164=\"\",\"\",'QSO DB'!H164)","v":""}]
[{"$f":"IF('QSO DB'!$D165=\"\",\"\",'QSO DB'!A165)","v":""},{"$f":"IF('QSO DB'!$D165=\"\",\"\",'QSO DB'!B165)","v":""},{"$f":"IF('QSO DB'!$D165=\"\",\"\",'QSO DB'!D165)","v":""},{"$f":"IF('QSO DB'!$D165=\"\",\"\",'QSO DB'!E165)","v":""},{"$f":"IF('QSO DB'!$D165=\"\",\"\",'QSO DB'!I165)","v":""},{"$f":"IF('QSO DB'!$D165=\"\",\"\",'QSO DB'!J165)","v":""},{"$f":"IF('QSO DB'!$D165=\"\",\"\",'QSO DB'!K165)","v":""},{"$f":"IF('QSO DB'!$D165=\"\",\"\",'QSO DB'!L165)","v":""},{"$f":"IF('QSO DB'!$D165=\"\",\"\",'QSO DB'!M165)","v":""},{"$f":"IF('QSO DB'!$D165=\"\",\"\",'QSO DB'!F165)","v":""},{"$f":"IF('QSO DB'!$D165=\"\",\"\",'QSO DB'!G165)","v":""},{"$f":"IF('QSO DB'!$D165=\"\",\"\",'QSO DB'!H165)","v":""}]
[{"$f":"IF('QSO DB'!$D166=\"\",\"\",'QSO DB'!A166)","v":""},{"$f":"IF('QSO DB'!$D166=\"\",\"\",'QSO DB'!B166)","v":""},{"$f":"IF('QSO DB'!$D166=\"\",\"\",'QSO DB'!D166)","v":""},{"$f":"IF('QSO DB'!$D166=\"\",\"\",'QSO DB'!E166)","v":""},{"$f":"IF('QSO DB'!$D166=\"\",\"\",'QSO DB'!I166)","v":""},{"$f":"IF('QSO DB'!$D166=\"\",\"\",'QSO DB'!J166)","v":""},{"$f":"IF('QSO DB'!$D166=\"\",\"\",'QSO DB'!K166)","v":""},{"$f":"IF('QSO DB'!$D166=\"\",\"\",'QSO DB'!L166)","v":""},{"$f":"IF('QSO DB'!$D166=\"\",\"\",'QSO DB'!M166)","v":""},{"$f":"IF('QSO DB'!$D166=\"\",\"\",'QSO DB'!F166)","v":""},{"$f":"IF('QSO DB'!$D166=\"\",\"\",'QSO DB'!G166)","v":""},{"$f":"IF('QSO DB'!$D166=\"\",\"\",'QSO DB'!H166)","v":""}]
[{"$f":"IF('QSO DB'!$D167=\"\",\"\",'QSO DB'!A167)","v":""},{"$f":"IF('QSO DB'!$D167=\"\",\"\",'QSO DB'!B167)","v":""},{"$f":"IF('QSO DB'!$D167=\"\",\"\",'QSO DB'!D167)","v":""},{"$f":"IF('QSO DB'!$D167=\"\",\"\",'QSO DB'!E167)","v":""},{"$f":"IF('QSO DB'!$D167=\"\",\"\",'QSO DB'!I167)","v":""},{"$f":"IF('QSO DB'!$D167=\"\",\"\",'QSO DB'!J167)","v":""},{"$f":"IF('QSO DB'!$D167=\"\",\"\",'QSO DB'!K167)","v":""},{"$f":"IF('QSO DB'!$D167=\"\",\"\",'QSO DB'!L167)","v":""},{"$f":"IF('QSO DB'!$D167=\"\",\"\",'QSO DB'!M167)","v":""},{"$f":"IF('QSO DB'!$D167=\"\",\"\",'QSO DB'!F167)","v":""},{"$f":"IF('QSO DB'!$D167=\"\",\"\",'QSO DB'!G167)","v":""},{"$f":"IF('QSO DB'!$D167=\"\",\"\",'QSO DB'!H167)","v":""}]
[{"$f":"IF('QSO DB'!$D168=\"\",\"\",'QSO DB'!A168)","v":""},{"$f":"IF('QSO DB'!$D168=\"\",\"\",'QSO DB'!B168)","v":""},{"$f":"IF('QSO DB'!$D168=\"\",\"\",'QSO DB'!D168)","v":""},{"$f":"IF('QSO DB'!$D168=\"\",\"\",'QSO DB'!E168)","v":""},{"$f":"IF('QSO DB'!$D168=\"\",\"\",'QSO DB'!I168)","v":""},{"$f":"IF('QSO DB'!$D168=\"\",\"\",'QSO DB'!J168)","v":""},{"$f":"IF('QSO DB'!$D168=\"\",\"\",'QSO DB'!K168)","v":""},{"$f":"IF('QSO DB'!$D168=\"\",\"\",'QSO DB'!L168)","v":""},{"$f":"IF('QSO DB'!$D168=\"\",\"\",'QSO DB'!M168)","v":""},{"$f":"IF('QSO DB'!$D168=\"\",\"\",'QSO DB'!F168)","v":""},{"$f":"IF('QSO DB'!$D168=\"\",\"\",'QSO DB'!G168)","v":""},{"$f":"IF('QSO DB'!$D168=\"\",\"\",'QSO DB'!H168)","v":""}]
[{"$f":"IF('QSO DB'!$D169=\"\",\"\",'QSO DB'!A169)","v":""},{"$f":"IF('QSO DB'!$D169=\"\",\"\",'QSO DB'!B169)","v":""},{"$f":"IF('QSO DB'!$D169=\"\",\"\",'QSO DB'!D169)","v":""},{"$f":"IF('QSO DB'!$D169=\"\",\"\",'QSO DB'!E169)","v":""},{"$f":"IF('QSO DB'!$D169=\"\",\"\",'QSO DB'!I169)","v":""},{"$f":"IF('QSO DB'!$D169=\"\",\"\",'QSO DB'!J169)","v":""},{"$f":"IF('QSO DB'!$D169=\"\",\"\",'QSO DB'!K169)","v":""},{"$f":"IF('QSO DB'!$D169=\"\",\"\",'QSO DB'!L169)","v":""},{"$f":"IF('QSO DB'!$D169=\"\",\"\",'QSO DB'!M169)","v":""},{"$f":"IF('QSO DB'!$D169=\"\",\"\",'QSO DB'!F169)","v":""},{"$f":"IF('QSO DB'!$D169=\"\",\"\",'QSO DB'!G169)","v":""},{"$f":"IF('QSO DB'!$D169=\"\",\"\",'QSO DB'!H169)","v":""}]
[{"$f":"IF('QSO DB'!$D170=\"\",\"\",'QSO DB'!A170)","v":""},{"$f":"IF('QSO DB'!$D170=\"\",\"\",'QSO DB'!B170)","v":""},{"$f":"IF('QSO DB'!$D170=\"\",\"\",'QSO DB'!D170)","v":""},{"$f":"IF('QSO DB'!$D170=\"\",\"\",'QSO DB'!E170)","v":""},{"$f":"IF('QSO DB'!$D170=\"\",\"\",'QSO DB'!I170)","v":""},{"$f":"IF('QSO DB'!$D170=\"\",\"\",'QSO DB'!J170)","v":""},{"$f":"IF('QSO DB'!$D170=\"\",\"\",'QSO DB'!K170)","v":""},{"$f":"IF('QSO DB'!$D170=\"\",\"\",'QSO DB'!L170)","v":""},{"$f":"IF('QSO DB'!$D170=\"\",\"\",'QSO DB'!M170)","v":""},{"$f":"IF('QSO DB'!$D170=\"\",\"\",'QSO DB'!F170)","v":""},{"$f":"IF('QSO DB'!$D170=\"\",\"\",'QSO DB'!G170)","v":""},{"$f":"IF('QSO DB'!$D170=\"\",\"\",'QSO DB'!H170)","v":""}]
[{"$f":"IF('QSO DB'!$D171=\"\",\"\",'QSO DB'!A171)","v":""},{"$f":"IF('QSO DB'!$D171=\"\",\"\",'QSO DB'!B171)","v":""},{"$f":"IF('QSO DB'!$D171=\"\",\"\",'QSO DB'!D171)","v":""},{"$f":"IF('QSO DB'!$D171=\"\",\"\",'QSO DB'!E171)","v":""},{"$f":"IF('QSO DB'!$D171=\"\",\"\",'QSO DB'!I171)","v":""},{"$f":"IF('QSO DB'!$D171=\"\",\"\",'QSO DB'!J171)","v":""},{"$f":"IF('QSO DB'!$D171=\"\",\"\",'QSO DB'!K171)","v":""},{"$f":"IF('QSO DB'!$D171=\"\",\"\",'QSO DB'!L171)","v":""},{"$f":"IF('QSO DB'!$D171=\"\",\"\",'QSO DB'!M171)","v":""},{"$f":"IF('QSO DB'!$D171=\"\",\"\",'QSO DB'!F171)","v":""},{"$f":"IF('QSO DB'!$D171=\"\",\"\",'QSO DB'!G171)","v":""},{"$f":"IF('QSO DB'!$D171=\"\",\"\",'QSO DB'!H171)","v":""}]
[{"$f":"IF('QSO DB'!$D172=\"\",\"\",'QSO DB'!A172)","v":""},{"$f":"IF('QSO DB'!$D172=\"\",\"\",'QSO DB'!B172)","v":""},{"$f":"IF('QSO DB'!$D172=\"\",\"\",'QSO DB'!D172)","v":""},{"$f":"IF('QSO DB'!$D172=\"\",\"\",'QSO DB'!E172)","v":""},{"$f":"IF('QSO DB'!$D172=\"\",\"\",'QSO DB'!I172)","v":""},{"$f":"IF('QSO DB'!$D172=\"\",\"\",'QSO DB'!J172)","v":""},{"$f":"IF('QSO DB'!$D172=\"\",\"\",'QSO DB'!K172)","v":""},{"$f":"IF('QSO DB'!$D172=\"\",\"\",'QSO DB'!L172)","v":""},{"$f":"IF('QSO DB'!$D172=\"\",\"\",'QSO DB'!M172)","v":""},{"$f":"IF('QSO DB'!$D172=\"\",\"\",'QSO DB'!F172)","v":""},{"$f":"IF('QSO DB'!$D172=\"\",\"\",'QSO DB'!G172)","v":""},{"$f":"IF('QSO DB'!$D172=\"\",\"\",'QSO DB'!H172)","v":""}]
[{"$f":"IF('QSO DB'!$D173=\"\",\"\",'QSO DB'!A173)","v":""},{"$f":"IF('QSO DB'!$D173=\"\",\"\",'QSO DB'!B173)","v":""},{"$f":"IF('QSO DB'!$D173=\"\",\"\",'QSO DB'!D173)","v":""},{"$f":"IF('QSO DB'!$D173=\"\",\"\",'QSO DB'!E173)","v":""},{"$f":"IF('QSO DB'!$D173=\"\",\"\",'QSO DB'!I173)","v":""},{"$f":"IF('QSO DB'!$D173=\"\",\"\",'QSO DB'!J173)","v":""},{"$f":"IF('QSO DB'!$D173=\"\",\"\",'QSO DB'!K173)","v":""},{"$f":"IF('QSO DB'!$D173=\"\",\"\",'QSO DB'!L173)","v":""},{"$f":"IF('QSO DB'!$D173=\"\",\"\",'QSO DB'!M173)","v":""},{"$f":"IF('QSO DB'!$D173=\"\",\"\",'QSO DB'!F173)","v":""},{"$f":"IF('QSO DB'!$D173=\"\",\"\",'QSO DB'!G173)","v":""},{"$f":"IF('QSO DB'!$D173=\"\",\"\",'QSO DB'!H173)","v":""}]
[{"$f":"IF('QSO DB'!$D174=\"\",\"\",'QSO DB'!A174)","v":""},{"$f":"IF('QSO DB'!$D174=\"\",\"\",'QSO DB'!B174)","v":""},{"$f":"IF('QSO DB'!$D174=\"\",\"\",'QSO DB'!D174)","v":""},{"$f":"IF('QSO DB'!$D174=\"\",\"\",'QSO DB'!E174)","v":""},{"$f":"IF('QSO DB'!$D174=\"\",\"\",'QSO DB'!I174)","v":""},{"$f":"IF('QSO DB'!$D174=\"\",\"\",'QSO DB'!J174)","v":""},{"$f":"IF('QSO DB'!$D174=\"\",\"\",'QSO DB'!K174)","v":""},{"$f":"IF('QSO DB'!$D174=\"\",\"\",'QSO DB'!L174)","v":""},{"$f":"IF('QSO DB'!$D174=\"\",\"\",'QSO DB'!M174)","v":""},{"$f":"IF('QSO DB'!$D174=\"\",\"\",'QSO DB'!F174)","v":""},{"$f":"IF('QSO DB'!$D174=\"\",\"\",'QSO DB'!G174)","v":""},{"$f":"IF('QSO DB'!$D174=\"\",\"\",'QSO DB'!H174)","v":""}]
[{"$f":"IF('QSO DB'!$D175=\"\",\"\",'QSO DB'!A175)","v":""},{"$f":"IF('QSO DB'!$D175=\"\",\"\",'QSO DB'!B175)","v":""},{"$f":"IF('QSO DB'!$D175=\"\",\"\",'QSO DB'!D175)","v":""},{"$f":"IF('QSO DB'!$D175=\"\",\"\",'QSO DB'!E175)","v":""},{"$f":"IF('QSO DB'!$D175=\"\",\"\",'QSO DB'!I175)","v":""},{"$f":"IF('QSO DB'!$D175=\"\",\"\",'QSO DB'!J175)","v":""},{"$f":"IF('QSO DB'!$D175=\"\",\"\",'QSO DB'!K175)","v":""},{"$f":"IF('QSO DB'!$D175=\"\",\"\",'QSO DB'!L175)","v":""},{"$f":"IF('QSO DB'!$D175=\"\",\"\",'QSO DB'!M175)","v":""},{"$f":"IF('QSO DB'!$D175=\"\",\"\",'QSO DB'!F175)","v":""},{"$f":"IF('QSO DB'!$D175=\"\",\"\",'QSO DB'!G175)","v":""},{"$f":"IF('QSO DB'!$D175=\"\",\"\",'QSO DB'!H175)","v":""}]
[{"$f":"IF('QSO DB'!$D176=\"\",\"\",'QSO DB'!A176)","v":""},{"$f":"IF('QSO DB'!$D176=\"\",\"\",'QSO DB'!B176)","v":""},{"$f":"IF('QSO DB'!$D176=\"\",\"\",'QSO DB'!D176)","v":""},{"$f":"IF('QSO DB'!$D176=\"\",\"\",'QSO DB'!E176)","v":""},{"$f":"IF('QSO DB'!$D176=\"\",\"\",'QSO DB'!I176)","v":""},{"$f":"IF('QSO DB'!$D176=\"\",\"\",'QSO DB'!J176)","v":""},{"$f":"IF('QSO DB'!$D176=\"\",\"\",'QSO DB'!K176)","v":""},{"$f":"IF('QSO DB'!$D176=\"\",\"\",'QSO DB'!L176)","v":""},{"$f":"IF('QSO DB'!$D176=\"\",\"\",'QSO DB'!M176)","v":""},{"$f":"IF('QSO DB'!$D176=\"\",\"\",'QSO DB'!F176)","v":""},{"$f":"IF('QSO DB'!$D176=\"\",\"\",'QSO DB'!G176)","v":""},{"$f":"IF('QSO DB'!$D176=\"\",\"\",'QSO DB'!H176)","v":""}]
[{"$f":"IF('QSO DB'!$D177=\"\",\"\",'QSO DB'!A177)","v":""},{"$f":"IF('QSO DB'!$D177=\"\",\"\",'QSO DB'!B177)","v":""},{"$f":"IF('QSO DB'!$D177=\"\",\"\",'QSO DB'!D177)","v":""},{"$f":"IF('QSO DB'!$D177=\"\",\"\",'QSO DB'!E177)","v":""},{"$f":"IF('QSO DB'!$D177=\"\",\"\",'QSO DB'!I177)","v":""},{"$f":"IF('QSO DB'!$D177=\"\",\"\",'QSO DB'!J177)","v":""},{"$f":"IF('QSO DB'!$D177=\"\",\"\",'QSO DB'!K177)","v":""},{"$f":"IF('QSO DB'!$D177=\"\",\"\",'QSO DB'!L177)","v":""},{"$f":"IF('QSO DB'!$D177=\"\",\"\",'QSO DB'!M177)","v":""},{"$f":"IF('QSO DB'!$D177=\"\",\"\",'QSO DB'!F177)","v":""},{"$f":"IF('QSO DB'!$D177=\"\",\"\",'QSO DB'!G177)","v":""},{"$f":"IF('QSO DB'!$D177=\"\",\"\",'QSO DB'!H177)","v":""}]
[{"$f":"IF('QSO DB'!$D178=\"\",\"\",'QSO DB'!A178)","v":""},{"$f":"IF('QSO DB'!$D178=\"\",\"\",'QSO DB'!B178)","v":""},{"$f":"IF('QSO DB'!$D178=\"\",\"\",'QSO DB'!D178)","v":""},{"$f":"IF('QSO DB'!$D178=\"\",\"\",'QSO DB'!E178)","v":""},{"$f":"IF('QSO DB'!$D178=\"\",\"\",'QSO DB'!I178)","v":""},{"$f":"IF('QSO DB'!$D178=\"\",\"\",'QSO DB'!J178)","v":""},{"$f":"IF('QSO DB'!$D178=\"\",\"\",'QSO DB'!K178)","v":""},{"$f":"IF('QSO DB'!$D178=\"\",\"\",'QSO DB'!L178)","v":""},{"$f":"IF('QSO DB'!$D178=\"\",\"\",'QSO DB'!M178)","v":""},{"$f":"IF('QSO DB'!$D178=\"\",\"\",'QSO DB'!F178)","v":""},{"$f":"IF('QSO DB'!$D178=\"\",\"\",'QSO DB'!G178)","v":""},{"$f":"IF('QSO DB'!$D178=\"\",\"\",'QSO DB'!H178)","v":""}]
[{"$f":"IF('QSO DB'!$D179=\"\",\"\",'QSO DB'!A179)","v":""},{"$f":"IF('QSO DB'!$D179=\"\",\"\",'QSO DB'!B179)","v":""},{"$f":"IF('QSO DB'!$D179=\"\",\"\",'QSO DB'!D179)","v":""},{"$f":"IF('QSO DB'!$D179=\"\",\"\",'QSO DB'!E179)","v":""},{"$f":"IF('QSO DB'!$D179=\"\",\"\",'QSO DB'!I179)","v":""},{"$f":"IF('QSO DB'!$D179=\"\",\"\",'QSO DB'!J179)","v":""},{"$f":"IF('QSO DB'!$D179=\"\",\"\",'QSO DB'!K179)","v":""},{"$f":"IF('QSO DB'!$D179=\"\",\"\",'QSO DB'!L179)","v":""},{"$f":"IF('QSO DB'!$D179=\"\",\"\",'QSO DB'!M179)","v":""},{"$f":"IF('QSO DB'!$D179=\"\",\"\",'QSO DB'!F179)","v":""},{"$f":"IF('QSO DB'!$D179=\"\",\"\",'QSO DB'!G179)","v":""},{"$f":"IF('QSO DB'!$D179=\"\",\"\",'QSO DB'!H179)","v":""}]
[{"$f":"IF('QSO DB'!$D180=\"\",\"\",'QSO DB'!A180)","v":""},{"$f":"IF('QSO DB'!$D180=\"\",\"\",'QSO DB'!B180)","v":""},{"$f":"IF('QSO DB'!$D180=\"\",\"\",'QSO DB'!D180)","v":""},{"$f":"IF('QSO DB'!$D180=\"\",\"\",'QSO DB'!E180)","v":""},{"$f":"IF('QSO DB'!$D180=\"\",\"\",'QSO DB'!I180)","v":""},{"$f":"IF('QSO DB'!$D180=\"\",\"\",'QSO DB'!J180)","v":""},{"$f":"IF('QSO DB'!$D180=\"\",\"\",'QSO DB'!K180)","v":""},{"$f":"IF('QSO DB'!$D180=\"\",\"\",'QSO DB'!L180)","v":""},{"$f":"IF('QSO DB'!$D180=\"\",\"\",'QSO DB'!M180)","v":""},{"$f":"IF('QSO DB'!$D180=\"\",\"\",'QSO DB'!F180)","v":""},{"$f":"IF('QSO DB'!$D180=\"\",\"\",'QSO DB'!G180)","v":""},{"$f":"IF('QSO DB'!$D180=\"\",\"\",'QSO DB'!H180)","v":""}]
[{"$f":"IF('QSO DB'!$D181=\"\",\"\",'QSO DB'!A181)","v":""},{"$f":"IF('QSO DB'!$D181=\"\",\"\",'QSO DB'!B181)","v":""},{"$f":"IF('QSO DB'!$D181=\"\",\"\",'QSO DB'!D181)","v":""},{"$f":"IF('QSO DB'!$D181=\"\",\"\",'QSO DB'!E181)","v":""},{"$f":"IF('QSO DB'!$D181=\"\",\"\",'QSO DB'!I181)","v":""},{"$f":"IF('QSO DB'!$D181=\"\",\"\",'QSO DB'!J181)","v":""},{"$f":"IF('QSO DB'!$D181=\"\",\"\",'QSO DB'!K181)","v":""},{"$f":"IF('QSO DB'!$D181=\"\",\"\",'QSO DB'!L181)","v":""},{"$f":"IF('QSO DB'!$D181=\"\",\"\",'QSO DB'!M181)","v":""},{"$f":"IF('QSO DB'!$D181=\"\",\"\",'QSO DB'!F181)","v":""},{"$f":"IF('QSO DB'!$D181=\"\",\"\",'QSO DB'!G181)","v":""},{"$f":"IF('QSO DB'!$D181=\"\",\"\",'QSO DB'!H181)","v":""}]
[{"$f":"IF('QSO DB'!$D182=\"\",\"\",'QSO DB'!A182)","v":""},{"$f":"IF('QSO DB'!$D182=\"\",\"\",'QSO DB'!B182)","v":""},{"$f":"IF('QSO DB'!$D182=\"\",\"\",'QSO DB'!D182)","v":""},{"$f":"IF('QSO DB'!$D182=\"\",\"\",'QSO DB'!E182)","v":""},{"$f":"IF('QSO DB'!$D182=\"\",\"\",'QSO DB'!I182)","v":""},{"$f":"IF('QSO DB'!$D182=\"\",\"\",'QSO DB'!J182)","v":""},{"$f":"IF('QSO DB'!$D182=\"\",\"\",'QSO DB'!K182)","v":""},{"$f":"IF('QSO DB'!$D182=\"\",\"\",'QSO DB'!L182)","v":""},{"$f":"IF('QSO DB'!$D182=\"\",\"\",'QSO DB'!M182)","v":""},{"$f":"IF('QSO DB'!$D182=\"\",\"\",'QSO DB'!F182)","v":""},{"$f":"IF('QSO DB'!$D182=\"\",\"\",'QSO DB'!G182)","v":""},{"$f":"IF('QSO DB'!$D182=\"\",\"\",'QSO DB'!H182)","v":""}]
[{"$f":"IF('QSO DB'!$D183=\"\",\"\",'QSO DB'!A183)","v":""},{"$f":"IF('QSO DB'!$D183=\"\",\"\",'QSO DB'!B183)","v":""},{"$f":"IF('QSO DB'!$D183=\"\",\"\",'QSO DB'!D183)","v":""},{"$f":"IF('QSO DB'!$D183=\"\",\"\",'QSO DB'!E183)","v":""},{"$f":"IF('QSO DB'!$D183=\"\",\"\",'QSO DB'!I183)","v":""},{"$f":"IF('QSO DB'!$D183=\"\",\"\",'QSO DB'!J183)","v":""},{"$f":"IF('QSO DB'!$D183=\"\",\"\",'QSO DB'!K183)","v":""},{"$f":"IF('QSO DB'!$D183=\"\",\"\",'QSO DB'!L183)","v":""},{"$f":"IF('QSO DB'!$D183=\"\",\"\",'QSO DB'!M183)","v":""},{"$f":"IF('QSO DB'!$D183=\"\",\"\",'QSO DB'!F183)","v":""},{"$f":"IF('QSO DB'!$D183=\"\",\"\",'QSO DB'!G183)","v":""},{"$f":"IF('QSO DB'!$D183=\"\",\"\",'QSO DB'!H183)","v":""}]
[{"$f":"IF('QSO DB'!$D184=\"\",\"\",'QSO DB'!A184)","v":""},{"$f":"IF('QSO DB'!$D184=\"\",\"\",'QSO DB'!B184)","v":""},{"$f":"IF('QSO DB'!$D184=\"\",\"\",'QSO DB'!D184)","v":""},{"$f":"IF('QSO DB'!$D184=\"\",\"\",'QSO DB'!E184)","v":""},{"$f":"IF('QSO DB'!$D184=\"\",\"\",'QSO DB'!I184)","v":""},{"$f":"IF('QSO DB'!$D184=\"\",\"\",'QSO DB'!J184)","v":""},{"$f":"IF('QSO DB'!$D184=\"\",\"\",'QSO DB'!K184)","v":""},{"$f":"IF('QSO DB'!$D184=\"\",\"\",'QSO DB'!L184)","v":""},{"$f":"IF('QSO DB'!$D184=\"\",\"\",'QSO DB'!M184)","v":""},{"$f":"IF('QSO DB'!$D184=\"\",\"\",'QSO DB'!F184)","v":""},{"$f":"IF('QSO DB'!$D184=\"\",\"\",'QSO DB'!G184)","v":""},{"$f":"IF('QSO DB'!$D184=\"\",\"\",'QSO DB'!H184)","v":""}]
[{"$f":"IF('QSO DB'!$D185=\"\",\"\",'QSO DB'!A185)","v":""},{"$f":"IF('QSO DB'!$D185=\"\",\"\",'QSO DB'!B185)","v":""},{"$f":"IF('QSO DB'!$D185=\"\",\"\",'QSO DB'!D185)","v":""},{"$f":"IF('QSO DB'!$D185=\"\",\"\",'QSO DB'!E185)","v":""},{"$f":"IF('QSO DB'!$D185=\"\",\"\",'QSO DB'!I185)","v":""},{"$f":"IF('QSO DB'!$D185=\"\",\"\",'QSO DB'!J185)","v":""},{"$f":"IF('QSO DB'!$D185=\"\",\"\",'QSO DB'!K185)","v":""},{"$f":"IF('QSO DB'!$D185=\"\",\"\",'QSO DB'!L185)","v":""},{"$f":"IF('QSO DB'!$D185=\"\",\"\",'QSO DB'!M185)","v":""},{"$f":"IF('QSO DB'!$D185=\"\",\"\",'QSO DB'!F185)","v":""},{"$f":"IF('QSO DB'!$D185=\"\",\"\",'QSO DB'!G185)","v":""},{"$f":"IF('QSO DB'!$D185=\"\",\"\",'QSO DB'!H185)","v":""}]
[{"$f":"IF('QSO DB'!$D186=\"\",\"\",'QSO DB'!A186)","v":""},{"$f":"IF('QSO DB'!$D186=\"\",\"\",'QSO DB'!B186)","v":""},{"$f":"IF('QSO DB'!$D186=\"\",\"\",'QSO DB'!D186)","v":""},{"$f":"IF('QSO DB'!$D186=\"\",\"\",'QSO DB'!E186)","v":""},{"$f":"IF('QSO DB'!$D186=\"\",\"\",'QSO DB'!I186)","v":""},{"$f":"IF('QSO DB'!$D186=\"\",\"\",'QSO DB'!J186)","v":""},{"$f":"IF('QSO DB'!$D186=\"\",\"\",'QSO DB'!K186)","v":""},{"$f":"IF('QSO DB'!$D186=\"\",\"\",'QSO DB'!L186)","v":""},{"$f":"IF('QSO DB'!$D186=\"\",\"\",'QSO DB'!M186)","v":""},{"$f":"IF('QSO DB'!$D186=\"\",\"\",'QSO DB'!F186)","v":""},{"$f":"IF('QSO DB'!$D186=\"\",\"\",'QSO DB'!G186)","v":""},{"$f":"IF('QSO DB'!$D186=\"\",\"\",'QSO DB'!H186)","v":""}]
[{"$f":"IF('QSO DB'!$D187=\"\",\"\",'QSO DB'!A187)","v":""},{"$f":"IF('QSO DB'!$D187=\"\",\"\",'QSO DB'!B187)","v":""},{"$f":"IF('QSO DB'!$D187=\"\",\"\",'QSO DB'!D187)","v":""},{"$f":"IF('QSO DB'!$D187=\"\",\"\",'QSO DB'!E187)","v":""},{"$f":"IF('QSO DB'!$D187=\"\",\"\",'QSO DB'!I187)","v":""},{"$f":"IF('QSO DB'!$D187=\"\",\"\",'QSO DB'!J187)","v":""},{"$f":"IF('QSO DB'!$D187=\"\",\"\",'QSO DB'!K187)","v":""},{"$f":"IF('QSO DB'!$D187=\"\",\"\",'QSO DB'!L187)","v":""},{"$f":"IF('QSO DB'!$D187=\"\",\"\",'QSO DB'!M187)","v":""},{"$f":"IF('QSO DB'!$D187=\"\",\"\",'QSO DB'!F187)","v":""},{"$f":"IF('QSO DB'!$D187=\"\",\"\",'QSO DB'!G187)","v":""},{"$f":"IF('QSO DB'!$D187=\"\",\"\",'QSO DB'!H187)","v":""}]
[{"$f":"IF('QSO DB'!$D188=\"\",\"\",'QSO DB'!A188)","v":""},{"$f":"IF('QSO DB'!$D188=\"\",\"\",'QSO DB'!B188)","v":""},{"$f":"IF('QSO DB'!$D188=\"\",\"\",'QSO DB'!D188)","v":""},{"$f":"IF('QSO DB'!$D188=\"\",\"\",'QSO DB'!E188)","v":""},{"$f":"IF('QSO DB'!$D188=\"\",\"\",'QSO DB'!I188)","v":""},{"$f":"IF('QSO DB'!$D188=\"\",\"\",'QSO DB'!J188)","v":""},{"$f":"IF('QSO DB'!$D188=\"\",\"\",'QSO DB'!K188)","v":""},{"$f":"IF('QSO DB'!$D188=\"\",\"\",'QSO DB'!L188)","v":""},{"$f":"IF('QSO DB'!$D188=\"\",\"\",'QSO DB'!M188)","v":""},{"$f":"IF('QSO DB'!$D188=\"\",\"\",'QSO DB'!F188)","v":""},{"$f":"IF('QSO DB'!$D188=\"\",\"\",'QSO DB'!G188)","v":""},{"$f":"IF('QSO DB'!$D188=\"\",\"\",'QSO DB'!H188)","v":""}]
[{"$f":"IF('QSO DB'!$D189=\"\",\"\",'QSO DB'!A189)","v":""},{"$f":"IF('QSO DB'!$D189=\"\",\"\",'QSO DB'!B189)","v":""},{"$f":"IF('QSO DB'!$D189=\"\",\"\",'QSO DB'!D189)","v":""},{"$f":"IF('QSO DB'!$D189=\"\",\"\",'QSO DB'!E189)","v":""},{"$f":"IF('QSO DB'!$D189=\"\",\"\",'QSO DB'!I189)","v":""},{"$f":"IF('QSO DB'!$D189=\"\",\"\",'QSO DB'!J189)","v":""},{"$f":"IF('QSO DB'!$D189=\"\",\"\",'QSO DB'!K189)","v":""},{"$f":"IF('QSO DB'!$D189=\"\",\"\",'QSO DB'!L189)","v":""},{"$f":"IF('QSO DB'!$D189=\"\",\"\",'QSO DB'!M189)","v":""},{"$f":"IF('QSO DB'!$D189=\"\",\"\",'QSO DB'!F189)","v":""},{"$f":"IF('QSO DB'!$D189=\"\",\"\",'QSO DB'!G189)","v":""},{"$f":"IF('QSO DB'!$D189=\"\",\"\",'QSO DB'!H189)","v":""}]
[{"$f":"IF('QSO DB'!$D190=\"\",\"\",'QSO DB'!A190)","v":""},{"$f":"IF('QSO DB'!$D190=\"\",\"\",'QSO DB'!B190)","v":""},{"$f":"IF('QSO DB'!$D190=\"\",\"\",'QSO DB'!D190)","v":""},{"$f":"IF('QSO DB'!$D190=\"\",\"\",'QSO DB'!E190)","v":""},{"$f":"IF('QSO DB'!$D190=\"\",\"\",'QSO DB'!I190)","v":""},{"$f":"IF('QSO DB'!$D190=\"\",\"\",'QSO DB'!J190)","v":""},{"$f":"IF('QSO DB'!$D190=\"\",\"\",'QSO DB'!K190)","v":""},{"$f":"IF('QSO DB'!$D190=\"\",\"\",'QSO DB'!L190)","v":""},{"$f":"IF('QSO DB'!$D190=\"\",\"\",'QSO DB'!M190)","v":""},{"$f":"IF('QSO DB'!$D190=\"\",\"\",'QSO DB'!F190)","v":""},{"$f":"IF('QSO DB'!$D190=\"\",\"\",'QSO DB'!G190)","v":""},{"$f":"IF('QSO DB'!$D190=\"\",\"\",'QSO DB'!H190)","v":""}]
[{"$f":"IF('QSO DB'!$D191=\"\",\"\",'QSO DB'!A191)","v":""},{"$f":"IF('QSO DB'!$D191=\"\",\"\",'QSO DB'!B191)","v":""},{"$f":"IF('QSO DB'!$D191=\"\",\"\",'QSO DB'!D191)","v":""},{"$f":"IF('QSO DB'!$D191=\"\",\"\",'QSO DB'!E191)","v":""},{"$f":"IF('QSO DB'!$D191=\"\",\"\",'QSO DB'!I191)","v":""},{"$f":"IF('QSO DB'!$D191=\"\",\"\",'QSO DB'!J191)","v":""},{"$f":"IF('QSO DB'!$D191=\"\",\"\",'QSO DB'!K191)","v":""},{"$f":"IF('QSO DB'!$D191=\"\",\"\",'QSO DB'!L191)","v":""},{"$f":"IF('QSO DB'!$D191=\"\",\"\",'QSO DB'!M191)","v":""},{"$f":"IF('QSO DB'!$D191=\"\",\"\",'QSO DB'!F191)","v":""},{"$f":"IF('QSO DB'!$D191=\"\",\"\",'QSO DB'!G191)","v":""},{"$f":"IF('QSO DB'!$D191=\"\",\"\",'QSO DB'!H191)","v":""}]
[{"$f":"IF('QSO DB'!$D192=\"\",\"\",'QSO DB'!A192)","v":""},{"$f":"IF('QSO DB'!$D192=\"\",\"\",'QSO DB'!B192)","v":""},{"$f":"IF('QSO DB'!$D192=\"\",\"\",'QSO DB'!D192)","v":""},{"$f":"IF('QSO DB'!$D192=\"\",\"\",'QSO DB'!E192)","v":""},{"$f":"IF('QSO DB'!$D192=\"\",\"\",'QSO DB'!I192)","v":""},{"$f":"IF('QSO DB'!$D192=\"\",\"\",'QSO DB'!J192)","v":""},{"$f":"IF('QSO DB'!$D192=\"\",\"\",'QSO DB'!K192)","v":""},{"$f":"IF('QSO DB'!$D192=\"\",\"\",'QSO DB'!L192)","v":""},{"$f":"IF('QSO DB'!$D192=\"\",\"\",'QSO DB'!M192)","v":""},{"$f":"IF('QSO DB'!$D192=\"\",\"\",'QSO DB'!F192)","v":""},{"$f":"IF('QSO DB'!$D192=\"\",\"\",'QSO DB'!G192)","v":""},{"$f":"IF('QSO DB'!$D192=\"\",\"\",'QSO DB'!H192)","v":""}]
[{"$f":"IF('QSO DB'!$D193=\"\",\"\",'QSO DB'!A193)","v":""},{"$f":"IF('QSO DB'!$D193=\"\",\"\",'QSO DB'!B193)","v":""},{"$f":"IF('QSO DB'!$D193=\"\",\"\",'QSO DB'!D193)","v":""},{"$f":"IF('QSO DB'!$D193=\"\",\"\",'QSO DB'!E193)","v":""},{"$f":"IF('QSO DB'!$D193=\"\",\"\",'QSO DB'!I193)","v":""},{"$f":"IF('QSO DB'!$D193=\"\",\"\",'QSO DB'!J193)","v":""},{"$f":"IF('QSO DB'!$D193=\"\",\"\",'QSO DB'!K193)","v":""},{"$f":"IF('QSO DB'!$D193=\"\",\"\",'QSO DB'!L193)","v":""},{"$f":"IF('QSO DB'!$D193=\"\",\"\",'QSO DB'!M193)","v":""},{"$f":"IF('QSO DB'!$D193=\"\",\"\",'QSO DB'!F193)","v":""},{"$f":"IF('QSO DB'!$D193=\"\",\"\",'QSO DB'!G193)","v":""},{"$f":"IF('QSO DB'!$D193=\"\",\"\",'QSO DB'!H193)","v":""}]
[{"$f":"IF('QSO DB'!$D194=\"\",\"\",'QSO DB'!A194)","v":""},{"$f":"IF('QSO DB'!$D194=\"\",\"\",'QSO DB'!B194)","v":""},{"$f":"IF('QSO DB'!$D194=\"\",\"\",'QSO DB'!D194)","v":""},{"$f":"IF('QSO DB'!$D194=\"\",\"\",'QSO DB'!E194)","v":""},{"$f":"IF('QSO DB'!$D194=\"\",\"\",'QSO DB'!I194)","v":""},{"$f":"IF('QSO DB'!$D194=\"\",\"\",'QSO DB'!J194)","v":""},{"$f":"IF('QSO DB'!$D194=\"\",\"\",'QSO DB'!K194)","v":""},{"$f":"IF('QSO DB'!$D194=\"\",\"\",'QSO DB'!L194)","v":""},{"$f":"IF('QSO DB'!$D194=\"\",\"\",'QSO DB'!M194)","v":""},{"$f":"IF('QSO DB'!$D194=\"\",\"\",'QSO DB'!F194)","v":""},{"$f":"IF('QSO DB'!$D194=\"\",\"\",'QSO DB'!G194)","v":""},{"$f":"IF('QSO DB'!$D194=\"\",\"\",'QSO DB'!H194)","v":""}]
[{"$f":"IF('QSO DB'!$D195=\"\",\"\",'QSO DB'!A195)","v":""},{"$f":"IF('QSO DB'!$D195=\"\",\"\",'QSO DB'!B195)","v":""},{"$f":"IF('QSO DB'!$D195=\"\",\"\",'QSO DB'!D195)","v":""},{"$f":"IF('QSO DB'!$D195=\"\",\"\",'QSO DB'!E195)","v":""},{"$f":"IF('QSO DB'!$D195=\"\",\"\",'QSO DB'!I195)","v":""},{"$f":"IF('QSO DB'!$D195=\"\",\"\",'QSO DB'!J195)","v":""},{"$f":"IF('QSO DB'!$D195=\"\",\"\",'QSO DB'!K195)","v":""},{"$f":"IF('QSO DB'!$D195=\"\",\"\",'QSO DB'!L195)","v":""},{"$f":"IF('QSO DB'!$D195=\"\",\"\",'QSO DB'!M195)","v":""},{"$f":"IF('QSO DB'!$D195=\"\",\"\",'QSO DB'!F195)","v":""},{"$f":"IF('QSO DB'!$D195=\"\",\"\",'QSO DB'!G195)","v":""},{"$f":"IF('QSO DB'!$D195=\"\",\"\",'QSO DB'!H195)","v":""}]
[{"$f":"IF('QSO DB'!$D196=\"\",\"\",'QSO DB'!A196)","v":""},{"$f":"IF('QSO DB'!$D196=\"\",\"\",'QSO DB'!B196)","v":""},{"$f":"IF('QSO DB'!$D196=\"\",\"\",'QSO DB'!D196)","v":""},{"$f":"IF('QSO DB'!$D196=\"\",\"\",'QSO DB'!E196)","v":""},{"$f":"IF('QSO DB'!$D196=\"\",\"\",'QSO DB'!I196)","v":""},{"$f":"IF('QSO DB'!$D196=\"\",\"\",'QSO DB'!J196)","v":""},{"$f":"IF('QSO DB'!$D196=\"\",\"\",'QSO DB'!K196)","v":""},{"$f":"IF('QSO DB'!$D196=\"\",\"\",'QSO DB'!L196)","v":""},{"$f":"IF('QSO DB'!$D196=\"\",\"\",'QSO DB'!M196)","v":""},{"$f":"IF('QSO DB'!$D196=\"\",\"\",'QSO DB'!F196)","v":""},{"$f":"IF('QSO DB'!$D196=\"\",\"\",'QSO DB'!G196)","v":""},{"$f":"IF('QSO DB'!$D196=\"\",\"\",'QSO DB'!H196)","v":""}]
[{"$f":"IF('QSO DB'!$D197=\"\",\"\",'QSO DB'!A197)","v":""},{"$f":"IF('QSO DB'!$D197=\"\",\"\",'QSO DB'!B197)","v":""},{"$f":"IF('QSO DB'!$D197=\"\",\"\",'QSO DB'!D197)","v":""},{"$f":"IF('QSO DB'!$D197=\"\",\"\",'QSO DB'!E197)","v":""},{"$f":"IF('QSO DB'!$D197=\"\",\"\",'QSO DB'!I197)","v":""},{"$f":"IF('QSO DB'!$D197=\"\",\"\",'QSO DB'!J197)","v":""},{"$f":"IF('QSO DB'!$D197=\"\",\"\",'QSO DB'!K197)","v":""},{"$f":"IF('QSO DB'!$D197=\"\",\"\",'QSO DB'!L197)","v":""},{"$f":"IF('QSO DB'!$D197=\"\",\"\",'QSO DB'!M197)","v":""},{"$f":"IF('QSO DB'!$D197=\"\",\"\",'QSO DB'!F197)","v":""},{"$f":"IF('QSO DB'!$D197=\"\",\"\",'QSO DB'!G197)","v":""},{"$f":"IF('QSO DB'!$D197=\"\",\"\",'QSO DB'!H197)","v":""}]
[{"$f":"IF('QSO DB'!$D198=\"\",\"\",'QSO DB'!A198)","v":""},{"$f":"IF('QSO DB'!$D198=\"\",\"\",'QSO DB'!B198)","v":""},{"$f":"IF('QSO DB'!$D198=\"\",\"\",'QSO DB'!D198)","v":""},{"$f":"IF('QSO DB'!$D198=\"\",\"\",'QSO DB'!E198)","v":""},{"$f":"IF('QSO DB'!$D198=\"\",\"\",'QSO DB'!I198)","v":""},{"$f":"IF('QSO DB'!$D198=\"\",\"\",'QSO DB'!J198)","v":""},{"$f":"IF('QSO DB'!$D198=\"\",\"\",'QSO DB'!K198)","v":""},{"$f":"IF('QSO DB'!$D198=\"\",\"\",'QSO DB'!L198)","v":""},{"$f":"IF('QSO DB'!$D198=\"\",\"\",'QSO DB'!M198)","v":""},{"$f":"IF('QSO DB'!$D198=\"\",\"\",'QSO DB'!F198)","v":""},{"$f":"IF('QSO DB'!$D198=\"\",\"\",'QSO DB'!G198)","v":""},{"$f":"IF('QSO DB'!$D198=\"\",\"\",'QSO DB'!H198)","v":""}]
[{"$f":"IF('QSO DB'!$D199=\"\",\"\",'QSO DB'!A199)","v":""},{"$f":"IF('QSO DB'!$D199=\"\",\"\",'QSO DB'!B199)","v":""},{"$f":"IF('QSO DB'!$D199=\"\",\"\",'QSO DB'!D199)","v":""},{"$f":"IF('QSO DB'!$D199=\"\",\"\",'QSO DB'!E199)","v":""},{"$f":"IF('QSO DB'!$D199=\"\",\"\",'QSO DB'!I199)","v":""},{"$f":"IF('QSO DB'!$D199=\"\",\"\",'QSO DB'!J199)","v":""},{"$f":"IF('QSO DB'!$D199=\"\",\"\",'QSO DB'!K199)","v":""},{"$f":"IF('QSO DB'!$D199=\"\",\"\",'QSO DB'!L199)","v":""},{"$f":"IF('QSO DB'!$D199=\"\",\"\",'QSO DB'!M199)","v":""},{"$f":"IF('QSO DB'!$D199=\"\",\"\",'QSO DB'!F199)","v":""},{"$f":"IF('QSO DB'!$D199=\"\",\"\",'QSO DB'!G199)","v":""},{"$f":"IF('QSO DB'!$D199=\"\",\"\",'QSO DB'!H199)","v":""}]
[{"$f":"IF('QSO DB'!$D200=\"\",\"\",'QSO DB'!A200)","v":""},{"$f":"IF('QSO DB'!$D200=\"\",\"\",'QSO DB'!B200)","v":""},{"$f":"IF('QSO DB'!$D200=\"\",\"\",'QSO DB'!D200)","v":""},{"$f":"IF('QSO DB'!$D200=\"\",\"\",'QSO DB'!E200)","v":""},{"$f":"IF('QSO DB'!$D200=\"\",\"\",'QSO DB'!I200)","v":""},{"$f":"IF('QSO DB'!$D200=\"\",\"\",'QSO DB'!J200)","v":""},{"$f":"IF('QSO DB'!$D200=\"\",\"\",'QSO DB'!K200)","v":""},{"$f":"IF('QSO DB'!$D200=\"\",\"\",'QSO DB'!L200)","v":""},{"$f":"IF('QSO DB'!$D200=\"\",\"\",'QSO DB'!M200)","v":""},{"$f":"IF('QSO DB'!$D200=\"\",\"\",'QSO DB'!F200)","v":""},{"$f":"IF('QSO DB'!$D200=\"\",\"\",'QSO DB'!G200)","v":""},{"$f":"IF('QSO DB'!$D200=\"\",\"\",'QSO DB'!H200)","v":""}]
[{"$f":"IF('QSO DB'!$D201=\"\",\"\",'QSO DB'!A201)","v":""},{"$f":"IF('QSO DB'!$D201=\"\",\"\",'QSO DB'!B201)","v":""},{"$f":"IF('QSO DB'!$D201=\"\",\"\",'QSO DB'!D201)","v":""},{"$f":"IF('QSO DB'!$D201=\"\",\"\",'QSO DB'!E201)","v":""},{"$f":"IF('QSO DB'!$D201=\"\",\"\",'QSO DB'!I201)","v":""},{"$f":"IF('QSO DB'!$D201=\"\",\"\",'QSO DB'!J201)","v":""},{"$f":"IF('QSO DB'!$D201=\"\",\"\",'QSO DB'!K201)","v":""},{"$f":"IF('QSO DB'!$D201=\"\",\"\",'QSO DB'!L201)","v":""},{"$f":"IF('QSO DB'!$D201=\"\",\"\",'QSO DB'!M201)","v":""},{"$f":"IF('QSO DB'!$D201=\"\",\"\",'QSO DB'!F201)","v":""},{"$f":"IF('QSO DB'!$D201=\"\",\"\",'QSO DB'!G201)","v":""},{"$f":"IF('QSO DB'!$D201=\"\",\"\",'QSO DB'!H201)","v":""}]
[{"$f":"IF('QSO DB'!$D202=\"\",\"\",'QSO DB'!A202)","v":""},{"$f":"IF('QSO DB'!$D202=\"\",\"\",'QSO DB'!B202)","v":""},{"$f":"IF('QSO DB'!$D202=\"\",\"\",'QSO DB'!D202)","v":""},{"$f":"IF('QSO DB'!$D202=\"\",\"\",'QSO DB'!E202)","v":""},{"$f":"IF('QSO DB'!$D202=\"\",\"\",'QSO DB'!I202)","v":""},{"$f":"IF('QSO DB'!$D202=\"\",\"\",'QSO DB'!J202)","v":""},{"$f":"IF('QSO DB'!$D202=\"\",\"\",'QSO DB'!K202)","v":""},{"$f":"IF('QSO DB'!$D202=\"\",\"\",'QSO DB'!L202)","v":""},{"$f":"IF('QSO DB'!$D202=\"\",\"\",'QSO DB'!M202)","v":""},{"$f":"IF('QSO DB'!$D202=\"\",\"\",'QSO DB'!F202)","v":""},{"$f":"IF('QSO DB'!$D202=\"\",\"\",'QSO DB'!G202)","v":""},{"$f":"IF('QSO DB'!$D202=\"\",\"\",'QSO DB'!H202)","v":""}]
[{"$f":"IF('QSO DB'!$D203=\"\",\"\",'QSO DB'!A203)","v":""},{"$f":"IF('QSO DB'!$D203=\"\",\"\",'QSO DB'!B203)","v":""},{"$f":"IF('QSO DB'!$D203=\"\",\"\",'QSO DB'!D203)","v":""},{"$f":"IF('QSO DB'!$D203=\"\",\"\",'QSO DB'!E203)","v":""},{"$f":"IF('QSO DB'!$D203=\"\",\"\",'QSO DB'!I203)","v":""},{"$f":"IF('QSO DB'!$D203=\"\",\"\",'QSO DB'!J203)","v":""},{"$f":"IF('QSO DB'!$D203=\"\",\"\",'QSO DB'!K203)","v":""},{"$f":"IF('QSO DB'!$D203=\"\",\"\",'QSO DB'!L203)","v":""},{"$f":"IF('QSO DB'!$D203=\"\",\"\",'QSO DB'!M203)","v":""},{"$f":"IF('QSO DB'!$D203=\"\",\"\",'QSO DB'!F203)","v":""},{"$f":"IF('QSO DB'!$D203=\"\",\"\",'QSO DB'!G203)","v":""},{"$f":"IF('QSO DB'!$D203=\"\",\"\",'QSO DB'!H203)","v":""}]
[{"$f":"IF('QSO DB'!$D204=\"\",\"\",'QSO DB'!A204)","v":""},{"$f":"IF('QSO DB'!$D204=\"\",\"\",'QSO DB'!B204)","v":""},{"$f":"IF('QSO DB'!$D204=\"\",\"\",'QSO DB'!D204)","v":""},{"$f":"IF('QSO DB'!$D204=\"\",\"\",'QSO DB'!E204)","v":""},{"$f":"IF('QSO DB'!$D204=\"\",\"\",'QSO DB'!I204)","v":""},{"$f":"IF('QSO DB'!$D204=\"\",\"\",'QSO DB'!J204)","v":""},{"$f":"IF('QSO DB'!$D204=\"\",\"\",'QSO DB'!K204)","v":""},{"$f":"IF('QSO DB'!$D204=\"\",\"\",'QSO DB'!L204)","v":""},{"$f":"IF('QSO DB'!$D204=\"\",\"\",'QSO DB'!M204)","v":""},{"$f":"IF('QSO DB'!$D204=\"\",\"\",'QSO DB'!F204)","v":""},{"$f":"IF('QSO DB'!$D204=\"\",\"\",'QSO DB'!G204)","v":""},{"$f":"IF('QSO DB'!$D204=\"\",\"\",'QSO DB'!H204)","v":""}]

{"sheet":"QSO DB","index":2,"n_rows":205,"n_cols":20,"rows_kept":205,"cut":false,"hidden":false,"merged":[[0,10,0,14]]}
["NOTE: If a QSO line has a data, blank yellow cells",null,null,null,null,null,null,null,null,null,"NOTE: Clicking Live or Post refreshes Time col\n<--- Select LIVE (auto time [during contest])"]
[null,null,null,"must be completely filled-up.",null,null,null,null,null,null,"  or POST (manual time entry [after contest])",null,null,null,null,null,"LiveTime",null,0]
[null,null,null,null,null,null,null,null,{"$f":"\"Current option: \"&IF(LT=1,\"LIVE UTC time stamp [during contest]\",\"POST (Manual UTC time entry [after contest]\")","v":"Current option: POST (Manual UTC time entry [after contest]"},null,null,null,null,"Dup QSO#",null,null,"Band",null,"UTC Time"]
["QSO","Call2&Band&Mode","QSO","Freq","Mode","RcvCALL","Rcv","Zip2","2026-08-22","Time","SntCALL","Snt","Zip1","Up ","Down",null,null,"PST","Live","Post"]
[1,{"$f":"IF(F5=\"\",A5,F5&Q5&UPPER(E5))","v":1},1,null,null,null,{"$f":"IF(ISBLANK($D5),\"\",IF(E5=\"CW\",\"599\",\"59\"))","v":""},null,{"$f":"IF(F5=\"\",\"\",I$4)","v":""},null,{"$f":"IF($F5=\"\",\"\",'Header Info'!F$12)","v":""},{"$f":"IF(ISBLANK($F5),\"\",IF(E5=\"CW\",\"599\",\"59\"))","v":""},{"$f":"IF($F5=\"\",\"\",'Header Info'!F$24)","v":""},"",{"$f":"IF(ISNA(VLOOKUP(B5,B6:M$204,8,0)),\"\",VLOOKUP(B5,B6:C$204,2,0))","v":""},{"$f":"IF(LT=1,IF(COUNTA(D5,E5,F5,H5)=0,\"\",IF(COUNTA(D5,E5,F5,H5)=4,\"\",\"<- FILL-UP ALL YELLOW CELLS\")),IF(COUNTA(D5,E5,J5,F5,H5)=0,\"\",IF(COUNTA(D5,E5,J5,F5,H5)=5,\"\",\"<- FILL-UP ALL YELLOW CELLS\")))","v":""},{"$f":"IF(D5=1240,\"23cm\",IF(D5=432,\"70cm\",IF(D5=50,\"6m\",\"2m\")))","v":"2m"},{"$f":"IF(F5<>\"\",IF(R5<>\"\",R5,NOW()),\"\")","v":""},{"$f":"IF(O5=\"\",\"\",IF(HOUR(AA5)+IF(HOUR(AA5)<8,16,-8)<10,\"0\",\"\")&HOUR(AA5)+IF(HOUR(AA5)<8,16,-8)&IF(MINUTE(AA5)<9,\"0\",\"\")&MINUTE(AA5))","v":""}]
[2,2,2,null,null,null,"",null,{"$f":"IF(D6=\"\",\"\",I$4)","v":""},null,{"$f":"IF($D6=\"\",\"\",'Header Info'!F$12)","v":""},{"$f":"IF(ISBLANK($D6),\"\",IF(E6=\"CW\",\"599\",\"59\"))","v":""},{"$f":"IF($D6=\"\",\"\",'Header Info'!F$24)","v":""},{"$f":"IF(ISNA(VLOOKUP(B6,B$5:M5,8,0)),\"\",VLOOKUP(B6,B$5:C6,2,0))","v":""},{"$f":"IF(ISNA(VLOOKUP(B6,B7:M$204,8,0)),\"\",VLOOKUP(B6,B7:C$204,2,0))","v":""},"","2m",{"$f":"IF(F6<>\"\",IF(R6<>\"\",R6,NOW()),\"\")","v":""},""]
[3,3,3,null,null,null,"",null,"",null,{"$f":"IF($D7=\"\",\"\",'Header Info'!F$12)","v":""},"",{"$f":"IF($D7=\"\",\"\",'Header Info'!F$24)","v":""},{"$f":"IF(ISNA(VLOOKUP(B7,B$5:M6,8,0)),\"\",VLOOKUP(B7,B$5:C7,2,0))","v":""},{"$f":"IF(ISNA(VLOOKUP(B7,B8:M$204,8,0)),\"\",VLOOKUP(B7,B8:C$204,2,0))","v":""},"","2m","",""]
[4,4,4,null,null,null,"",null,"",null,{"$f":"IF($D8=\"\",\"\",'Header Info'!F$12)","v":""},"",{"$f":"IF($D8=\"\",\"\",'Header Info'!F$24)","v":""},{"$f":"IF(ISNA(VLOOKUP(B8,B$5:M7,8,0)),\"\",VLOOKUP(B8,B$5:C8,2,0))","v":""},{"$f":"IF(ISNA(VLOOKUP(B8,B9:M$204,8,0)),\"\",VLOOKUP(B8,B9:C$204,2,0))","v":""},"","2m","",""]
[5,5,5,null,null,null,"",null,"",null,{"$f":"IF($D9=\"\",\"\",'Header Info'!F$12)","v":""},"",{"$f":"IF($D9=\"\",\"\",'Header Info'!F$24)","v":""},{"$f":"IF(ISNA(VLOOKUP(B9,B$5:M8,8,0)),\"\",VLOOKUP(B9,B$5:C9,2,0))","v":""},{"$f":"IF(ISNA(VLOOKUP(B9,B10:M$204,8,0)),\"\",VLOOKUP(B9,B10:C$204,2,0))","v":""},"","2m","",""]
[6,6,6,null,null,null,"",null,"",null,{"$f":"IF($D10=\"\",\"\",'Header Info'!F$12)","v":""},"",{"$f":"IF($D10=\"\",\"\",'Header Info'!F$24)","v":""},{"$f":"IF(ISNA(VLOOKUP(B10,B$5:M9,8,0)),\"\",VLOOKUP(B10,B$5:C10,2,0))","v":""},{"$f":"IF(ISNA(VLOOKUP(B10,B11:M$204,8,0)),\"\",VLOOKUP(B10,B11:C$204,2,0))","v":""},"","2m","",""]
[7,7,7,null,null,null,"",null,"",null,{"$f":"IF($D11=\"\",\"\",'Header Info'!F$12)","v":""},"",{"$f":"IF($D11=\"\",\"\",'Header Info'!F$24)","v":""},{"$f":"IF(ISNA(VLOOKUP(B11,B$5:M10,8,0)),\"\",VLOOKUP(B11,B$5:C11,2,0))","v":""},{"$f":"IF(ISNA(VLOOKUP(B11,B12:M$204,8,0)),\"\",VLOOKUP(B11,B12:C$204,2,0))","v":""},"","2m","",""]
[8,8,8,null,null,null,"",null,"",null,{"$f":"IF($D12=\"\",\"\",'Header Info'!F$12)","v":""},"",{"$f":"IF($D12=\"\",\"\",'Header Info'!F$24)","v":""},{"$f":"IF(ISNA(VLOOKUP(B12,B$5:M11,8,0)),\"\",VLOOKUP(B12,B$5:C12,2,0))","v":""},{"$f":"IF(ISNA(VLOOKUP(B12,B13:M$204,8,0)),\"\",VLOOKUP(B12,B13:C$204,2,0))","v":""},"","2m","",""]
[9,9,9,null,null,null,"",null,"",null,{"$f":"IF($D13=\"\",\"\",'Header Info'!F$12)","v":""},"",{"$f":"IF($D13=\"\",\"\",'Header Info'!F$24)","v":""},{"$f":"IF(ISNA(VLOOKUP(B13,B$5:M12,8,0)),\"\",VLOOKUP(B13,B$5:C13,2,0))","v":""},{"$f":"IF(ISNA(VLOOKUP(B13,B14:M$204,8,0)),\"\",VLOOKUP(B13,B14:C$204,2,0))","v":""},"","2m","",""]
[10,10,10,null,null,null,"",null,"",null,{"$f":"IF($D14=\"\",\"\",'Header Info'!F$12)","v":""},"",{"$f":"IF($D14=\"\",\"\",'Header Info'!F$24)","v":""},{"$f":"IF(ISNA(VLOOKUP(B14,B$5:M13,8,0)),\"\",VLOOKUP(B14,B$5:C14,2,0))","v":""},{"$f":"IF(ISNA(VLOOKUP(B14,B15:M$204,8,0)),\"\",VLOOKUP(B14,B15:C$204,2,0))","v":""},"","2m","",""]
[11,11,11,null,null,null,"",null,"",null,{"$f":"IF($D15=\"\",\"\",'Header Info'!F$12)","v":""},"",{"$f":"IF($D15=\"\",\"\",'Header Info'!F$24)","v":""},{"$f":"IF(ISNA(VLOOKUP(B15,B$5:M14,8,0)),\"\",VLOOKUP(B15,B$5:C15,2,0))","v":""},{"$f":"IF(ISNA(VLOOKUP(B15,B16:M$204,8,0)),\"\",VLOOKUP(B15,B16:C$204,2,0))","v":""},"","2m","",""]
[12,12,12,null,null,null,"",null,"",null,{"$f":"IF($D16=\"\",\"\",'Header Info'!F$12)","v":""},"",{"$f":"IF($D16=\"\",\"\",'Header Info'!F$24)","v":""},{"$f":"IF(ISNA(VLOOKUP(B16,B$5:M15,8,0)),\"\",VLOOKUP(B16,B$5:C16,2,0))","v":""},{"$f":"IF(ISNA(VLOOKUP(B16,B17:M$204,8,0)),\"\",VLOOKUP(B16,B17:C$204,2,0))","v":""},"","2m","",""]
[13,13,13,null,null,null,"",null,"",null,{"$f":"IF($D17=\"\",\"\",'Header Info'!F$12)","v":""},"",{"$f":"IF($D17=\"\",\"\",'Header Info'!F$24)","v":""},{"$f":"IF(ISNA(VLOOKUP(B17,B$5:M16,8,0)),\"\",VLOOKUP(B17,B$5:C17,2,0))","v":""},{"$f":"IF(ISNA(VLOOKUP(B17,B18:M$204,8,0)),\"\",VLOOKUP(B17,B18:C$204,2,0))","v":""},"","2m","",""]
[14,14,14,null,null,null,"",null,"",null,{"$f":"IF($D18=\"\",\"\",'Header Info'!F$12)","v":""},"",{"$f":"IF($D18=\"\",\"\",'Header Info'!F$24)","v":""},{"$f":"IF(ISNA(VLOOKUP(B18,B$5:M17,8,0)),\"\",VLOOKUP(B18,B$5:C18,2,0))","v":""},{"$f":"IF(ISNA(VLOOKUP(B18,B19:M$204,8,0)),\"\",VLOOKUP(B18,B19:C$204,2,0))","v":""},"","2m","",""]
[15,15,15,null,null,null,"",null,"",null,{"$f":"IF($D19=\"\",\"\",'Header Info'!F$12)","v":""},"",{"$f":"IF($D19=\"\",\"\",'Header Info'!F$24)","v":""},{"$f":"IF(ISNA(VLOOKUP(B19,B$5:M18,8,0)),\"\",VLOOKUP(B19,B$5:C19,2,0))","v":""},{"$f":"IF(ISNA(VLOOKUP(B19,B20:M$204,8,0)),\"\",VLOOKUP(B19,B20:C$204,2,0))","v":""},"","2m","",""]
[16,16,16,null,null,null,"",null,"",null,{"$f":"IF($D20=\"\",\"\",'Header Info'!F$12)","v":""},"",{"$f":"IF($D20=\"\",\"\",'Header Info'!F$24)","v":""},{"$f":"IF(ISNA(VLOOKUP(B20,B$5:M19,8,0)),\"\",VLOOKUP(B20,B$5:C20,2,0))","v":""},{"$f":"IF(ISNA(VLOOKUP(B20,B21:M$204,8,0)),\"\",VLOOKUP(B20,B21:C$204,2,0))","v":""},"","2m","",""]
[17,17,17,null,null,null,"",null,"",null,{"$f":"IF($D21=\"\",\"\",'Header Info'!F$12)","v":""},"",{"$f":"IF($D21=\"\",\"\",'Header Info'!F$24)","v":""},{"$f":"IF(ISNA(VLOOKUP(B21,B$5:M20,8,0)),\"\",VLOOKUP(B21,B$5:C21,2,0))","v":""},{"$f":"IF(ISNA(VLOOKUP(B21,B22:M$204,8,0)),\"\",VLOOKUP(B21,B22:C$204,2,0))","v":""},"","2m","",""]
[18,18,18,null,null,null,"",null,"",null,{"$f":"IF($D22=\"\",\"\",'Header Info'!F$12)","v":""},"",{"$f":"IF($D22=\"\",\"\",'Header Info'!F$24)","v":""},{"$f":"IF(ISNA(VLOOKUP(B22,B$5:M21,8,0)),\"\",VLOOKUP(B22,B$5:C22,2,0))","v":""},{"$f":"IF(ISNA(VLOOKUP(B22,B23:M$204,8,0)),\"\",VLOOKUP(B22,B23:C$204,2,0))","v":""},"","2m","",""]
[19,19,19,null,null,null,"",null,"",null,{"$f":"IF($D23=\"\",\"\",'Header Info'!F$12)","v":""},"",{"$f":"IF($D23=\"\",\"\",'Header Info'!F$24)","v":""},{"$f":"IF(ISNA(VLOOKUP(B23,B$5:M22,8,0)),\"\",VLOOKUP(B23,B$5:C23,2,0))","v":""},{"$f":"IF(ISNA(VLOOKUP(B23,B24:M$204,8,0)),\"\",VLOOKUP(B23,B24:C$204,2,0))","v":""},"","2m","",""]
[20,20,20,null,null,null,"",null,"",null,{"$f":"IF($D24=\"\",\"\",'Header Info'!F$12)","v":""},"",{"$f":"IF($D24=\"\",\"\",'Header Info'!F$24)","v":""},{"$f":"IF(ISNA(VLOOKUP(B24,B$5:M23,8,0)),\"\",VLOOKUP(B24,B$5:C24,2,0))","v":""},{"$f":"IF(ISNA(VLOOKUP(B24,B25:M$204,8,0)),\"\",VLOOKUP(B24,B25:C$204,2,0))","v":""},"","2m","",""]
[21,21,21,null,null,null,"",null,"",null,{"$f":"IF($D25=\"\",\"\",'Header Info'!F$12)","v":""},"",{"$f":"IF($D25=\"\",\"\",'Header Info'!F$24)","v":""},{"$f":"IF(ISNA(VLOOKUP(B25,B$5:M24,8,0)),\"\",VLOOKUP(B25,B$5:C25,2,0))","v":""},{"$f":"IF(ISNA(VLOOKUP(B25,B26:M$204,8,0)),\"\",VLOOKUP(B25,B26:C$204,2,0))","v":""},"","2m","",""]
[22,22,22,null,null,null,"",null,"",null,{"$f":"IF($D26=\"\",\"\",'Header Info'!F$12)","v":""},"",{"$f":"IF($D26=\"\",\"\",'Header Info'!F$24)","v":""},{"$f":"IF(ISNA(VLOOKUP(B26,B$5:M25,8,0)),\"\",VLOOKUP(B26,B$5:C26,2,0))","v":""},{"$f":"IF(ISNA(VLOOKUP(B26,B27:M$204,8,0)),\"\",VLOOKUP(B26,B27:C$204,2,0))","v":""},"","2m","",""]
[23,23,23,null,null,null,"",null,"",null,{"$f":"IF($D27=\"\",\"\",'Header Info'!F$12)","v":""},"",{"$f":"IF($D27=\"\",\"\",'Header Info'!F$24)","v":""},{"$f":"IF(ISNA(VLOOKUP(B27,B$5:M26,8,0)),\"\",VLOOKUP(B27,B$5:C27,2,0))","v":""},{"$f":"IF(ISNA(VLOOKUP(B27,B28:M$204,8,0)),\"\",VLOOKUP(B27,B28:C$204,2,0))","v":""},"","2m","",""]
[24,24,24,null,null,null,"",null,"",null,{"$f":"IF($D28=\"\",\"\",'Header Info'!F$12)","v":""},"",{"$f":"IF($D28=\"\",\"\",'Header Info'!F$24)","v":""},{"$f":"IF(ISNA(VLOOKUP(B28,B$5:M27,8,0)),\"\",VLOOKUP(B28,B$5:C28,2,0))","v":""},{"$f":"IF(ISNA(VLOOKUP(B28,B29:M$204,8,0)),\"\",VLOOKUP(B28,B29:C$204,2,0))","v":""},"","2m","",""]
[25,25,25,null,null,null,"",null,"",null,{"$f":"IF($D29=\"\",\"\",'Header Info'!F$12)","v":""},"",{"$f":"IF($D29=\"\",\"\",'Header Info'!F$24)","v":""},{"$f":"IF(ISNA(VLOOKUP(B29,B$5:M28,8,0)),\"\",VLOOKUP(B29,B$5:C29,2,0))","v":""},{"$f":"IF(ISNA(VLOOKUP(B29,B30:M$204,8,0)),\"\",VLOOKUP(B29,B30:C$204,2,0))","v":""},"","2m","",""]
[26,26,26,null,null,null,"",null,"",null,{"$f":"IF($D30=\"\",\"\",'Header Info'!F$12)","v":""},"",{"$f":"IF($D30=\"\",\"\",'Header Info'!F$24)","v":""},{"$f":"IF(ISNA(VLOOKUP(B30,B$5:M29,8,0)),\"\",VLOOKUP(B30,B$5:C30,2,0))","v":""},{"$f":"IF(ISNA(VLOOKUP(B30,B31:M$204,8,0)),\"\",VLOOKUP(B30,B31:C$204,2,0))","v":""},"","2m","",""]
[27,27,27,null,null,null,"",null,"",null,{"$f":"IF($D31=\"\",\"\",'Header Info'!F$12)","v":""},"",{"$f":"IF($D31=\"\",\"\",'Header Info'!F$24)","v":""},{"$f":"IF(ISNA(VLOOKUP(B31,B$5:M30,8,0)),\"\",VLOOKUP(B31,B$5:C31,2,0))","v":""},{"$f":"IF(ISNA(VLOOKUP(B31,B32:M$204,8,0)),\"\",VLOOKUP(B31,B32:C$204,2,0))","v":""},"","2m","",""]
[28,28,28,null,null,null,"",null,"",null,{"$f":"IF($D32=\"\",\"\",'Header Info'!F$12)","v":""},"",{"$f":"IF($D32=\"\",\"\",'Header Info'!F$24)","v":""},{"$f":"IF(ISNA(VLOOKUP(B32,B$5:M31,8,0)),\"\",VLOOKUP(B32,B$5:C32,2,0))","v":""},{"$f":"IF(ISNA(VLOOKUP(B32,B33:M$204,8,0)),\"\",VLOOKUP(B32,B33:C$204,2,0))","v":""},"","2m","",""]
[29,29,29,null,null,null,"",null,"",null,{"$f":"IF($D33=\"\",\"\",'Header Info'!F$12)","v":""},"",{"$f":"IF($D33=\"\",\"\",'Header Info'!F$24)","v":""},{"$f":"IF(ISNA(VLOOKUP(B33,B$5:M32,8,0)),\"\",VLOOKUP(B33,B$5:C33,2,0))","v":""},{"$f":"IF(ISNA(VLOOKUP(B33,B34:M$204,8,0)),\"\",VLOOKUP(B33,B34:C$204,2,0))","v":""},"","2m","",""]
[30,30,30,null,null,null,"",null,"",null,{"$f":"IF($D34=\"\",\"\",'Header Info'!F$12)","v":""},"",{"$f":"IF($D34=\"\",\"\",'Header Info'!F$24)","v":""},{"$f":"IF(ISNA(VLOOKUP(B34,B$5:M33,8,0)),\"\",VLOOKUP(B34,B$5:C34,2,0))","v":""},{"$f":"IF(ISNA(VLOOKUP(B34,B35:M$204,8,0)),\"\",VLOOKUP(B34,B35:C$204,2,0))","v":""},"","2m","",""]
[31,31,31,null,null,null,"",null,"",null,{"$f":"IF($D35=\"\",\"\",'Header Info'!F$12)","v":""},"",{"$f":"IF($D35=\"\",\"\",'Header Info'!F$24)","v":""},{"$f":"IF(ISNA(VLOOKUP(B35,B$5:M34,8,0)),\"\",VLOOKUP(B35,B$5:C35,2,0))","v":""},{"$f":"IF(ISNA(VLOOKUP(B35,B36:M$204,8,0)),\"\",VLOOKUP(B35,B36:C$204,2,0))","v":""},"","2m","",""]
[32,32,32,null,null,null,"",null,"",null,{"$f":"IF($D36=\"\",\"\",'Header Info'!F$12)","v":""},"",{"$f":"IF($D36=\"\",\"\",'Header Info'!F$24)","v":""},{"$f":"IF(ISNA(VLOOKUP(B36,B$5:M35,8,0)),\"\",VLOOKUP(B36,B$5:C36,2,0))","v":""},{"$f":"IF(ISNA(VLOOKUP(B36,B37:M$204,8,0)),\"\",VLOOKUP(B36,B37:C$204,2,0))","v":""},"","2m","",""]
[33,{"$f":"IF(F37=\"\",A37,F37&Q37&UPPER(E37))","v":33},33,null,null,null,"",null,{"$f":"IF(D37=\"\",\"\",I$4)","v":""},null,{"$f":"IF($D37=\"\",\"\",'Header Info'!F$12)","v":""},"",{"$f":"IF($D37=\"\",\"\",'Header Info'!F$24)","v":""},{"$f":"IF(ISNA(VLOOKUP(B37,B$5:M36,8,0)),\"\",VLOOKUP(B37,B$5:C37,2,0))","v":""},{"$f":"IF(ISNA(VLOOKUP(B37,B38:M$204,8,0)),\"\",VLOOKUP(B37,B38:C$204,2,0))","v":""},{"$f":"IF(LT=1,IF(COUNTA(D37,E37,F37,H37)=0,\"\",IF(COUNTA(D37,E37,F37,H37)=4,\"\",\"<- FILL-UP ALL YELLOW CELLS\")),IF(COUNTA(D37,E37,J37,F37,H37)=0,\"\",IF(COUNTA(D37,E37,J37,F37,H37)=5,\"\",\"<- FILL-UP ALL YELLOW CELLS\")))","v":""},{"$f":"IF(D37=1240,\"23cm\",IF(D37=432,\"70cm\",IF(D37=50,\"6m\",\"2m\")))","v":"2m"},"",{"$f":"IF(O37=\"\",\"\",IF(HOUR(AA37)+IF(HOUR(AA37)<8,16,-8)<10,\"0\",\"\")&HOUR(AA37)+IF(HOUR(AA37)<8,16,-8)&IF(MINUTE(AA37)<9,\"0\",\"\")&MINUTE(AA37))","v":""}]
[34,34,34,null,null,null,"",null,"",null,{"$f":"IF($D38=\"\",\"\",'Header Info'!F$12)","v":""},"",{"$f":"IF($D38=\"\",\"\",'Header Info'!F$24)","v":""},{"$f":"IF(ISNA(VLOOKUP(B38,B$5:M37,8,0)),\"\",VLOOKUP(B38,B$5:C38,2,0))","v":""},{"$f":"IF(ISNA(VLOOKUP(B38,B39:M$204,8,0)),\"\",VLOOKUP(B38,B39:C$204,2,0))","v":""},"","2m","",""]
[35,35,35,null,null,null,"",null,"",null,{"$f":"IF($D39=\"\",\"\",'Header Info'!F$12)","v":""},"",{"$f":"IF($D39=\"\",\"\",'Header Info'!F$24)","v":""},{"$f":"IF(ISNA(VLOOKUP(B39,B$5:M38,8,0)),\"\",VLOOKUP(B39,B$5:C39,2,0))","v":""},{"$f":"IF(ISNA(VLOOKUP(B39,B40:M$204,8,0)),\"\",VLOOKUP(B39,B40:C$204,2,0))","v":""},"","2m","",""]
[36,36,36,null,null,null,"",null,"",null,{"$f":"IF($D40=\"\",\"\",'Header Info'!F$12)","v":""},"",{"$f":"IF($D40=\"\",\"\",'Header Info'!F$24)","v":""},{"$f":"IF(ISNA(VLOOKUP(B40,B$5:M39,8,0)),\"\",VLOOKUP(B40,B$5:C40,2,0))","v":""},{"$f":"IF(ISNA(VLOOKUP(B40,B41:M$204,8,0)),\"\",VLOOKUP(B40,B41:C$204,2,0))","v":""},"","2m","",""]
[37,37,37,null,null,null,"",null,"",null,{"$f":"IF($D41=\"\",\"\",'Header Info'!F$12)","v":""},"",{"$f":"IF($D41=\"\",\"\",'Header Info'!F$24)","v":""},{"$f":"IF(ISNA(VLOOKUP(B41,B$5:M40,8,0)),\"\",VLOOKUP(B41,B$5:C41,2,0))","v":""},{"$f":"IF(ISNA(VLOOKUP(B41,B42:M$204,8,0)),\"\",VLOOKUP(B41,B42:C$204,2,0))","v":""},"","2m","",""]
[38,38,38,null,null,null,"",null,"",null,{"$f":"IF($D42=\"\",\"\",'Header Info'!F$12)","v":""},"",{"$f":"IF($D42=\"\",\"\",'Header Info'!F$24)","v":""},{"$f":"IF(ISNA(VLOOKUP(B42,B$5:M41,8,0)),\"\",VLOOKUP(B42,B$5:C42,2,0))","v":""},{"$f":"IF(ISNA(VLOOKUP(B42,B43:M$204,8,0)),\"\",VLOOKUP(B42,B43:C$204,2,0))","v":""},"","2m","",""]
[39,39,39,null,null,null,"",null,"",null,{"$f":"IF($D43=\"\",\"\",'Header Info'!F$12)","v":""},"",{"$f":"IF($D43=\"\",\"\",'Header Info'!F$24)","v":""},{"$f":"IF(ISNA(VLOOKUP(B43,B$5:M42,8,0)),\"\",VLOOKUP(B43,B$5:C43,2,0))","v":""},{"$f":"IF(ISNA(VLOOKUP(B43,B44:M$204,8,0)),\"\",VLOOKUP(B43,B44:C$204,2,0))","v":""},"","2m","",""]
[40,40,40,null,null,null,"",null,"",null,{"$f":"IF($D44=\"\",\"\",'Header Info'!F$12)","v":""},"",{"$f":"IF($D44=\"\",\"\",'Header Info'!F$24)","v":""},{"$f":"IF(ISNA(VLOOKUP(B44,B$5:M43,8,0)),\"\",VLOOKUP(B44,B$5:C44,2,0))","v":""},{"$f":"IF(ISNA(VLOOKUP(B44,B45:M$204,8,0)),\"\",VLOOKUP(B44,B45:C$204,2,0))","v":""},"","2m","",""]
[41,41,41,null,null,null,"",null,"",null,{"$f":"IF($D45=\"\",\"\",'Header Info'!F$12)","v":""},"",{"$f":"IF($D45=\"\",\"\",'Header Info'!F$24)","v":""},{"$f":"IF(ISNA(VLOOKUP(B45,B$5:M44,8,0)),\"\",VLOOKUP(B45,B$5:C45,2,0))","v":""},{"$f":"IF(ISNA(VLOOKUP(B45,B46:M$204,8,0)),\"\",VLOOKUP(B45,B46:C$204,2,0))","v":""},"","2m","",""]
[42,42,42,null,null,null,"",null,"",null,{"$f":"IF($D46=\"\",\"\",'Header Info'!F$12)","v":""},"",{"$f":"IF($D46=\"\",\"\",'Header Info'!F$24)","v":""},{"$f":"IF(ISNA(VLOOKUP(B46,B$5:M45,8,0)),\"\",VLOOKUP(B46,B$5:C46,2,0))","v":""},{"$f":"IF(ISNA(VLOOKUP(B46,B47:M$204,8,0)),\"\",VLOOKUP(B46,B47:C$204,2,0))","v":""},"","2m","",""]
[43,43,43,null,null,null,"",null,"",null,{"$f":"IF($D47=\"\",\"\",'Header Info'!F$12)","v":""},"",{"$f":"IF($D47=\"\",\"\",'Header Info'!F$24)","v":""},{"$f":"IF(ISNA(VLOOKUP(B47,B$5:M46,8,0)),\"\",VLOOKUP(B47,B$5:C47,2,0))","v":""},{"$f":"IF(ISNA(VLOOKUP(B47,B48:M$204,8,0)),\"\",VLOOKUP(B47,B48:C$204,2,0))","v":""},"","2m","",""]
[44,44,44,null,null,null,"",null,"",null,{"$f":"IF($D48=\"\",\"\",'Header Info'!F$12)","v":""},"",{"$f":"IF($D48=\"\",\"\",'Header Info'!F$24)","v":""},{"$f":"IF(ISNA(VLOOKUP(B48,B$5:M47,8,0)),\"\",VLOOKUP(B48,B$5:C48,2,0))","v":""},{"$f":"IF(ISNA(VLOOKUP(B48,B49:M$204,8,0)),\"\",VLOOKUP(B48,B49:C$204,2,0))","v":""},"","2m","",""]
[45,45,45,null,null,null,"",null,"",null,{"$f":"IF($D49=\"\",\"\",'Header Info'!F$12)","v":""},"",{"$f":"IF($D49=\"\",\"\",'Header Info'!F$24)","v":""},{"$f":"IF(ISNA(VLOOKUP(B49,B$5:M48,8,0)),\"\",VLOOKUP(B49,B$5:C49,2,0))","v":""},{"$f":"IF(ISNA(VLOOKUP(B49,B50:M$204,8,0)),\"\",VLOOKUP(B49,B50:C$204,2,0))","v":""},"","2m","",""]
[46,46,46,null,null,null,"",null,"",null,{"$f":"IF($D50=\"\",\"\",'Header Info'!F$12)","v":""},"",{"$f":"IF($D50=\"\",\"\",'Header Info'!F$24)","v":""},{"$f":"IF(ISNA(VLOOKUP(B50,B$5:M49,8,0)),\"\",VLOOKUP(B50,B$5:C50,2,0))","v":""},{"$f":"IF(ISNA(VLOOKUP(B50,B51:M$204,8,0)),\"\",VLOOKUP(B50,B51:C$204,2,0))","v":""},"","2m","",""]
[47,47,47,null,null,null,"",null,"",null,{"$f":"IF($D51=\"\",\"\",'Header Info'!F$12)","v":""},"",{"$f":"IF($D51=\"\",\"\",'Header Info'!F$24)","v":""},{"$f":"IF(ISNA(VLOOKUP(B51,B$5:M50,8,0)),\"\",VLOOKUP(B51,B$5:C51,2,0))","v":""},{"$f":"IF(ISNA(VLOOKUP(B51,B52:M$204,8,0)),\"\",VLOOKUP(B51,B52:C$204,2,0))","v":""},"","2m","",""]
[48,48,48,null,null,null,"",null,"",null,{"$f":"IF($D52=\"\",\"\",'Header Info'!F$12)","v":""},"",{"$f":"IF($D52=\"\",\"\",'Header Info'!F$24)","v":""},{"$f":"IF(ISNA(VLOOKUP(B52,B$5:M51,8,0)),\"\",VLOOKUP(B52,B$5:C52,2,0))","v":""},{"$f":"IF(ISNA(VLOOKUP(B52,B53:M$204,8,0)),\"\",VLOOKUP(B52,B53:C$204,2,0))","v":""},"","2m","",""]
[49,49,49,null,null,null,"",null,"",null,{"$f":"IF($D53=\"\",\"\",'Header Info'!F$12)","v":""},"",{"$f":"IF($D53=\"\",\"\",'Header Info'!F$24)","v":""},{"$f":"IF(ISNA(VLOOKUP(B53,B$5:M52,8,0)),\"\",VLOOKUP(B53,B$5:C53,2,0))","v":""},{"$f":"IF(ISNA(VLOOKUP(B53,B54:M$204,8,0)),\"\",VLOOKUP(B53,B54:C$204,2,0))","v":""},"","2m","",""]
[50,50,50,null,null,null,"",null,"",null,{"$f":"IF($D54=\"\",\"\",'Header Info'!F$12)","v":""},"",{"$f":"IF($D54=\"\",\"\",'Header Info'!F$24)","v":""},{"$f":"IF(ISNA(VLOOKUP(B54,B$5:M53,8,0)),\"\",VLOOKUP(B54,B$5:C54,2,0))","v":""},{"$f":"IF(ISNA(VLOOKUP(B54,B55:M$204,8,0)),\"\",VLOOKUP(B54,B55:C$204,2,0))","v":""},"","2m","",""]
[51,51,51,null,null,null,"",null,"",null,{"$f":"IF($D55=\"\",\"\",'Header Info'!F$12)","v":""},"",{"$f":"IF($D55=\"\",\"\",'Header Info'!F$24)","v":""},{"$f":"IF(ISNA(VLOOKUP(B55,B$5:M54,8,0)),\"\",VLOOKUP(B55,B$5:C55,2,0))","v":""},{"$f":"IF(ISNA(VLOOKUP(B55,B56:M$204,8,0)),\"\",VLOOKUP(B55,B56:C$204,2,0))","v":""},"","2m","",""]
[52,52,52,null,null,null,"",null,"",null,{"$f":"IF($D56=\"\",\"\",'Header Info'!F$12)","v":""},"",{"$f":"IF($D56=\"\",\"\",'Header Info'!F$24)","v":""},{"$f":"IF(ISNA(VLOOKUP(B56,B$5:M55,8,0)),\"\",VLOOKUP(B56,B$5:C56,2,0))","v":""},{"$f":"IF(ISNA(VLOOKUP(B56,B57:M$204,8,0)),\"\",VLOOKUP(B56,B57:C$204,2,0))","v":""},"","2m","",""]
[53,53,53,null,null,null,"",null,"",null,{"$f":"IF($D57=\"\",\"\",'Header Info'!F$12)","v":""},"",{"$f":"IF($D57=\"\",\"\",'Header Info'!F$24)","v":""},{"$f":"IF(ISNA(VLOOKUP(B57,B$5:M56,8,0)),\"\",VLOOKUP(B57,B$5:C57,2,0))","v":""},{"$f":"IF(ISNA(VLOOKUP(B57,B58:M$204,8,0)),\"\",VLOOKUP(B57,B58:C$204,2,0))","v":""},"","2m","",""]
[54,54,54,null,null,null,"",null,"",null,{"$f":"IF($D58=\"\",\"\",'Header Info'!F$12)","v":""},"",{"$f":"IF($D58=\"\",\"\",'Header Info'!F$24)","v":""},{"$f":"IF(ISNA(VLOOKUP(B58,B$5:M57,8,0)),\"\",VLOOKUP(B58,B$5:C58,2,0))","v":""},{"$f":"IF(ISNA(VLOOKUP(B58,B59:M$204,8,0)),\"\",VLOOKUP(B58,B59:C$204,2,0))","v":""},"","2m","",""]
[55,55,55,null,null,null,"",null,"",null,{"$f":"IF($D59=\"\",\"\",'Header Info'!F$12)","v":""},"",{"$f":"IF($D59=\"\",\"\",'Header Info'!F$24)","v":""},{"$f":"IF(ISNA(VLOOKUP(B59,B$5:M58,8,0)),\"\",VLOOKUP(B59,B$5:C59,2,0))","v":""},{"$f":"IF(ISNA(VLOOKUP(B59,B60:M$204,8,0)),\"\",VLOOKUP(B59,B60:C$204,2,0))","v":""},"","2m","",""]
[56,56,56,null,null,null,"",null,"",null,{"$f":"IF($D60=\"\",\"\",'Header Info'!F$12)","v":""},"",{"$f":"IF($D60=\"\",\"\",'Header Info'!F$24)","v":""},{"$f":"IF(ISNA(VLOOKUP(B60,B$5:M59,8,0)),\"\",VLOOKUP(B60,B$5:C60,2,0))","v":""},{"$f":"IF(ISNA(VLOOKUP(B60,B61:M$204,8,0)),\"\",VLOOKUP(B60,B61:C$204,2,0))","v":""},"","2m","",""]
[57,57,57,null,null,null,"",null,"",null,{"$f":"IF($D61=\"\",\"\",'Header Info'!F$12)","v":""},"",{"$f":"IF($D61=\"\",\"\",'Header Info'!F$24)","v":""},{"$f":"IF(ISNA(VLOOKUP(B61,B$5:M60,8,0)),\"\",VLOOKUP(B61,B$5:C61,2,0))","v":""},{"$f":"IF(ISNA(VLOOKUP(B61,B62:M$204,8,0)),\"\",VLOOKUP(B61,B62:C$204,2,0))","v":""},"","2m","",""]
[58,58,58,null,null,null,"",null,"",null,{"$f":"IF($D62=\"\",\"\",'Header Info'!F$12)","v":""},"",{"$f":"IF($D62=\"\",\"\",'Header Info'!F$24)","v":""},{"$f":"IF(ISNA(VLOOKUP(B62,B$5:M61,8,0)),\"\",VLOOKUP(B62,B$5:C62,2,0))","v":""},{"$f":"IF(ISNA(VLOOKUP(B62,B63:M$204,8,0)),\"\",VLOOKUP(B62,B63:C$204,2,0))","v":""},"","2m","",""]
[59,59,59,null,null,null,"",null,"",null,{"$f":"IF($D63=\"\",\"\",'Header Info'!F$12)","v":""},"",{"$f":"IF($D63=\"\",\"\",'Header Info'!F$24)","v":""},{"$f":"IF(ISNA(VLOOKUP(B63,B$5:M62,8,0)),\"\",VLOOKUP(B63,B$5:C63,2,0))","v":""},{"$f":"IF(ISNA(VLOOKUP(B63,B64:M$204,8,0)),\"\",VLOOKUP(B63,B64:C$204,2,0))","v":""},"","2m","",""]
[60,60,60,null,null,null,"",null,"",null,{"$f":"IF($D64=\"\",\"\",'Header Info'!F$12)","v":""},"",{"$f":"IF($D64=\"\",\"\",'Header Info'!F$24)","v":""},{"$f":"IF(ISNA(VLOOKUP(B64,B$5:M63,8,0)),\"\",VLOOKUP(B64,B$5:C64,2,0))","v":""},{"$f":"IF(ISNA(VLOOKUP(B64,B65:M$204,8,0)),\"\",VLOOKUP(B64,B65:C$204,2,0))","v":""},"","2m","",""]
[61,61,61,null,null,null,"",null,"",null,{"$f":"IF($D65=\"\",\"\",'Header Info'!F$12)","v":""},"",{"$f":"IF($D65=\"\",\"\",'Header Info'!F$24)","v":""},{"$f":"IF(ISNA(VLOOKUP(B65,B$5:M64,8,0)),\"\",VLOOKUP(B65,B$5:C65,2,0))","v":""},{"$f":"IF(ISNA(VLOOKUP(B65,B66:M$204,8,0)),\"\",VLOOKUP(B65,B66:C$204,2,0))","v":""},"","2m","",""]
[62,62,62,null,null,null,"",null,"",null,{"$f":"IF($D66=\"\",\"\",'Header Info'!F$12)","v":""},"",{"$f":"IF($D66=\"\",\"\",'Header Info'!F$24)","v":""},{"$f":"IF(ISNA(VLOOKUP(B66,B$5:M65,8,0)),\"\",VLOOKUP(B66,B$5:C66,2,0))","v":""},{"$f":"IF(ISNA(VLOOKUP(B66,B67:M$204,8,0)),\"\",VLOOKUP(B66,B67:C$204,2,0))","v":""},"","2m","",""]
[63,63,63,null,null,null,"",null,"",null,{"$f":"IF($D67=\"\",\"\",'Header Info'!F$12)","v":""},"",{"$f":"IF($D67=\"\",\"\",'Header Info'!F$24)","v":""},{"$f":"IF(ISNA(VLOOKUP(B67,B$5:M66,8,0)),\"\",VLOOKUP(B67,B$5:C67,2,0))","v":""},{"$f":"IF(ISNA(VLOOKUP(B67,B68:M$204,8,0)),\"\",VLOOKUP(B67,B68:C$204,2,0))","v":""},"","2m","",""]
[64,64,64,null,null,null,"",null,"",null,{"$f":"IF($D68=\"\",\"\",'Header Info'!F$12)","v":""},"",{"$f":"IF($D68=\"\",\"\",'Header Info'!F$24)","v":""},{"$f":"IF(ISNA(VLOOKUP(B68,B$5:M67,8,0)),\"\",VLOOKUP(B68,B$5:C68,2,0))","v":""},{"$f":"IF(ISNA(VLOOKUP(B68,B69:M$204,8,0)),\"\",VLOOKUP(B68,B69:C$204,2,0))","v":""},"","2m","",""]
[65,{"$f":"IF(F69=\"\",A69,F69&Q69&UPPER(E69))","v":65},65,null,null,null,{"$f":"IF(ISBLANK($D69),\"\",IF(E69=\"CW\",\"599\",\"59\"))","v":""},null,{"$f":"IF(D69=\"\",\"\",I$4)","v":""},null,{"$f":"IF($D69=\"\",\"\",'Header Info'!F$12)","v":""},{"$f":"IF(ISBLANK($D69),\"\",IF(E69=\"CW\",\"599\",\"59\"))","v":""},{"$f":"IF($D69=\"\",\"\",'Header Info'!F$24)","v":""},{"$f":"IF(ISNA(VLOOKUP(B69,B$5:M68,8,0)),\"\",VLOOKUP(B69,B$5:C69,2,0))","v":""},{"$f":"IF(ISNA(VLOOKUP(B69,B70:M$204,8,0)),\"\",VLOOKUP(B69,B70:C$204,2,0))","v":""},{"$f":"IF(LT=1,IF(COUNTA(D69,E69,F69,H69)=0,\"\",IF(COUNTA(D69,E69,F69,H69)=4,\"\",\"<- FILL-UP ALL YELLOW CELLS\")),IF(COUNTA(D69,E69,J69,F69,H69)=0,\"\",IF(COUNTA(D69,E69,J69,F69,H69)=5,\"\",\"<- FILL-UP ALL YELLOW CELLS\")))","v":""},{"$f":"IF(D69=1240,\"23cm\",IF(D69=432,\"70cm\",IF(D69=50,\"6m\",\"2m\")))","v":"2m"},"",{"$f":"IF(O69=\"\",\"\",IF(HOUR(AA69)+IF(HOUR(AA69)<8,16,-8)<10,\"0\",\"\")&HOUR(AA69)+IF(HOUR(AA69)<8,16,-8)&IF(MINUTE(AA69)<9,\"0\",\"\")&MINUTE(AA69))","v":""}]
[66,66,66,null,null,null,"",null,"",null,{"$f":"IF($D70=\"\",\"\",'Header Info'!F$12)","v":""},"",{"$f":"IF($D70=\"\",\"\",'Header Info'!F$24)","v":""},{"$f":"IF(ISNA(VLOOKUP(B70,B$5:M69,8,0)),\"\",VLOOKUP(B70,B$5:C70,2,0))","v":""},{"$f":"IF(ISNA(VLOOKUP(B70,B71:M$204,8,0)),\"\",VLOOKUP(B70,B71:C$204,2,0))","v":""},"","2m",{"$f":"IF(F70<>\"\",IF(R70<>\"\",R70,NOW()),\"\")","v":""},""]
[67,67,67,null,null,null,"",null,"",null,{"$f":"IF($D71=\"\",\"\",'Header Info'!F$12)","v":""},"",{"$f":"IF($D71=\"\",\"\",'Header Info'!F$24)","v":""},{"$f":"IF(ISNA(VLOOKUP(B71,B$5:M70,8,0)),\"\",VLOOKUP(B71,B$5:C71,2,0))","v":""},{"$f":"IF(ISNA(VLOOKUP(B71,B72:M$204,8,0)),\"\",VLOOKUP(B71,B72:C$204,2,0))","v":""},"","2m","",""]
[68,68,68,null,null,null,"",null,"",null,{"$f":"IF($D72=\"\",\"\",'Header Info'!F$12)","v":""},"",{"$f":"IF($D72=\"\",\"\",'Header Info'!F$24)","v":""},{"$f":"IF(ISNA(VLOOKUP(B72,B$5:M71,8,0)),\"\",VLOOKUP(B72,B$5:C72,2,0))","v":""},{"$f":"IF(ISNA(VLOOKUP(B72,B73:M$204,8,0)),\"\",VLOOKUP(B72,B73:C$204,2,0))","v":""},"","2m","",""]
[69,69,69,null,null,null,"",null,"",null,{"$f":"IF($D73=\"\",\"\",'Header Info'!F$12)","v":""},"",{"$f":"IF($D73=\"\",\"\",'Header Info'!F$24)","v":""},{"$f":"IF(ISNA(VLOOKUP(B73,B$5:M72,8,0)),\"\",VLOOKUP(B73,B$5:C73,2,0))","v":""},{"$f":"IF(ISNA(VLOOKUP(B73,B74:M$204,8,0)),\"\",VLOOKUP(B73,B74:C$204,2,0))","v":""},"","2m","",""]
[70,70,70,null,null,null,"",null,"",null,{"$f":"IF($D74=\"\",\"\",'Header Info'!F$12)","v":""},"",{"$f":"IF($D74=\"\",\"\",'Header Info'!F$24)","v":""},{"$f":"IF(ISNA(VLOOKUP(B74,B$5:M73,8,0)),\"\",VLOOKUP(B74,B$5:C74,2,0))","v":""},{"$f":"IF(ISNA(VLOOKUP(B74,B75:M$204,8,0)),\"\",VLOOKUP(B74,B75:C$204,2,0))","v":""},"","2m","",""]
[71,71,71,null,null,null,"",null,"",null,{"$f":"IF($D75=\"\",\"\",'Header Info'!F$12)","v":""},"",{"$f":"IF($D75=\"\",\"\",'Header Info'!F$24)","v":""},{"$f":"IF(ISNA(VLOOKUP(B75,B$5:M74,8,0)),\"\",VLOOKUP(B75,B$5:C75,2,0))","v":""},{"$f":"IF(ISNA(VLOOKUP(B75,B76:M$204,8,0)),\"\",VLOOKUP(B75,B76:C$204,2,0))","v":""},"","2m","",""]
[72,72,72,null,null,null,"",null,"",null,{"$f":"IF($D76=\"\",\"\",'Header Info'!F$12)","v":""},"",{"$f":"IF($D76=\"\",\"\",'Header Info'!F$24)","v":""},{"$f":"IF(ISNA(VLOOKUP(B76,B$5:M75,8,0)),\"\",VLOOKUP(B76,B$5:C76,2,0))","v":""},{"$f":"IF(ISNA(VLOOKUP(B76,B77:M$204,8,0)),\"\",VLOOKUP(B76,B77:C$204,2,0))","v":""},"","2m","",""]
[73,73,73,null,null,null,"",null,"",null,{"$f":"IF($D77=\"\",\"\",'Header Info'!F$12)","v":""},"",{"$f":"IF($D77=\"\",\"\",'Header Info'!F$24)","v":""},{"$f":"IF(ISNA(VLOOKUP(B77,B$5:M76,8,0)),\"\",VLOOKUP(B77,B$5:C77,2,0))","v":""},{"$f":"IF(ISNA(VLOOKUP(B77,B78:M$204,8,0)),\"\",VLOOKUP(B77,B78:C$204,2,0))","v":""},"","2m","",""]
[74,74,74,null,null,null,"",null,"",null,{"$f":"IF($D78=\"\",\"\",'Header Info'!F$12)","v":""},"",{"$f":"IF($D78=\"\",\"\",'Header Info'!F$24)","v":""},{"$f":"IF(ISNA(VLOOKUP(B78,B$5:M77,8,0)),\"\",VLOOKUP(B78,B$5:C78,2,0))","v":""},{"$f":"IF(ISNA(VLOOKUP(B78,B79:M$204,8,0)),\"\",VLOOKUP(B78,B79:C$204,2,0))","v":""},"","2m","",""]
[75,75,75,null,null,null,"",null,"",null,{"$f":"IF($D79=\"\",\"\",'Header Info'!F$12)","v":""},"",{"$f":"IF($D79=\"\",\"\",'Header Info'!F$24)","v":""},{"$f":"IF(ISNA(VLOOKUP(B79,B$5:M78,8,0)),\"\",VLOOKUP(B79,B$5:C79,2,0))","v":""},{"$f":"IF(ISNA(VLOOKUP(B79,B80:M$204,8,0)),\"\",VLOOKUP(B79,B80:C$204,2,0))","v":""},"","2m","",""]
[76,76,76,null,null,null,"",null,"",null,{"$f":"IF($D80=\"\",\"\",'Header Info'!F$12)","v":""},"",{"$f":"IF($D80=\"\",\"\",'Header Info'!F$24)","v":""},{"$f":"IF(ISNA(VLOOKUP(B80,B$5:M79,8,0)),\"\",VLOOKUP(B80,B$5:C80,2,0))","v":""},{"$f":"IF(ISNA(VLOOKUP(B80,B81:M$204,8,0)),\"\",VLOOKUP(B80,B81:C$204,2,0))","v":""},"","2m","",""]
[77,77,77,null,null,null,"",null,"",null,{"$f":"IF($D81=\"\",\"\",'Header Info'!F$12)","v":""},"",{"$f":"IF($D81=\"\",\"\",'Header Info'!F$24)","v":""},{"$f":"IF(ISNA(VLOOKUP(B81,B$5:M80,8,0)),\"\",VLOOKUP(B81,B$5:C81,2,0))","v":""},{"$f":"IF(ISNA(VLOOKUP(B81,B82:M$204,8,0)),\"\",VLOOKUP(B81,B82:C$204,2,0))","v":""},"","2m","",""]
[78,78,78,null,null,null,"",null,"",null,{"$f":"IF($D82=\"\",\"\",'Header Info'!F$12)","v":""},"",{"$f":"IF($D82=\"\",\"\",'Header Info'!F$24)","v":""},{"$f":"IF(ISNA(VLOOKUP(B82,B$5:M81,8,0)),\"\",VLOOKUP(B82,B$5:C82,2,0))","v":""},{"$f":"IF(ISNA(VLOOKUP(B82,B83:M$204,8,0)),\"\",VLOOKUP(B82,B83:C$204,2,0))","v":""},"","2m","",""]
[79,79,79,null,null,null,"",null,"",null,{"$f":"IF($D83=\"\",\"\",'Header Info'!F$12)","v":""},"",{"$f":"IF($D83=\"\",\"\",'Header Info'!F$24)","v":""},{"$f":"IF(ISNA(VLOOKUP(B83,B$5:M82,8,0)),\"\",VLOOKUP(B83,B$5:C83,2,0))","v":""},{"$f":"IF(ISNA(VLOOKUP(B83,B84:M$204,8,0)),\"\",VLOOKUP(B83,B84:C$204,2,0))","v":""},"","2m","",""]
[80,80,80,null,null,null,"",null,"",null,{"$f":"IF($D84=\"\",\"\",'Header Info'!F$12)","v":""},"",{"$f":"IF($D84=\"\",\"\",'Header Info'!F$24)","v":""},{"$f":"IF(ISNA(VLOOKUP(B84,B$5:M83,8,0)),\"\",VLOOKUP(B84,B$5:C84,2,0))","v":""},{"$f":"IF(ISNA(VLOOKUP(B84,B85:M$204,8,0)),\"\",VLOOKUP(B84,B85:C$204,2,0))","v":""},"","2m","",""]
[81,81,81,null,null,null,"",null,"",null,{"$f":"IF($D85=\"\",\"\",'Header Info'!F$12)","v":""},"",{"$f":"IF($D85=\"\",\"\",'Header Info'!F$24)","v":""},{"$f":"IF(ISNA(VLOOKUP(B85,B$5:M84,8,0)),\"\",VLOOKUP(B85,B$5:C85,2,0))","v":""},{"$f":"IF(ISNA(VLOOKUP(B85,B86:M$204,8,0)),\"\",VLOOKUP(B85,B86:C$204,2,0))","v":""},"","2m","",""]
[82,82,82,null,null,null,"",null,"",null,{"$f":"IF($D86=\"\",\"\",'Header Info'!F$12)","v":""},"",{"$f":"IF($D86=\"\",\"\",'Header Info'!F$24)","v":""},{"$f":"IF(ISNA(VLOOKUP(B86,B$5:M85,8,0)),\"\",VLOOKUP(B86,B$5:C86,2,0))","v":""},{"$f":"IF(ISNA(VLOOKUP(B86,B87:M$204,8,0)),\"\",VLOOKUP(B86,B87:C$204,2,0))","v":""},"","2m","",""]
[83,83,83,null,null,null,"",null,"",null,{"$f":"IF($D87=\"\",\"\",'Header Info'!F$12)","v":""},"",{"$f":"IF($D87=\"\",\"\",'Header Info'!F$24)","v":""},{"$f":"IF(ISNA(VLOOKUP(B87,B$5:M86,8,0)),\"\",VLOOKUP(B87,B$5:C87,2,0))","v":""},{"$f":"IF(ISNA(VLOOKUP(B87,B88:M$204,8,0)),\"\",VLOOKUP(B87,B88:C$204,2,0))","v":""},"","2m","",""]
[84,84,84,null,null,null,"",null,"",null,{"$f":"IF($D88=\"\",\"\",'Header Info'!F$12)","v":""},"",{"$f":"IF($D88=\"\",\"\",'Header Info'!F$24)","v":""},{"$f":"IF(ISNA(VLOOKUP(B88,B$5:M87,8,0)),\"\",VLOOKUP(B88,B$5:C88,2,0))","v":""},{"$f":"IF(ISNA(VLOOKUP(B88,B89:M$204,8,0)),\"\",VLOOKUP(B88,B89:C$204,2,0))","v":""},"","2m","",""]
[85,85,85,null,null,null,"",null,"",null,{"$f":"IF($D89=\"\",\"\",'Header Info'!F$12)","v":""},"",{"$f":"IF($D89=\"\",\"\",'Header Info'!F$24)","v":""},{"$f":"IF(ISNA(VLOOKUP(B89,B$5:M88,8,0)),\"\",VLOOKUP(B89,B$5:C89,2,0))","v":""},{"$f":"IF(ISNA(VLOOKUP(B89,B90:M$204,8,0)),\"\",VLOOKUP(B89,B90:C$204,2,0))","v":""},"","2m","",""]
[86,86,86,null,null,null,"",null,"",null,{"$f":"IF($D90=\"\",\"\",'Header Info'!F$12)","v":""},"",{"$f":"IF($D90=\"\",\"\",'Header Info'!F$24)","v":""},{"$f":"IF(ISNA(VLOOKUP(B90,B$5:M89,8,0)),\"\",VLOOKUP(B90,B$5:C90,2,0))","v":""},{"$f":"IF(ISNA(VLOOKUP(B90,B91:M$204,8,0)),\"\",VLOOKUP(B90,B91:C$204,2,0))","v":""},"","2m","",""]
[87,87,87,null,null,null,"",null,"",null,{"$f":"IF($D91=\"\",\"\",'Header Info'!F$12)","v":""},"",{"$f":"IF($D91=\"\",\"\",'Header Info'!F$24)","v":""},{"$f":"IF(ISNA(VLOOKUP(B91,B$5:M90,8,0)),\"\",VLOOKUP(B91,B$5:C91,2,0))","v":""},{"$f":"IF(ISNA(VLOOKUP(B91,B92:M$204,8,0)),\"\",VLOOKUP(B91,B92:C$204,2,0))","v":""},"","2m","",""]
[88,88,88,null,null,null,"",null,"",null,{"$f":"IF($D92=\"\",\"\",'Header Info'!F$12)","v":""},"",{"$f":"IF($D92=\"\",\"\",'Header Info'!F$24)","v":""},{"$f":"IF(ISNA(VLOOKUP(B92,B$5:M91,8,0)),\"\",VLOOKUP(B92,B$5:C92,2,0))","v":""},{"$f":"IF(ISNA(VLOOKUP(B92,B93:M$204,8,0)),\"\",VLOOKUP(B92,B93:C$204,2,0))","v":""},"","2m","",""]
[89,89,89,null,null,null,"",null,"",null,{"$f":"IF($D93=\"\",\"\",'Header Info'!F$12)","v":""},"",{"$f":"IF($D93=\"\",\"\",'Header Info'!F$24)","v":""},{"$f":"IF(ISNA(VLOOKUP(B93,B$5:M92,8,0)),\"\",VLOOKUP(B93,B$5:C93,2,0))","v":""},{"$f":"IF(ISNA(VLOOKUP(B93,B94:M$204,8,0)),\"\",VLOOKUP(B93,B94:C$204,2,0))","v":""},"","2m","",""]
[90,90,90,null,null,null,"",null,"",null,{"$f":"IF($D94=\"\",\"\",'Header Info'!F$12)","v":""},"",{"$f":"IF($D94=\"\",\"\",'Header Info'!F$24)","v":""},{"$f":"IF(ISNA(VLOOKUP(B94,B$5:M93,8,0)),\"\",VLOOKUP(B94,B$5:C94,2,0))","v":""},{"$f":"IF(ISNA(VLOOKUP(B94,B95:M$204,8,0)),\"\",VLOOKUP(B94,B95:C$204,2,0))","v":""},"","2m","",""]
[91,91,91,null,null,null,"",null,"",null,{"$f":"IF($D95=\"\",\"\",'Header Info'!F$12)","v":""},"",{"$f":"IF($D95=\"\",\"\",'Header Info'!F$24)","v":""},{"$f":"IF(ISNA(VLOOKUP(B95,B$5:M94,8,0)),\"\",VLOOKUP(B95,B$5:C95,2,0))","v":""},{"$f":"IF(ISNA(VLOOKUP(B95,B96:M$204,8,0)),\"\",VLOOKUP(B95,B96:C$204,2,0))","v":""},"","2m","",""]
[92,92,92,null,null,null,"",null,"",null,{"$f":"IF($D96=\"\",\"\",'Header Info'!F$12)","v":""},"",{"$f":"IF($D96=\"\",\"\",'Header Info'!F$24)","v":""},{"$f":"IF(ISNA(VLOOKUP(B96,B$5:M95,8,0)),\"\",VLOOKUP(B96,B$5:C96,2,0))","v":""},{"$f":"IF(ISNA(VLOOKUP(B96,B97:M$204,8,0)),\"\",VLOOKUP(B96,B97:C$204,2,0))","v":""},"","2m","",""]
[93,93,93,null,null,null,"",null,"",null,{"$f":"IF($D97=\"\",\"\",'Header Info'!F$12)","v":""},"",{"$f":"IF($D97=\"\",\"\",'Header Info'!F$24)","v":""},{"$f":"IF(ISNA(VLOOKUP(B97,B$5:M96,8,0)),\"\",VLOOKUP(B97,B$5:C97,2,0))","v":""},{"$f":"IF(ISNA(VLOOKUP(B97,B98:M$204,8,0)),\"\",VLOOKUP(B97,B98:C$204,2,0))","v":""},"","2m","",""]
[94,94,94,null,null,null,"",null,"",null,{"$f":"IF($D98=\"\",\"\",'Header Info'!F$12)","v":""},"",{"$f":"IF($D98=\"\",\"\",'Header Info'!F$24)","v":""},{"$f":"IF(ISNA(VLOOKUP(B98,B$5:M97,8,0)),\"\",VLOOKUP(B98,B$5:C98,2,0))","v":""},{"$f":"IF(ISNA(VLOOKUP(B98,B99:M$204,8,0)),\"\",VLOOKUP(B98,B99:C$204,2,0))","v":""},"","2m","",""]
[95,95,95,null,null,null,"",null,"",null,{"$f":"IF($D99=\"\",\"\",'Header Info'!F$12)","v":""},"",{"$f":"IF($D99=\"\",\"\",'Header Info'!F$24)","v":""},{"$f":"IF(ISNA(VLOOKUP(B99,B$5:M98,8,0)),\"\",VLOOKUP(B99,B$5:C99,2,0))","v":""},{"$f":"IF(ISNA(VLOOKUP(B99,B100:M$204,8,0)),\"\",VLOOKUP(B99,B100:C$204,2,0))","v":""},"","2m","",""]
[96,96,96,null,null,null,"",null,"",null,{"$f":"IF($D100=\"\",\"\",'Header Info'!F$12)","v":""},"",{"$f":"IF($D100=\"\",\"\",'Header Info'!F$24)","v":""},{"$f":"IF(ISNA(VLOOKUP(B100,B$5:M99,8,0)),\"\",VLOOKUP(B100,B$5:C100,2,0))","v":""},{"$f":"IF(ISNA(VLOOKUP(B100,B101:M$204,8,0)),\"\",VLOOKUP(B100,B101:C$204,2,0))","v":""},"","2m","",""]
[97,{"$f":"IF(F101=\"\",A101,F101&Q101&UPPER(E101))","v":97},97,null,null,null,"",null,{"$f":"IF(D101=\"\",\"\",I$4)","v":""},null,{"$f":"IF($D101=\"\",\"\",'Header Info'!F$12)","v":""},"",{"$f":"IF($D101=\"\",\"\",'Header Info'!F$24)","v":""},{"$f":"IF(ISNA(VLOOKUP(B101,B$5:M100,8,0)),\"\",VLOOKUP(B101,B$5:C101,2,0))","v":""},{"$f":"IF(ISNA(VLOOKUP(B101,B102:M$204,8,0)),\"\",VLOOKUP(B101,B102:C$204,2,0))","v":""},{"$f":"IF(LT=1,IF(COUNTA(D101,E101,F101,H101)=0,\"\",IF(COUNTA(D101,E101,F101,H101)=4,\"\",\"<- FILL-UP ALL YELLOW CELLS\")),IF(COUNTA(D101,E101,J101,F101,H101)=0,\"\",IF(COUNTA(D101,E101,J101,F101,H101)=5,\"\",\"<- FILL-UP ALL YELLOW CELLS\")))","v":""},{"$f":"IF(D101=1240,\"23cm\",IF(D101=432,\"70cm\",IF(D101=50,\"6m\",\"2m\")))","v":"2m"},"",{"$f":"IF(O101=\"\",\"\",IF(HOUR(AA101)+IF(HOUR(AA101)<8,16,-8)<10,\"0\",\"\")&HOUR(AA101)+IF(HOUR(AA101)<8,16,-8)&IF(MINUTE(AA101)<9,\"0\",\"\")&MINUTE(AA101))","v":""}]
[98,98,98,null,null,null,"",null,"",null,{"$f":"IF($D102=\"\",\"\",'Header Info'!F$12)","v":""},"",{"$f":"IF($D102=\"\",\"\",'Header Info'!F$24)","v":""},{"$f":"IF(ISNA(VLOOKUP(B102,B$5:M101,8,0)),\"\",VLOOKUP(B102,B$5:C102,2,0))","v":""},{"$f":"IF(ISNA(VLOOKUP(B102,B103:M$204,8,0)),\"\",VLOOKUP(B102,B103:C$204,2,0))","v":""},"","2m","",""]
[99,99,99,null,null,null,"",null,"",null,{"$f":"IF($D103=\"\",\"\",'Header Info'!F$12)","v":""},"",{"$f":"IF($D103=\"\",\"\",'Header Info'!F$24)","v":""},{"$f":"IF(ISNA(VLOOKUP(B103,B$5:M102,8,0)),\"\",VLOOKUP(B103,B$5:C103,2,0))","v":""},{"$f":"IF(ISNA(VLOOKUP(B103,B104:M$204,8,0)),\"\",VLOOKUP(B103,B104:C$204,2,0))","v":""},"","2m","",""]
[100,100,100,null,null,null,"",null,"",null,{"$f":"IF($D104=\"\",\"\",'Header Info'!F$12)","v":""},"",{"$f":"IF($D104=\"\",\"\",'Header Info'!F$24)","v":""},{"$f":"IF(ISNA(VLOOKUP(B104,B$5:M103,8,0)),\"\",VLOOKUP(B104,B$5:C104,2,0))","v":""},{"$f":"IF(ISNA(VLOOKUP(B104,B105:M$204,8,0)),\"\",VLOOKUP(B104,B105:C$204,2,0))","v":""},"","2m","",""]
[101,101,101,null,null,null,"",null,"",null,{"$f":"IF($D105=\"\",\"\",'Header Info'!F$12)","v":""},"",{"$f":"IF($D105=\"\",\"\",'Header Info'!F$24)","v":""},{"$f":"IF(ISNA(VLOOKUP(B105,B$5:M104,8,0)),\"\",VLOOKUP(B105,B$5:C105,2,0))","v":""},{"$f":"IF(ISNA(VLOOKUP(B105,B106:M$204,8,0)),\"\",VLOOKUP(B105,B106:C$204,2,0))","v":""},"","2m","",""]
[102,102,102,null,null,null,"",null,"",null,{"$f":"IF($D106=\"\",\"\",'Header Info'!F$12)","v":""},"",{"$f":"IF($D106=\"\",\"\",'Header Info'!F$24)","v":""},{"$f":"IF(ISNA(VLOOKUP(B106,B$5:M105,8,0)),\"\",VLOOKUP(B106,B$5:C106,2,0))","v":""},{"$f":"IF(ISNA(VLOOKUP(B106,B107:M$204,8,0)),\"\",VLOOKUP(B106,B107:C$204,2,0))","v":""},"","2m","",""]
[103,103,103,null,null,null,"",null,"",null,{"$f":"IF($D107=\"\",\"\",'Header Info'!F$12)","v":""},"",{"$f":"IF($D107=\"\",\"\",'Header Info'!F$24)","v":""},{"$f":"IF(ISNA(VLOOKUP(B107,B$5:M106,8,0)),\"\",VLOOKUP(B107,B$5:C107,2,0))","v":""},{"$f":"IF(ISNA(VLOOKUP(B107,B108:M$204,8,0)),\"\",VLOOKUP(B107,B108:C$204,2,0))","v":""},"","2m","",""]
[104,104,104,null,null,null,"",null,"",null,{"$f":"IF($D108=\"\",\"\",'Header Info'!F$12)","v":""},"",{"$f":"IF($D108=\"\",\"\",'Header Info'!F$24)","v":""},{"$f":"IF(ISNA(VLOOKUP(B108,B$5:M107,8,0)),\"\",VLOOKUP(B108,B$5:C108,2,0))","v":""},{"$f":"IF(ISNA(VLOOKUP(B108,B109:M$204,8,0)),\"\",VLOOKUP(B108,B109:C$204,2,0))","v":""},"","2m","",""]
[105,105,105,null,null,null,"",null,"",null,{"$f":"IF($D109=\"\",\"\",'Header Info'!F$12)","v":""},"",{"$f":"IF($D109=\"\",\"\",'Header Info'!F$24)","v":""},{"$f":"IF(ISNA(VLOOKUP(B109,B$5:M108,8,0)),\"\",VLOOKUP(B109,B$5:C109,2,0))","v":""},{"$f":"IF(ISNA(VLOOKUP(B109,B110:M$204,8,0)),\"\",VLOOKUP(B109,B110:C$204,2,0))","v":""},"","2m","",""]
[106,106,106,null,null,null,"",null,"",null,{"$f":"IF($D110=\"\",\"\",'Header Info'!F$12)","v":""},"",{"$f":"IF($D110=\"\",\"\",'Header Info'!F$24)","v":""},{"$f":"IF(ISNA(VLOOKUP(B110,B$5:M109,8,0)),\"\",VLOOKUP(B110,B$5:C110,2,0))","v":""},{"$f":"IF(ISNA(VLOOKUP(B110,B111:M$204,8,0)),\"\",VLOOKUP(B110,B111:C$204,2,0))","v":""},"","2m","",""]
[107,107,107,null,null,null,"",null,"",null,{"$f":"IF($D111=\"\",\"\",'Header Info'!F$12)","v":""},"",{"$f":"IF($D111=\"\",\"\",'Header Info'!F$24)","v":""},{"$f":"IF(ISNA(VLOOKUP(B111,B$5:M110,8,0)),\"\",VLOOKUP(B111,B$5:C111,2,0))","v":""},{"$f":"IF(ISNA(VLOOKUP(B111,B112:M$204,8,0)),\"\",VLOOKUP(B111,B112:C$204,2,0))","v":""},"","2m","",""]
[108,108,108,null,null,null,"",null,"",null,{"$f":"IF($D112=\"\",\"\",'Header Info'!F$12)","v":""},"",{"$f":"IF($D112=\"\",\"\",'Header Info'!F$24)","v":""},{"$f":"IF(ISNA(VLOOKUP(B112,B$5:M111,8,0)),\"\",VLOOKUP(B112,B$5:C112,2,0))","v":""},{"$f":"IF(ISNA(VLOOKUP(B112,B113:M$204,8,0)),\"\",VLOOKUP(B112,B113:C$204,2,0))","v":""},"","2m","",""]
[109,109,109,null,null,null,"",null,"",null,{"$f":"IF($D113=\"\",\"\",'Header Info'!F$12)","v":""},"",{"$f":"IF($D113=\"\",\"\",'Header Info'!F$24)","v":""},{"$f":"IF(ISNA(VLOOKUP(B113,B$5:M112,8,0)),\"\",VLOOKUP(B113,B$5:C113,2,0))","v":""},{"$f":"IF(ISNA(VLOOKUP(B113,B114:M$204,8,0)),\"\",VLOOKUP(B113,B114:C$204,2,0))","v":""},"","2m","",""]
[110,110,110,null,null,null,"",null,"",null,{"$f":"IF($D114=\"\",\"\",'Header Info'!F$12)","v":""},"",{"$f":"IF($D114=\"\",\"\",'Header Info'!F$24)","v":""},{"$f":"IF(ISNA(VLOOKUP(B114,B$5:M113,8,0)),\"\",VLOOKUP(B114,B$5:C114,2,0))","v":""},{"$f":"IF(ISNA(VLOOKUP(B114,B115:M$204,8,0)),\"\",VLOOKUP(B114,B115:C$204,2,0))","v":""},"","2m","",""]
[111,111,111,null,null,null,"",null,"",null,{"$f":"IF($D115=\"\",\"\",'Header Info'!F$12)","v":""},"",{"$f":"IF($D115=\"\",\"\",'Header Info'!F$24)","v":""},{"$f":"IF(ISNA(VLOOKUP(B115,B$5:M114,8,0)),\"\",VLOOKUP(B115,B$5:C115,2,0))","v":""},{"$f":"IF(ISNA(VLOOKUP(B115,B116:M$204,8,0)),\"\",VLOOKUP(B115,B116:C$204,2,0))","v":""},"","2m","",""]
[112,112,112,null,null,null,"",null,"",null,{"$f":"IF($D116=\"\",\"\",'Header Info'!F$12)","v":""},"",{"$f":"IF($D116=\"\",\"\",'Header Info'!F$24)","v":""},{"$f":"IF(ISNA(VLOOKUP(B116,B$5:M115,8,0)),\"\",VLOOKUP(B116,B$5:C116,2,0))","v":""},{"$f":"IF(ISNA(VLOOKUP(B116,B117:M$204,8,0)),\"\",VLOOKUP(B116,B117:C$204,2,0))","v":""},"","2m","",""]
[113,113,113,null,null,null,"",null,"",null,{"$f":"IF($D117=\"\",\"\",'Header Info'!F$12)","v":""},"",{"$f":"IF($D117=\"\",\"\",'Header Info'!F$24)","v":""},{"$f":"IF(ISNA(VLOOKUP(B117,B$5:M116,8,0)),\"\",VLOOKUP(B117,B$5:C117,2,0))","v":""},{"$f":"IF(ISNA(VLOOKUP(B117,B118:M$204,8,0)),\"\",VLOOKUP(B117,B118:C$204,2,0))","v":""},"","2m","",""]
[114,114,114,null,null,null,"",null,"",null,{"$f":"IF($D118=\"\",\"\",'Header Info'!F$12)","v":""},"",{"$f":"IF($D118=\"\",\"\",'Header Info'!F$24)","v":""},{"$f":"IF(ISNA(VLOOKUP(B118,B$5:M117,8,0)),\"\",VLOOKUP(B118,B$5:C118,2,0))","v":""},{"$f":"IF(ISNA(VLOOKUP(B118,B119:M$204,8,0)),\"\",VLOOKUP(B118,B119:C$204,2,0))","v":""},"","2m","",""]
[115,115,115,null,null,null,"",null,"",null,{"$f":"IF($D119=\"\",\"\",'Header Info'!F$12)","v":""},"",{"$f":"IF($D119=\"\",\"\",'Header Info'!F$24)","v":""},{"$f":"IF(ISNA(VLOOKUP(B119,B$5:M118,8,0)),\"\",VLOOKUP(B119,B$5:C119,2,0))","v":""},{"$f":"IF(ISNA(VLOOKUP(B119,B120:M$204,8,0)),\"\",VLOOKUP(B119,B120:C$204,2,0))","v":""},"","2m","",""]
[116,116,116,null,null,null,"",null,"",null,{"$f":"IF($D120=\"\",\"\",'Header Info'!F$12)","v":""},"",{"$f":"IF($D120=\"\",\"\",'Header Info'!F$24)","v":""},{"$f":"IF(ISNA(VLOOKUP(B120,B$5:M119,8,0)),\"\",VLOOKUP(B120,B$5:C120,2,0))","v":""},{"$f":"IF(ISNA(VLOOKUP(B120,B121:M$204,8,0)),\"\",VLOOKUP(B120,B121:C$204,2,0))","v":""},"","2m","",""]
[117,117,117,null,null,null,"",null,"",null,{"$f":"IF($D121=\"\",\"\",'Header Info'!F$12)","v":""},"",{"$f":"IF($D121=\"\",\"\",'Header Info'!F$24)","v":""},{"$f":"IF(ISNA(VLOOKUP(B121,B$5:M120,8,0)),\"\",VLOOKUP(B121,B$5:C121,2,0))","v":""},{"$f":"IF(ISNA(VLOOKUP(B121,B122:M$204,8,0)),\"\",VLOOKUP(B121,B122:C$204,2,0))","v":""},"","2m","",""]
[118,118,118,null,null,null,"",null,"",null,{"$f":"IF($D122=\"\",\"\",'Header Info'!F$12)","v":""},"",{"$f":"IF($D122=\"\",\"\",'Header Info'!F$24)","v":""},{"$f":"IF(ISNA(VLOOKUP(B122,B$5:M121,8,0)),\"\",VLOOKUP(B122,B$5:C122,2,0))","v":""},{"$f":"IF(ISNA(VLOOKUP(B122,B123:M$204,8,0)),\"\",VLOOKUP(B122,B123:C$204,2,0))","v":""},"","2m","",""]
[119,119,119,null,null,null,"",null,"",null,{"$f":"IF($D123=\"\",\"\",'Header Info'!F$12)","v":""},"",{"$f":"IF($D123=\"\",\"\",'Header Info'!F$24)","v":""},{"$f":"IF(ISNA(VLOOKUP(B123,B$5:M122,8,0)),\"\",VLOOKUP(B123,B$5:C123,2,0))","v":""},{"$f":"IF(ISNA(VLOOKUP(B123,B124:M$204,8,0)),\"\",VLOOKUP(B123,B124:C$204,2,0))","v":""},"","2m","",""]
[120,120,120,null,null,null,"",null,"",null,{"$f":"IF($D124=\"\",\"\",'Header Info'!F$12)","v":""},"",{"$f":"IF($D124=\"\",\"\",'Header Info'!F$24)","v":""},{"$f":"IF(ISNA(VLOOKUP(B124,B$5:M123,8,0)),\"\",VLOOKUP(B124,B$5:C124,2,0))","v":""},{"$f":"IF(ISNA(VLOOKUP(B124,B125:M$204,8,0)),\"\",VLOOKUP(B124,B125:C$204,2,0))","v":""},"","2m","",""]
[121,121,121,null,null,null,"",null,"",null,{"$f":"IF($D125=\"\",\"\",'Header Info'!F$12)","v":""},"",{"$f":"IF($D125=\"\",\"\",'Header Info'!F$24)","v":""},{"$f":"IF(ISNA(VLOOKUP(B125,B$5:M124,8,0)),\"\",VLOOKUP(B125,B$5:C125,2,0))","v":""},{"$f":"IF(ISNA(VLOOKUP(B125,B126:M$204,8,0)),\"\",VLOOKUP(B125,B126:C$204,2,0))","v":""},"","2m","",""]
[122,122,122,null,null,null,"",null,"",null,{"$f":"IF($D126=\"\",\"\",'Header Info'!F$12)","v":""},"",{"$f":"IF($D126=\"\",\"\",'Header Info'!F$24)","v":""},{"$f":"IF(ISNA(VLOOKUP(B126,B$5:M125,8,0)),\"\",VLOOKUP(B126,B$5:C126,2,0))","v":""},{"$f":"IF(ISNA(VLOOKUP(B126,B127:M$204,8,0)),\"\",VLOOKUP(B126,B127:C$204,2,0))","v":""},"","2m","",""]
[123,123,123,null,null,null,"",null,"",null,{"$f":"IF($D127=\"\",\"\",'Header Info'!F$12)","v":""},"",{"$f":"IF($D127=\"\",\"\",'Header Info'!F$24)","v":""},{"$f":"IF(ISNA(VLOOKUP(B127,B$5:M126,8,0)),\"\",VLOOKUP(B127,B$5:C127,2,0))","v":""},{"$f":"IF(ISNA(VLOOKUP(B127,B128:M$204,8,0)),\"\",VLOOKUP(B127,B128:C$204,2,0))","v":""},"","2m","",""]
[124,124,124,null,null,null,"",null,"",null,{"$f":"IF($D128=\"\",\"\",'Header Info'!F$12)","v":""},"",{"$f":"IF($D128=\"\",\"\",'Header Info'!F$24)","v":""},{"$f":"IF(ISNA(VLOOKUP(B128,B$5:M127,8,0)),\"\",VLOOKUP(B128,B$5:C128,2,0))","v":""},{"$f":"IF(ISNA(VLOOKUP(B128,B129:M$204,8,0)),\"\",VLOOKUP(B128,B129:C$204,2,0))","v":""},"","2m","",""]
[125,125,125,null,null,null,"",null,"",null,{"$f":"IF($D129=\"\",\"\",'Header Info'!F$12)","v":""},"",{"$f":"IF($D129=\"\",\"\",'Header Info'!F$24)","v":""},{"$f":"IF(ISNA(VLOOKUP(B129,B$5:M128,8,0)),\"\",VLOOKUP(B129,B$5:C129,2,0))","v":""},{"$f":"IF(ISNA(VLOOKUP(B129,B130:M$204,8,0)),\"\",VLOOKUP(B129,B130:C$204,2,0))","v":""},"","2m","",""]
[126,126,126,null,null,null,"",null,"",null,{"$f":"IF($D130=\"\",\"\",'Header Info'!F$12)","v":""},"",{"$f":"IF($D130=\"\",\"\",'Header Info'!F$24)","v":""},{"$f":"IF(ISNA(VLOOKUP(B130,B$5:M129,8,0)),\"\",VLOOKUP(B130,B$5:C130,2,0))","v":""},{"$f":"IF(ISNA(VLOOKUP(B130,B131:M$204,8,0)),\"\",VLOOKUP(B130,B131:C$204,2,0))","v":""},"","2m","",""]
[127,127,127,null,null,null,"",null,"",null,{"$f":"IF($D131=\"\",\"\",'Header Info'!F$12)","v":""},"",{"$f":"IF($D131=\"\",\"\",'Header Info'!F$24)","v":""},{"$f":"IF(ISNA(VLOOKUP(B131,B$5:M130,8,0)),\"\",VLOOKUP(B131,B$5:C131,2,0))","v":""},{"$f":"IF(ISNA(VLOOKUP(B131,B132:M$204,8,0)),\"\",VLOOKUP(B131,B132:C$204,2,0))","v":""},"","2m","",""]
[128,128,128,null,null,null,"",null,"",null,{"$f":"IF($D132=\"\",\"\",'Header Info'!F$12)","v":""},"",{"$f":"IF($D132=\"\",\"\",'Header Info'!F$24)","v":""},{"$f":"IF(ISNA(VLOOKUP(B132,B$5:M131,8,0)),\"\",VLOOKUP(B132,B$5:C132,2,0))","v":""},{"$f":"IF(ISNA(VLOOKUP(B132,B133:M$204,8,0)),\"\",VLOOKUP(B132,B133:C$204,2,0))","v":""},"","2m","",""]
[129,{"$f":"IF(F133=\"\",A133,F133&Q133&UPPER(E133))","v":129},129,null,null,null,{"$f":"IF(ISBLANK($D133),\"\",IF(E133=\"CW\",\"599\",\"59\"))","v":""},null,{"$f":"IF(D133=\"\",\"\",I$4)","v":""},null,{"$f":"IF($D133=\"\",\"\",'Header Info'!F$12)","v":""},{"$f":"IF(ISBLANK($D133),\"\",IF(E133=\"CW\",\"599\",\"59\"))","v":""},{"$f":"IF($D133=\"\",\"\",'Header Info'!F$24)","v":""},{"$f":"IF(ISNA(VLOOKUP(B133,B$5:M132,8,0)),\"\",VLOOKUP(B133,B$5:C133,2,0))","v":""},{"$f":"IF(ISNA(VLOOKUP(B133,B134:M$204,8,0)),\"\",VLOOKUP(B133,B134:C$204,2,0))","v":""},{"$f":"IF(LT=1,IF(COUNTA(D133,E133,F133,H133)=0,\"\",IF(COUNTA(D133,E133,F133,H133)=4,\"\",\"<- FILL-UP ALL YELLOW CELLS\")),IF(COUNTA(D133,E133,J133,F133,H133)=0,\"\",IF(COUNTA(D133,E133,J133,F133,H133)=5,\"\",\"<- FILL-UP ALL YELLOW CELLS\")))","v":""},{"$f":"IF(D133=1240,\"23cm\",IF(D133=432,\"70cm\",IF(D133=50,\"6m\",\"2m\")))","v":"2m"},"",{"$f":"IF(O133=\"\",\"\",IF(HOUR(AA133)+IF(HOUR(AA133)<8,16,-8)<10,\"0\",\"\")&HOUR(AA133)+IF(HOUR(AA133)<8,16,-8)&IF(MINUTE(AA133)<9,\"0\",\"\")&MINUTE(AA133))","v":""}]
[130,130,130,null,null,null,"",null,"",null,{"$f":"IF($D134=\"\",\"\",'Header Info'!F$12)","v":""},"",{"$f":"IF($D134=\"\",\"\",'Header Info'!F$24)","v":""},{"$f":"IF(ISNA(VLOOKUP(B134,B$5:M133,8,0)),\"\",VLOOKUP(B134,B$5:C134,2,0))","v":""},{"$f":"IF(ISNA(VLOOKUP(B134,B135:M$204,8,0)),\"\",VLOOKUP(B134,B135:C$204,2,0))","v":""},"","2m",{"$f":"IF(F134<>\"\",IF(R134<>\"\",R134,NOW()),\"\")","v":""},""]
[131,131,131,null,null,null,"",null,"",null,{"$f":"IF($D135=\"\",\"\",'Header Info'!F$12)","v":""},"",{"$f":"IF($D135=\"\",\"\",'Header Info'!F$24)","v":""},{"$f":"IF(ISNA(VLOOKUP(B135,B$5:M134,8,0)),\"\",VLOOKUP(B135,B$5:C135,2,0))","v":""},{"$f":"IF(ISNA(VLOOKUP(B135,B136:M$204,8,0)),\"\",VLOOKUP(B135,B136:C$204,2,0))","v":""},"","2m","",""]
[132,132,132,null,null,null,"",null,"",null,{"$f":"IF($D136=\"\",\"\",'Header Info'!F$12)","v":""},"",{"$f":"IF($D136=\"\",\"\",'Header Info'!F$24)","v":""},{"$f":"IF(ISNA(VLOOKUP(B136,B$5:M135,8,0)),\"\",VLOOKUP(B136,B$5:C136,2,0))","v":""},{"$f":"IF(ISNA(VLOOKUP(B136,B137:M$204,8,0)),\"\",VLOOKUP(B136,B137:C$204,2,0))","v":""},"","2m","",""]
[133,133,133,null,null,null,"",null,"",null,{"$f":"IF($D137=\"\",\"\",'Header Info'!F$12)","v":""},"",{"$f":"IF($D137=\"\",\"\",'Header Info'!F$24)","v":""},{"$f":"IF(ISNA(VLOOKUP(B137,B$5:M136,8,0)),\"\",VLOOKUP(B137,B$5:C137,2,0))","v":""},{"$f":"IF(ISNA(VLOOKUP(B137,B138:M$204,8,0)),\"\",VLOOKUP(B137,B138:C$204,2,0))","v":""},"","2m","",""]
[134,134,134,null,null,null,"",null,"",null,{"$f":"IF($D138=\"\",\"\",'Header Info'!F$12)","v":""},"",{"$f":"IF($D138=\"\",\"\",'Header Info'!F$24)","v":""},{"$f":"IF(ISNA(VLOOKUP(B138,B$5:M137,8,0)),\"\",VLOOKUP(B138,B$5:C138,2,0))","v":""},{"$f":"IF(ISNA(VLOOKUP(B138,B139:M$204,8,0)),\"\",VLOOKUP(B138,B139:C$204,2,0))","v":""},"","2m","",""]
[135,135,135,null,null,null,"",null,"",null,{"$f":"IF($D139=\"\",\"\",'Header Info'!F$12)","v":""},"",{"$f":"IF($D139=\"\",\"\",'Header Info'!F$24)","v":""},{"$f":"IF(ISNA(VLOOKUP(B139,B$5:M138,8,0)),\"\",VLOOKUP(B139,B$5:C139,2,0))","v":""},{"$f":"IF(ISNA(VLOOKUP(B139,B140:M$204,8,0)),\"\",VLOOKUP(B139,B140:C$204,2,0))","v":""},"","2m","",""]
[136,136,136,null,null,null,"",null,"",null,{"$f":"IF($D140=\"\",\"\",'Header Info'!F$12)","v":""},"",{"$f":"IF($D140=\"\",\"\",'Header Info'!F$24)","v":""},{"$f":"IF(ISNA(VLOOKUP(B140,B$5:M139,8,0)),\"\",VLOOKUP(B140,B$5:C140,2,0))","v":""},{"$f":"IF(ISNA(VLOOKUP(B140,B141:M$204,8,0)),\"\",VLOOKUP(B140,B141:C$204,2,0))","v":""},"","2m","",""]
[137,137,137,null,null,null,"",null,"",null,{"$f":"IF($D141=\"\",\"\",'Header Info'!F$12)","v":""},"",{"$f":"IF($D141=\"\",\"\",'Header Info'!F$24)","v":""},{"$f":"IF(ISNA(VLOOKUP(B141,B$5:M140,8,0)),\"\",VLOOKUP(B141,B$5:C141,2,0))","v":""},{"$f":"IF(ISNA(VLOOKUP(B141,B142:M$204,8,0)),\"\",VLOOKUP(B141,B142:C$204,2,0))","v":""},"","2m","",""]
[138,138,138,null,null,null,"",null,"",null,{"$f":"IF($D142=\"\",\"\",'Header Info'!F$12)","v":""},"",{"$f":"IF($D142=\"\",\"\",'Header Info'!F$24)","v":""},{"$f":"IF(ISNA(VLOOKUP(B142,B$5:M141,8,0)),\"\",VLOOKUP(B142,B$5:C142,2,0))","v":""},{"$f":"IF(ISNA(VLOOKUP(B142,B143:M$204,8,0)),\"\",VLOOKUP(B142,B143:C$204,2,0))","v":""},"","2m","",""]
[139,139,139,null,null,null,"",null,"",null,{"$f":"IF($D143=\"\",\"\",'Header Info'!F$12)","v":""},"",{"$f":"IF($D143=\"\",\"\",'Header Info'!F$24)","v":""},{"$f":"IF(ISNA(VLOOKUP(B143,B$5:M142,8,0)),\"\",VLOOKUP(B143,B$5:C143,2,0))","v":""},{"$f":"IF(ISNA(VLOOKUP(B143,B144:M$204,8,0)),\"\",VLOOKUP(B143,B144:C$204,2,0))","v":""},"","2m","",""]
[140,140,140,null,null,null,"",null,"",null,{"$f":"IF($D144=\"\",\"\",'Header Info'!F$12)","v":""},"",{"$f":"IF($D144=\"\",\"\",'Header Info'!F$24)","v":""},{"$f":"IF(ISNA(VLOOKUP(B144,B$5:M143,8,0)),\"\",VLOOKUP(B144,B$5:C144,2,0))","v":""},{"$f":"IF(ISNA(VLOOKUP(B144,B145:M$204,8,0)),\"\",VLOOKUP(B144,B145:C$204,2,0))","v":""},"","2m","",""]
[141,141,141,null,null,null,"",null,"",null,{"$f":"IF($D145=\"\",\"\",'Header Info'!F$12)","v":""},"",{"$f":"IF($D145=\"\",\"\",'Header Info'!F$24)","v":""},{"$f":"IF(ISNA(VLOOKUP(B145,B$5:M144,8,0)),\"\",VLOOKUP(B145,B$5:C145,2,0))","v":""},{"$f":"IF(ISNA(VLOOKUP(B145,B146:M$204,8,0)),\"\",VLOOKUP(B145,B146:C$204,2,0))","v":""},"","2m","",""]
[142,142,142,null,null,null,"",null,"",null,{"$f":"IF($D146=\"\",\"\",'Header Info'!F$12)","v":""},"",{"$f":"IF($D146=\"\",\"\",'Header Info'!F$24)","v":""},{"$f":"IF(ISNA(VLOOKUP(B146,B$5:M145,8,0)),\"\",VLOOKUP(B146,B$5:C146,2,0))","v":""},{"$f":"IF(ISNA(VLOOKUP(B146,B147:M$204,8,0)),\"\",VLOOKUP(B146,B147:C$204,2,0))","v":""},"","2m","",""]
[143,143,143,null,null,null,"",null,"",null,{"$f":"IF($D147=\"\",\"\",'Header Info'!F$12)","v":""},"",{"$f":"IF($D147=\"\",\"\",'Header Info'!F$24)","v":""},{"$f":"IF(ISNA(VLOOKUP(B147,B$5:M146,8,0)),\"\",VLOOKUP(B147,B$5:C147,2,0))","v":""},{"$f":"IF(ISNA(VLOOKUP(B147,B148:M$204,8,0)),\"\",VLOOKUP(B147,B148:C$204,2,0))","v":""},"","2m","",""]
[144,144,144,null,null,null,"",null,"",null,{"$f":"IF($D148=\"\",\"\",'Header Info'!F$12)","v":""},"",{"$f":"IF($D148=\"\",\"\",'Header Info'!F$24)","v":""},{"$f":"IF(ISNA(VLOOKUP(B148,B$5:M147,8,0)),\"\",VLOOKUP(B148,B$5:C148,2,0))","v":""},{"$f":"IF(ISNA(VLOOKUP(B148,B149:M$204,8,0)),\"\",VLOOKUP(B148,B149:C$204,2,0))","v":""},"","2m","",""]
[145,145,145,null,null,null,"",null,"",null,{"$f":"IF($D149=\"\",\"\",'Header Info'!F$12)","v":""},"",{"$f":"IF($D149=\"\",\"\",'Header Info'!F$24)","v":""},{"$f":"IF(ISNA(VLOOKUP(B149,B$5:M148,8,0)),\"\",VLOOKUP(B149,B$5:C149,2,0))","v":""},{"$f":"IF(ISNA(VLOOKUP(B149,B150:M$204,8,0)),\"\",VLOOKUP(B149,B150:C$204,2,0))","v":""},"","2m","",""]
[146,146,146,null,null,null,"",null,"",null,{"$f":"IF($D150=\"\",\"\",'Header Info'!F$12)","v":""},"",{"$f":"IF($D150=\"\",\"\",'Header Info'!F$24)","v":""},{"$f":"IF(ISNA(VLOOKUP(B150,B$5:M149,8,0)),\"\",VLOOKUP(B150,B$5:C150,2,0))","v":""},{"$f":"IF(ISNA(VLOOKUP(B150,B151:M$204,8,0)),\"\",VLOOKUP(B150,B151:C$204,2,0))","v":""},"","2m","",""]
[147,147,147,null,null,null,"",null,"",null,{"$f":"IF($D151=\"\",\"\",'Header Info'!F$12)","v":""},"",{"$f":"IF($D151=\"\",\"\",'Header Info'!F$24)","v":""},{"$f":"IF(ISNA(VLOOKUP(B151,B$5:M150,8,0)),\"\",VLOOKUP(B151,B$5:C151,2,0))","v":""},{"$f":"IF(ISNA(VLOOKUP(B151,B152:M$204,8,0)),\"\",VLOOKUP(B151,B152:C$204,2,0))","v":""},"","2m","",""]
[148,148,148,null,null,null,"",null,"",null,{"$f":"IF($D152=\"\",\"\",'Header Info'!F$12)","v":""},"",{"$f":"IF($D152=\"\",\"\",'Header Info'!F$24)","v":""},{"$f":"IF(ISNA(VLOOKUP(B152,B$5:M151,8,0)),\"\",VLOOKUP(B152,B$5:C152,2,0))","v":""},{"$f":"IF(ISNA(VLOOKUP(B152,B153:M$204,8,0)),\"\",VLOOKUP(B152,B153:C$204,2,0))","v":""},"","2m","",""]
[149,149,149,null,null,null,"",null,"",null,{"$f":"IF($D153=\"\",\"\",'Header Info'!F$12)","v":""},"",{"$f":"IF($D153=\"\",\"\",'Header Info'!F$24)","v":""},{"$f":"IF(ISNA(VLOOKUP(B153,B$5:M152,8,0)),\"\",VLOOKUP(B153,B$5:C153,2,0))","v":""},{"$f":"IF(ISNA(VLOOKUP(B153,B154:M$204,8,0)),\"\",VLOOKUP(B153,B154:C$204,2,0))","v":""},"","2m","",""]
[150,150,150,null,null,null,"",null,"",null,{"$f":"IF($D154=\"\",\"\",'Header Info'!F$12)","v":""},"",{"$f":"IF($D154=\"\",\"\",'Header Info'!F$24)","v":""},{"$f":"IF(ISNA(VLOOKUP(B154,B$5:M153,8,0)),\"\",VLOOKUP(B154,B$5:C154,2,0))","v":""},{"$f":"IF(ISNA(VLOOKUP(B154,B155:M$204,8,0)),\"\",VLOOKUP(B154,B155:C$204,2,0))","v":""},"","2m","",""]
[151,151,151,null,null,null,"",null,"",null,{"$f":"IF($D155=\"\",\"\",'Header Info'!F$12)","v":""},"",{"$f":"IF($D155=\"\",\"\",'Header Info'!F$24)","v":""},{"$f":"IF(ISNA(VLOOKUP(B155,B$5:M154,8,0)),\"\",VLOOKUP(B155,B$5:C155,2,0))","v":""},{"$f":"IF(ISNA(VLOOKUP(B155,B156:M$204,8,0)),\"\",VLOOKUP(B155,B156:C$204,2,0))","v":""},"","2m","",""]
[152,152,152,null,null,null,"",null,"",null,{"$f":"IF($D156=\"\",\"\",'Header Info'!F$12)","v":""},"",{"$f":"IF($D156=\"\",\"\",'Header Info'!F$24)","v":""},{"$f":"IF(ISNA(VLOOKUP(B156,B$5:M155,8,0)),\"\",VLOOKUP(B156,B$5:C156,2,0))","v":""},{"$f":"IF(ISNA(VLOOKUP(B156,B157:M$204,8,0)),\"\",VLOOKUP(B156,B157:C$204,2,0))","v":""},"","2m","",""]
[153,153,153,null,null,null,"",null,"",null,{"$f":"IF($D157=\"\",\"\",'Header Info'!F$12)","v":""},"",{"$f":"IF($D157=\"\",\"\",'Header Info'!F$24)","v":""},{"$f":"IF(ISNA(VLOOKUP(B157,B$5:M156,8,0)),\"\",VLOOKUP(B157,B$5:C157,2,0))","v":""},{"$f":"IF(ISNA(VLOOKUP(B157,B158:M$204,8,0)),\"\",VLOOKUP(B157,B158:C$204,2,0))","v":""},"","2m","",""]
[154,154,154,null,null,null,"",null,"",null,{"$f":"IF($D158=\"\",\"\",'Header Info'!F$12)","v":""},"",{"$f":"IF($D158=\"\",\"\",'Header Info'!F$24)","v":""},{"$f":"IF(ISNA(VLOOKUP(B158,B$5:M157,8,0)),\"\",VLOOKUP(B158,B$5:C158,2,0))","v":""},{"$f":"IF(ISNA(VLOOKUP(B158,B159:M$204,8,0)),\"\",VLOOKUP(B158,B159:C$204,2,0))","v":""},"","2m","",""]
[155,155,155,null,null,null,"",null,"",null,{"$f":"IF($D159=\"\",\"\",'Header Info'!F$12)","v":""},"",{"$f":"IF($D159=\"\",\"\",'Header Info'!F$24)","v":""},{"$f":"IF(ISNA(VLOOKUP(B159,B$5:M158,8,0)),\"\",VLOOKUP(B159,B$5:C159,2,0))","v":""},{"$f":"IF(ISNA(VLOOKUP(B159,B160:M$204,8,0)),\"\",VLOOKUP(B159,B160:C$204,2,0))","v":""},"","2m","",""]
[156,156,156,null,null,null,"",null,"",null,{"$f":"IF($D160=\"\",\"\",'Header Info'!F$12)","v":""},"",{"$f":"IF($D160=\"\",\"\",'Header Info'!F$24)","v":""},{"$f":"IF(ISNA(VLOOKUP(B160,B$5:M159,8,0)),\"\",VLOOKUP(B160,B$5:C160,2,0))","v":""},{"$f":"IF(ISNA(VLOOKUP(B160,B161:M$204,8,0)),\"\",VLOOKUP(B160,B161:C$204,2,0))","v":""},"","2m","",""]
[157,157,157,null,null,null,"",null,"",null,{"$f":"IF($D161=\"\",\"\",'Header Info'!F$12)","v":""},"",{"$f":"IF($D161=\"\",\"\",'Header Info'!F$24)","v":""},{"$f":"IF(ISNA(VLOOKUP(B161,B$5:M160,8,0)),\"\",VLOOKUP(B161,B$5:C161,2,0))","v":""},{"$f":"IF(ISNA(VLOOKUP(B161,B162:M$204,8,0)),\"\",VLOOKUP(B161,B162:C$204,2,0))","v":""},"","2m","",""]
[158,158,158,null,null,null,"",null,"",null,{"$f":"IF($D162=\"\",\"\",'Header Info'!F$12)","v":""},"",{"$f":"IF($D162=\"\",\"\",'Header Info'!F$24)","v":""},{"$f":"IF(ISNA(VLOOKUP(B162,B$5:M161,8,0)),\"\",VLOOKUP(B162,B$5:C162,2,0))","v":""},{"$f":"IF(ISNA(VLOOKUP(B162,B163:M$204,8,0)),\"\",VLOOKUP(B162,B163:C$204,2,0))","v":""},"","2m","",""]
[159,159,159,null,null,null,"",null,"",null,{"$f":"IF($D163=\"\",\"\",'Header Info'!F$12)","v":""},"",{"$f":"IF($D163=\"\",\"\",'Header Info'!F$24)","v":""},{"$f":"IF(ISNA(VLOOKUP(B163,B$5:M162,8,0)),\"\",VLOOKUP(B163,B$5:C163,2,0))","v":""},{"$f":"IF(ISNA(VLOOKUP(B163,B164:M$204,8,0)),\"\",VLOOKUP(B163,B164:C$204,2,0))","v":""},"","2m","",""]
[160,160,160,null,null,null,"",null,"",null,{"$f":"IF($D164=\"\",\"\",'Header Info'!F$12)","v":""},"",{"$f":"IF($D164=\"\",\"\",'Header Info'!F$24)","v":""},{"$f":"IF(ISNA(VLOOKUP(B164,B$5:M163,8,0)),\"\",VLOOKUP(B164,B$5:C164,2,0))","v":""},{"$f":"IF(ISNA(VLOOKUP(B164,B165:M$204,8,0)),\"\",VLOOKUP(B164,B165:C$204,2,0))","v":""},"","2m","",""]
[161,{"$f":"IF(F165=\"\",A165,F165&Q165&UPPER(E165))","v":161},161,null,null,null,"",null,{"$f":"IF(D165=\"\",\"\",I$4)","v":""},null,{"$f":"IF($D165=\"\",\"\",'Header Info'!F$12)","v":""},"",{"$f":"IF($D165=\"\",\"\",'Header Info'!F$24)","v":""},{"$f":"IF(ISNA(VLOOKUP(B165,B$5:M164,8,0)),\"\",VLOOKUP(B165,B$5:C165,2,0))","v":""},{"$f":"IF(ISNA(VLOOKUP(B165,B166:M$204,8,0)),\"\",VLOOKUP(B165,B166:C$204,2,0))","v":""},{"$f":"IF(LT=1,IF(COUNTA(D165,E165,F165,H165)=0,\"\",IF(COUNTA(D165,E165,F165,H165)=4,\"\",\"<- FILL-UP ALL YELLOW CELLS\")),IF(COUNTA(D165,E165,J165,F165,H165)=0,\"\",IF(COUNTA(D165,E165,J165,F165,H165)=5,\"\",\"<- FILL-UP ALL YELLOW CELLS\")))","v":""},{"$f":"IF(D165=1240,\"23cm\",IF(D165=432,\"70cm\",IF(D165=50,\"6m\",\"2m\")))","v":"2m"},"",{"$f":"IF(O165=\"\",\"\",IF(HOUR(AA165)+IF(HOUR(AA165)<8,16,-8)<10,\"0\",\"\")&HOUR(AA165)+IF(HOUR(AA165)<8,16,-8)&IF(MINUTE(AA165)<9,\"0\",\"\")&MINUTE(AA165))","v":""}]
[162,162,162,null,null,null,"",null,"",null,{"$f":"IF($D166=\"\",\"\",'Header Info'!F$12)","v":""},"",{"$f":"IF($D166=\"\",\"\",'Header Info'!F$24)","v":""},{"$f":"IF(ISNA(VLOOKUP(B166,B$5:M165,8,0)),\"\",VLOOKUP(B166,B$5:C166,2,0))","v":""},{"$f":"IF(ISNA(VLOOKUP(B166,B167:M$204,8,0)),\"\",VLOOKUP(B166,B167:C$204,2,0))","v":""},"","2m","",""]
[163,163,163,null,null,null,"",null,"",null,{"$f":"IF($D167=\"\",\"\",'Header Info'!F$12)","v":""},"",{"$f":"IF($D167=\"\",\"\",'Header Info'!F$24)","v":""},{"$f":"IF(ISNA(VLOOKUP(B167,B$5:M166,8,0)),\"\",VLOOKUP(B167,B$5:C167,2,0))","v":""},{"$f":"IF(ISNA(VLOOKUP(B167,B168:M$204,8,0)),\"\",VLOOKUP(B167,B168:C$204,2,0))","v":""},"","2m","",""]
[164,164,164,null,null,null,"",null,"",null,{"$f":"IF($D168=\"\",\"\",'Header Info'!F$12)","v":""},"",{"$f":"IF($D168=\"\",\"\",'Header Info'!F$24)","v":""},{"$f":"IF(ISNA(VLOOKUP(B168,B$5:M167,8,0)),\"\",VLOOKUP(B168,B$5:C168,2,0))","v":""},{"$f":"IF(ISNA(VLOOKUP(B168,B169:M$204,8,0)),\"\",VLOOKUP(B168,B169:C$204,2,0))","v":""},"","2m","",""]
[165,165,165,null,null,null,"",null,"",null,{"$f":"IF($D169=\"\",\"\",'Header Info'!F$12)","v":""},"",{"$f":"IF($D169=\"\",\"\",'Header Info'!F$24)","v":""},{"$f":"IF(ISNA(VLOOKUP(B169,B$5:M168,8,0)),\"\",VLOOKUP(B169,B$5:C169,2,0))","v":""},{"$f":"IF(ISNA(VLOOKUP(B169,B170:M$204,8,0)),\"\",VLOOKUP(B169,B170:C$204,2,0))","v":""},"","2m","",""]
[166,166,166,null,null,null,"",null,"",null,{"$f":"IF($D170=\"\",\"\",'Header Info'!F$12)","v":""},"",{"$f":"IF($D170=\"\",\"\",'Header Info'!F$24)","v":""},{"$f":"IF(ISNA(VLOOKUP(B170,B$5:M169,8,0)),\"\",VLOOKUP(B170,B$5:C170,2,0))","v":""},{"$f":"IF(ISNA(VLOOKUP(B170,B171:M$204,8,0)),\"\",VLOOKUP(B170,B171:C$204,2,0))","v":""},"","2m","",""]
[167,167,167,null,null,null,"",null,"",null,{"$f":"IF($D171=\"\",\"\",'Header Info'!F$12)","v":""},"",{"$f":"IF($D171=\"\",\"\",'Header Info'!F$24)","v":""},{"$f":"IF(ISNA(VLOOKUP(B171,B$5:M170,8,0)),\"\",VLOOKUP(B171,B$5:C171,2,0))","v":""},{"$f":"IF(ISNA(VLOOKUP(B171,B172:M$204,8,0)),\"\",VLOOKUP(B171,B172:C$204,2,0))","v":""},"","2m","",""]
[168,168,168,null,null,null,"",null,"",null,{"$f":"IF($D172=\"\",\"\",'Header Info'!F$12)","v":""},"",{"$f":"IF($D172=\"\",\"\",'Header Info'!F$24)","v":""},{"$f":"IF(ISNA(VLOOKUP(B172,B$5:M171,8,0)),\"\",VLOOKUP(B172,B$5:C172,2,0))","v":""},{"$f":"IF(ISNA(VLOOKUP(B172,B173:M$204,8,0)),\"\",VLOOKUP(B172,B173:C$204,2,0))","v":""},"","2m","",""]
[169,169,169,null,null,null,"",null,"",null,{"$f":"IF($D173=\"\",\"\",'Header Info'!F$12)","v":""},"",{"$f":"IF($D173=\"\",\"\",'Header Info'!F$24)","v":""},{"$f":"IF(ISNA(VLOOKUP(B173,B$5:M172,8,0)),\"\",VLOOKUP(B173,B$5:C173,2,0))","v":""},{"$f":"IF(ISNA(VLOOKUP(B173,B174:M$204,8,0)),\"\",VLOOKUP(B173,B174:C$204,2,0))","v":""},"","2m","",""]
[170,170,170,null,null,null,"",null,"",null,{"$f":"IF($D174=\"\",\"\",'Header Info'!F$12)","v":""},"",{"$f":"IF($D174=\"\",\"\",'Header Info'!F$24)","v":""},{"$f":"IF(ISNA(VLOOKUP(B174,B$5:M173,8,0)),\"\",VLOOKUP(B174,B$5:C174,2,0))","v":""},{"$f":"IF(ISNA(VLOOKUP(B174,B175:M$204,8,0)),\"\",VLOOKUP(B174,B175:C$204,2,0))","v":""},"","2m","",""]
[171,171,171,null,null,null,"",null,"",null,{"$f":"IF($D175=\"\",\"\",'Header Info'!F$12)","v":""},"",{"$f":"IF($D175=\"\",\"\",'Header Info'!F$24)","v":""},{"$f":"IF(ISNA(VLOOKUP(B175,B$5:M174,8,0)),\"\",VLOOKUP(B175,B$5:C175,2,0))","v":""},{"$f":"IF(ISNA(VLOOKUP(B175,B176:M$204,8,0)),\"\",VLOOKUP(B175,B176:C$204,2,0))","v":""},"","2m","",""]
[172,172,172,null,null,null,"",null,"",null,{"$f":"IF($D176=\"\",\"\",'Header Info'!F$12)","v":""},"",{"$f":"IF($D176=\"\",\"\",'Header Info'!F$24)","v":""},{"$f":"IF(ISNA(VLOOKUP(B176,B$5:M175,8,0)),\"\",VLOOKUP(B176,B$5:C176,2,0))","v":""},{"$f":"IF(ISNA(VLOOKUP(B176,B177:M$204,8,0)),\"\",VLOOKUP(B176,B177:C$204,2,0))","v":""},"","2m","",""]
[173,173,173,null,null,null,"",null,"",null,{"$f":"IF($D177=\"\",\"\",'Header Info'!F$12)","v":""},"",{"$f":"IF($D177=\"\",\"\",'Header Info'!F$24)","v":""},{"$f":"IF(ISNA(VLOOKUP(B177,B$5:M176,8,0)),\"\",VLOOKUP(B177,B$5:C177,2,0))","v":""},{"$f":"IF(ISNA(VLOOKUP(B177,B178:M$204,8,0)),\"\",VLOOKUP(B177,B178:C$204,2,0))","v":""},"","2m","",""]
[174,174,174,null,null,null,"",null,"",null,{"$f":"IF($D178=\"\",\"\",'Header Info'!F$12)","v":""},"",{"$f":"IF($D178=\"\",\"\",'Header Info'!F$24)","v":""},{"$f":"IF(ISNA(VLOOKUP(B178,B$5:M177,8,0)),\"\",VLOOKUP(B178,B$5:C178,2,0))","v":""},{"$f":"IF(ISNA(VLOOKUP(B178,B179:M$204,8,0)),\"\",VLOOKUP(B178,B179:C$204,2,0))","v":""},"","2m","",""]
[175,175,175,null,null,null,"",null,"",null,{"$f":"IF($D179=\"\",\"\",'Header Info'!F$12)","v":""},"",{"$f":"IF($D179=\"\",\"\",'Header Info'!F$24)","v":""},{"$f":"IF(ISNA(VLOOKUP(B179,B$5:M178,8,0)),\"\",VLOOKUP(B179,B$5:C179,2,0))","v":""},{"$f":"IF(ISNA(VLOOKUP(B179,B180:M$204,8,0)),\"\",VLOOKUP(B179,B180:C$204,2,0))","v":""},"","2m","",""]
[176,176,176,null,null,null,"",null,"",null,{"$f":"IF($D180=\"\",\"\",'Header Info'!F$12)","v":""},"",{"$f":"IF($D180=\"\",\"\",'Header Info'!F$24)","v":""},{"$f":"IF(ISNA(VLOOKUP(B180,B$5:M179,8,0)),\"\",VLOOKUP(B180,B$5:C180,2,0))","v":""},{"$f":"IF(ISNA(VLOOKUP(B180,B181:M$204,8,0)),\"\",VLOOKUP(B180,B181:C$204,2,0))","v":""},"","2m","",""]
[177,177,177,null,null,null,"",null,"",null,{"$f":"IF($D181=\"\",\"\",'Header Info'!F$12)","v":""},"",{"$f":"IF($D181=\"\",\"\",'Header Info'!F$24)","v":""},{"$f":"IF(ISNA(VLOOKUP(B181,B$5:M180,8,0)),\"\",VLOOKUP(B181,B$5:C181,2,0))","v":""},{"$f":"IF(ISNA(VLOOKUP(B181,B182:M$204,8,0)),\"\",VLOOKUP(B181,B182:C$204,2,0))","v":""},"","2m","",""]
[178,178,178,null,null,null,"",null,"",null,{"$f":"IF($D182=\"\",\"\",'Header Info'!F$12)","v":""},"",{"$f":"IF($D182=\"\",\"\",'Header Info'!F$24)","v":""},{"$f":"IF(ISNA(VLOOKUP(B182,B$5:M181,8,0)),\"\",VLOOKUP(B182,B$5:C182,2,0))","v":""},{"$f":"IF(ISNA(VLOOKUP(B182,B183:M$204,8,0)),\"\",VLOOKUP(B182,B183:C$204,2,0))","v":""},"","2m","",""]
[179,179,179,null,null,null,"",null,"",null,{"$f":"IF($D183=\"\",\"\",'Header Info'!F$12)","v":""},"",{"$f":"IF($D183=\"\",\"\",'Header Info'!F$24)","v":""},{"$f":"IF(ISNA(VLOOKUP(B183,B$5:M182,8,0)),\"\",VLOOKUP(B183,B$5:C183,2,0))","v":""},{"$f":"IF(ISNA(VLOOKUP(B183,B184:M$204,8,0)),\"\",VLOOKUP(B183,B184:C$204,2,0))","v":""},"","2m","",""]
[180,180,180,null,null,null,"",null,"",null,{"$f":"IF($D184=\"\",\"\",'Header Info'!F$12)","v":""},"",{"$f":"IF($D184=\"\",\"\",'Header Info'!F$24)","v":""},{"$f":"IF(ISNA(VLOOKUP(B184,B$5:M183,8,0)),\"\",VLOOKUP(B184,B$5:C184,2,0))","v":""},{"$f":"IF(ISNA(VLOOKUP(B184,B185:M$204,8,0)),\"\",VLOOKUP(B184,B185:C$204,2,0))","v":""},"","2m","",""]
[181,181,181,null,null,null,"",null,"",null,{"$f":"IF($D185=\"\",\"\",'Header Info'!F$12)","v":""},"",{"$f":"IF($D185=\"\",\"\",'Header Info'!F$24)","v":""},{"$f":"IF(ISNA(VLOOKUP(B185,B$5:M184,8,0)),\"\",VLOOKUP(B185,B$5:C185,2,0))","v":""},{"$f":"IF(ISNA(VLOOKUP(B185,B186:M$204,8,0)),\"\",VLOOKUP(B185,B186:C$204,2,0))","v":""},"","2m","",""]
[182,182,182,null,null,null,"",null,"",null,{"$f":"IF($D186=\"\",\"\",'Header Info'!F$12)","v":""},"",{"$f":"IF($D186=\"\",\"\",'Header Info'!F$24)","v":""},{"$f":"IF(ISNA(VLOOKUP(B186,B$5:M185,8,0)),\"\",VLOOKUP(B186,B$5:C186,2,0))","v":""},{"$f":"IF(ISNA(VLOOKUP(B186,B187:M$204,8,0)),\"\",VLOOKUP(B186,B187:C$204,2,0))","v":""},"","2m","",""]
[183,183,183,null,null,null,"",null,"",null,{"$f":"IF($D187=\"\",\"\",'Header Info'!F$12)","v":""},"",{"$f":"IF($D187=\"\",\"\",'Header Info'!F$24)","v":""},{"$f":"IF(ISNA(VLOOKUP(B187,B$5:M186,8,0)),\"\",VLOOKUP(B187,B$5:C187,2,0))","v":""},{"$f":"IF(ISNA(VLOOKUP(B187,B188:M$204,8,0)),\"\",VLOOKUP(B187,B188:C$204,2,0))","v":""},"","2m","",""]
[184,184,184,null,null,null,"",null,"",null,{"$f":"IF($D188=\"\",\"\",'Header Info'!F$12)","v":""},"",{"$f":"IF($D188=\"\",\"\",'Header Info'!F$24)","v":""},{"$f":"IF(ISNA(VLOOKUP(B188,B$5:M187,8,0)),\"\",VLOOKUP(B188,B$5:C188,2,0))","v":""},{"$f":"IF(ISNA(VLOOKUP(B188,B189:M$204,8,0)),\"\",VLOOKUP(B188,B189:C$204,2,0))","v":""},"","2m","",""]
[185,185,185,null,null,null,"",null,"",null,{"$f":"IF($D189=\"\",\"\",'Header Info'!F$12)","v":""},"",{"$f":"IF($D189=\"\",\"\",'Header Info'!F$24)","v":""},{"$f":"IF(ISNA(VLOOKUP(B189,B$5:M188,8,0)),\"\",VLOOKUP(B189,B$5:C189,2,0))","v":""},{"$f":"IF(ISNA(VLOOKUP(B189,B190:M$204,8,0)),\"\",VLOOKUP(B189,B190:C$204,2,0))","v":""},"","2m","",""]
[186,186,186,null,null,null,"",null,"",null,{"$f":"IF($D190=\"\",\"\",'Header Info'!F$12)","v":""},"",{"$f":"IF($D190=\"\",\"\",'Header Info'!F$24)","v":""},{"$f":"IF(ISNA(VLOOKUP(B190,B$5:M189,8,0)),\"\",VLOOKUP(B190,B$5:C190,2,0))","v":""},{"$f":"IF(ISNA(VLOOKUP(B190,B191:M$204,8,0)),\"\",VLOOKUP(B190,B191:C$204,2,0))","v":""},"","2m","",""]
[187,187,187,null,null,null,"",null,"",null,{"$f":"IF($D191=\"\",\"\",'Header Info'!F$12)","v":""},"",{"$f":"IF($D191=\"\",\"\",'Header Info'!F$24)","v":""},{"$f":"IF(ISNA(VLOOKUP(B191,B$5:M190,8,0)),\"\",VLOOKUP(B191,B$5:C191,2,0))","v":""},{"$f":"IF(ISNA(VLOOKUP(B191,B192:M$204,8,0)),\"\",VLOOKUP(B191,B192:C$204,2,0))","v":""},"","2m","",""]
[188,188,188,null,null,null,"",null,"",null,{"$f":"IF($D192=\"\",\"\",'Header Info'!F$12)","v":""},"",{"$f":"IF($D192=\"\",\"\",'Header Info'!F$24)","v":""},{"$f":"IF(ISNA(VLOOKUP(B192,B$5:M191,8,0)),\"\",VLOOKUP(B192,B$5:C192,2,0))","v":""},{"$f":"IF(ISNA(VLOOKUP(B192,B193:M$204,8,0)),\"\",VLOOKUP(B192,B193:C$204,2,0))","v":""},"","2m","",""]
[189,189,189,null,null,null,"",null,"",null,{"$f":"IF($D193=\"\",\"\",'Header Info'!F$12)","v":""},"",{"$f":"IF($D193=\"\",\"\",'Header Info'!F$24)","v":""},{"$f":"IF(ISNA(VLOOKUP(B193,B$5:M192,8,0)),\"\",VLOOKUP(B193,B$5:C193,2,0))","v":""},{"$f":"IF(ISNA(VLOOKUP(B193,B194:M$204,8,0)),\"\",VLOOKUP(B193,B194:C$204,2,0))","v":""},"","2m","",""]
[190,190,190,null,null,null,"",null,"",null,{"$f":"IF($D194=\"\",\"\",'Header Info'!F$12)","v":""},"",{"$f":"IF($D194=\"\",\"\",'Header Info'!F$24)","v":""},{"$f":"IF(ISNA(VLOOKUP(B194,B$5:M193,8,0)),\"\",VLOOKUP(B194,B$5:C194,2,0))","v":""},{"$f":"IF(ISNA(VLOOKUP(B194,B195:M$204,8,0)),\"\",VLOOKUP(B194,B195:C$204,2,0))","v":""},"","2m","",""]
[191,191,191,null,null,null,"",null,"",null,{"$f":"IF($D195=\"\",\"\",'Header Info'!F$12)","v":""},"",{"$f":"IF($D195=\"\",\"\",'Header Info'!F$24)","v":""},{"$f":"IF(ISNA(VLOOKUP(B195,B$5:M194,8,0)),\"\",VLOOKUP(B195,B$5:C195,2,0))","v":""},{"$f":"IF(ISNA(VLOOKUP(B195,B196:M$204,8,0)),\"\",VLOOKUP(B195,B196:C$204,2,0))","v":""},"","2m","",""]
[192,192,192,null,null,null,"",null,"",null,{"$f":"IF($D196=\"\",\"\",'Header Info'!F$12)","v":""},"",{"$f":"IF($D196=\"\",\"\",'Header Info'!F$24)","v":""},{"$f":"IF(ISNA(VLOOKUP(B196,B$5:M195,8,0)),\"\",VLOOKUP(B196,B$5:C196,2,0))","v":""},{"$f":"IF(ISNA(VLOOKUP(B196,B197:M$204,8,0)),\"\",VLOOKUP(B196,B197:C$204,2,0))","v":""},"","2m","",""]
[193,{"$f":"IF(F197=\"\",A197,F197&Q197&UPPER(E197))","v":193},193,null,null,null,{"$f":"IF(ISBLANK($D197),\"\",IF(E197=\"CW\",\"599\",\"59\"))","v":""},null,{"$f":"IF(D197=\"\",\"\",I$4)","v":""},null,{"$f":"IF($D197=\"\",\"\",'Header Info'!F$12)","v":""},{"$f":"IF(ISBLANK($D197),\"\",IF(E197=\"CW\",\"599\",\"59\"))","v":""},{"$f":"IF($D197=\"\",\"\",'Header Info'!F$24)","v":""},{"$f":"IF(ISNA(VLOOKUP(B197,B$5:M196,8,0)),\"\",VLOOKUP(B197,B$5:C197,2,0))","v":""},{"$f":"IF(ISNA(VLOOKUP(B197,B198:M$204,8,0)),\"\",VLOOKUP(B197,B198:C$204,2,0))","v":""},{"$f":"IF(LT=1,IF(COUNTA(D197,E197,F197,H197)=0,\"\",IF(COUNTA(D197,E197,F197,H197)=4,\"\",\"<- FILL-UP ALL YELLOW CELLS\")),IF(COUNTA(D197,E197,J197,F197,H197)=0,\"\",IF(COUNTA(D197,E197,J197,F197,H197)=5,\"\",\"<- FILL-UP ALL YELLOW CELLS\")))","v":""},{"$f":"IF(D197=1240,\"23cm\",IF(D197=432,\"70cm\",IF(D197=50,\"6m\",\"2m\")))","v":"2m"},"",{"$f":"IF(O197=\"\",\"\",IF(HOUR(AA197)+IF(HOUR(AA197)<8,16,-8)<10,\"0\",\"\")&HOUR(AA197)+IF(HOUR(AA197)<8,16,-8)&IF(MINUTE(AA197)<9,\"0\",\"\")&MINUTE(AA197))","v":""}]
[194,194,194,null,null,null,"",null,"",null,{"$f":"IF($D198=\"\",\"\",'Header Info'!F$12)","v":""},"",{"$f":"IF($D198=\"\",\"\",'Header Info'!F$24)","v":""},{"$f":"IF(ISNA(VLOOKUP(B198,B$5:M197,8,0)),\"\",VLOOKUP(B198,B$5:C198,2,0))","v":""},{"$f":"IF(ISNA(VLOOKUP(B198,B199:M$204,8,0)),\"\",VLOOKUP(B198,B199:C$204,2,0))","v":""},"","2m",{"$f":"IF(F198<>\"\",IF(R198<>\"\",R198,NOW()),\"\")","v":""},""]
[195,195,195,null,null,null,"",null,"",null,{"$f":"IF($D199=\"\",\"\",'Header Info'!F$12)","v":""},"",{"$f":"IF($D199=\"\",\"\",'Header Info'!F$24)","v":""},{"$f":"IF(ISNA(VLOOKUP(B199,B$5:M198,8,0)),\"\",VLOOKUP(B199,B$5:C199,2,0))","v":""},{"$f":"IF(ISNA(VLOOKUP(B199,B200:M$204,8,0)),\"\",VLOOKUP(B199,B200:C$204,2,0))","v":""},"","2m","",""]
[196,196,196,null,null,null,"",null,"",null,{"$f":"IF($D200=\"\",\"\",'Header Info'!F$12)","v":""},"",{"$f":"IF($D200=\"\",\"\",'Header Info'!F$24)","v":""},{"$f":"IF(ISNA(VLOOKUP(B200,B$5:M199,8,0)),\"\",VLOOKUP(B200,B$5:C200,2,0))","v":""},{"$f":"IF(ISNA(VLOOKUP(B200,B201:M$204,8,0)),\"\",VLOOKUP(B200,B201:C$204,2,0))","v":""},"","2m","",""]
[197,197,197,null,null,null,"",null,"",null,{"$f":"IF($D201=\"\",\"\",'Header Info'!F$12)","v":""},"",{"$f":"IF($D201=\"\",\"\",'Header Info'!F$24)","v":""},{"$f":"IF(ISNA(VLOOKUP(B201,B$5:M200,8,0)),\"\",VLOOKUP(B201,B$5:C201,2,0))","v":""},{"$f":"IF(ISNA(VLOOKUP(B201,B202:M$204,8,0)),\"\",VLOOKUP(B201,B202:C$204,2,0))","v":""},"","2m","",""]
[198,198,198,null,null,null,"",null,"",null,{"$f":"IF($D202=\"\",\"\",'Header Info'!F$12)","v":""},"",{"$f":"IF($D202=\"\",\"\",'Header Info'!F$24)","v":""},{"$f":"IF(ISNA(VLOOKUP(B202,B$5:M201,8,0)),\"\",VLOOKUP(B202,B$5:C202,2,0))","v":""},{"$f":"IF(ISNA(VLOOKUP(B202,B203:M$204,8,0)),\"\",VLOOKUP(B202,B203:C$204,2,0))","v":""},"","2m","",""]
[199,199,199,null,null,null,"",null,"",null,{"$f":"IF($D203=\"\",\"\",'Header Info'!F$12)","v":""},"",{"$f":"IF($D203=\"\",\"\",'Header Info'!F$24)","v":""},{"$f":"IF(ISNA(VLOOKUP(B203,B$5:M202,8,0)),\"\",VLOOKUP(B203,B$5:C203,2,0))","v":""},{"$f":"IF(ISNA(VLOOKUP(B203,B204:M$204,8,0)),\"\",VLOOKUP(B203,B204:C$204,2,0))","v":""},"","2m","",""]
[200,200,200,null,null,null,"",null,"",null,{"$f":"IF($D204=\"\",\"\",'Header Info'!F$12)","v":""},"",{"$f":"IF($D204=\"\",\"\",'Header Info'!F$24)","v":""},{"$f":"IF(ISNA(VLOOKUP(B204,B$5:M203,8,0)),\"\",VLOOKUP(B204,B$5:C204,2,0))","v":""},{"$f":"IF(ISNA(VLOOKUP(B204,B$204:M205,8,0)),\"\",VLOOKUP(B204,B$204:C205,2,0))","v":200},"","2m","","1600"]
[null,null,null,null,null,null,"",null,{"$f":"I204","v":""},null,{"$f":"IF($D205=\"\",\"\",'Header Info'!F$12)","v":""},"",{"$f":"IF($D205=\"\",\"\",'Header Info'!F$24)","v":""}]

{"sheet":"Cabrillo","index":3,"n_rows":219,"n_cols":1,"rows_kept":219,"cut":false,"hidden":false,"merged":[]}
["START-OF-LOG: 3.0"]
[{"$f":"\"CONTEST: \"&'Header Info'!F7","v":"CONTEST: 2026 DU3MY MEMORIAL CONTEST"}]
[{"$f":"'Header Info'!E8&\" \"&'Header Info'!F8","v":"CREATED-BY: Microsoft Excel 2013"}]
[{"$f":"'Header Info'!E12&\" \"&'Header Info'!F12","v":"CONTEST CALL: DW1WWW"}]
[{"$f":"'Header Info'!E13&\" \"&'Header Info'!F13","v":"CATEGORY-OPERATOR: SINGLE-OP FIXED"}]
["CATEGORY-MODE: ALL"]
[{"$f":"'Header Info'!E15&\" \"&'Header Info'!F15","v":"CATEGORY-BAND: 2m"}]
[{"$f":"\"CATEGORY-POWER: \"&'Header Info'!F16","v":"CATEGORY-POWER: HIGH"}]
[{"$f":"\"OPERATORS: \"&'Header Info'!F17","v":"OPERATORS: "}]
[{"$f":"'Header Info'!E18&\" \"&'Header Info'!F18","v":"NAME: JUAN A. DELA CRUZ"}]
[{"$f":"'Header Info'!E19&\" \"&'Header Info'!F19","v":"ADDRESS-STREET: MABINI ST."}]
[{"$f":"'Header Info'!E20&\" \"&'Header Info'!F20","v":"ADDRESS-BARANGAY: SAMPALOC"}]
[{"$f":"'Header Info'!E21&\" \"&'Header Info'!F21","v":"ADDRESS-CITY/TOWN: MANILA"}]
[{"$f":"'Header Info'!E22&\" \"&'Header Info'!F22","v":"ADDRESS-STATE-PROVINCE: MM"}]
[{"$f":"'Header Info'!E23&\" \"&'Header Info'!F23","v":"ADDRESS-COUNTRY: PHILIPPINES"}]
[{"$f":"'Header Info'!E24&\" \"&'Header Info'!F24","v":"ZIP CODE: 1015"}]
[{"$f":"'Header Info'!E25&\" \"&'Header Info'!F25","v":"EMAIL: DW1WWW@GMAIL.COM"}]
[{"$f":"'Header Info'!E27&\" \"&'Header Info'!F27","v":"CLUB: DX1ABC"}]
[{"$f":"'Header Info'!E28&\" \"&'Header Info'!F28","v":"GPS COORDINATES: 14.602803, 120.996586"}]
[{"$f":"IF(OR(LEFT(A19,3)=\"END\",A19=\"\"),\"\",IF(ISBLANK('QSO DB'!D5),\"END-OF-LOG:\",\"QSO:\"&'QSO DB'!D5&REPT(\" \",6-LEN('QSO DB'!D5))&\" \"&IF(ISBLANK('QSO DB'!E5),\"xx\",\"\")&UPPER('QSO DB'!E5)&\" \"&IF(ISBLANK('QSO DB'!I5),REPT(\"X\",10),YEAR('QSO DB'!I5)&\"-\"&IF(MONTH('QSO DB'!I5)<10,\"0\",\"\")&MONTH('QSO DB'!I5)&\"-\"&IF(DAY('QSO DB'!I5)<10,\"0\",\"\")&DAY('QSO DB'!I5))&\" \"&IF(ISBLANK('QSO DB'!J5),\"XXXX\",LEFT('QSO DB'!J5,4))&\" \"&UPPER('QSO DB'!K5)&REPT(\" \",14-LEN('QSO DB'!K5))&IF(ISBLANK('QSO DB'!L5),REPT(\"X\",3),'QSO DB'!L5&REPT(\" \",3-LEN('QSO DB'!L5)))&\" \"&IF(ISBLANK('QSO DB'!M5),REPT(\"X\",4),'QSO DB'!M5)&\"   \"&UPPER('QSO DB'!F5)&REPT(\" \",14-LEN('QSO DB'!F5))&IF(ISBLANK('QSO DB'!G5),REPT(\"X\",3),'QSO DB'!G5&REPT(\" \",3-LEN('QSO DB'!G5)))&\" \"&IF(ISBLANK('QSO DB'!H5),REPT(\"X\",4),'QSO DB'!H5)))","v":"END-OF-LOG:"}]
[{"$f":"IF(OR(LEFT(A20,3)=\"END\",A20=\"\"),\"\",IF(ISBLANK('QSO DB'!D6),\"END-OF-LOG:\",\"QSO:\"&'QSO DB'!D6&REPT(\" \",6-LEN('QSO DB'!D6))&\" \"&IF(ISBLANK('QSO DB'!E6),\"xx\",\"\")&UPPER('QSO DB'!E6)&\" \"&IF(ISBLANK('QSO DB'!I6),REPT(\"X\",10),YEAR('QSO DB'!I6)&\"-\"&IF(MONTH('QSO DB'!I6)<10,\"0\",\"\")&MONTH('QSO DB'!I6)&\"-\"&IF(DAY('QSO DB'!I6)<10,\"0\",\"\")&DAY('QSO DB'!I6))&\" \"&IF(ISBLANK('QSO DB'!J6),\"XXXX\",LEFT('QSO DB'!J6,4))&\" \"&UPPER('QSO DB'!K6)&REPT(\" \",14-LEN('QSO DB'!K6))&IF(ISBLANK('QSO DB'!L6),REPT(\"X\",3),'QSO DB'!L6&REPT(\" \",3-LEN('QSO DB'!L6)))&\" \"&IF(ISBLANK('QSO DB'!M6),REPT(\"X\",4),'QSO DB'!M6)&\"   \"&UPPER('QSO DB'!F6)&REPT(\" \",14-LEN('QSO DB'!F6))&IF(ISBLANK('QSO DB'!G6),REPT(\"X\",3),'QSO DB'!G6&REPT(\" \",3-LEN('QSO DB'!G6)))&\" \"&IF(ISBLANK('QSO DB'!H6),REPT(\"X\",4),'QSO DB'!H6)))","v":""}]
[{"$f":"IF(OR(LEFT(A21,3)=\"END\",A21=\"\"),\"\",IF(ISBLANK('QSO DB'!D7),\"END-OF-LOG:\",\"QSO:\"&'QSO DB'!D7&REPT(\" \",6-LEN('QSO DB'!D7))&\" \"&IF(ISBLANK('QSO DB'!E7),\"xx\",\"\")&UPPER('QSO DB'!E7)&\" \"&IF(ISBLANK('QSO DB'!I7),REPT(\"X\",10),YEAR('QSO DB'!I7)&\"-\"&IF(MONTH('QSO DB'!I7)<10,\"0\",\"\")&MONTH('QSO DB'!I7)&\"-\"&IF(DAY('QSO DB'!I7)<10,\"0\",\"\")&DAY('QSO DB'!I7))&\" \"&IF(ISBLANK('QSO DB'!J7),\"XXXX\",LEFT('QSO DB'!J7,4))&\" \"&UPPER('QSO DB'!K7)&REPT(\" \",14-LEN('QSO DB'!K7))&IF(ISBLANK('QSO DB'!L7),REPT(\"X\",3),'QSO DB'!L7&REPT(\" \",3-LEN('QSO DB'!L7)))&\" \"&IF(ISBLANK('QSO DB'!M7),REPT(\"X\",4),'QSO DB'!M7)&\"   \"&UPPER('QSO DB'!F7)&REPT(\" \",14-LEN('QSO DB'!F7))&IF(ISBLANK('QSO DB'!G7),REPT(\"X\",3),'QSO DB'!G7&REPT(\" \",3-LEN('QSO DB'!G7)))&\" \"&IF(ISBLANK('QSO DB'!H7),REPT(\"X\",4),'QSO DB'!H7)))","v":""}]
[{"$f":"IF(OR(LEFT(A22,3)=\"END\",A22=\"\"),\"\",IF(ISBLANK('QSO DB'!D8),\"END-OF-LOG:\",\"QSO:\"&'QSO DB'!D8&REPT(\" \",6-LEN('QSO DB'!D8))&\" \"&IF(ISBLANK('QSO DB'!E8),\"xx\",\"\")&UPPER('QSO DB'!E8)&\" \"&IF(ISBLANK('QSO DB'!I8),REPT(\"X\",10),YEAR('QSO DB'!I8)&\"-\"&IF(MONTH('QSO DB'!I8)<10,\"0\",\"\")&MONTH('QSO DB'!I8)&\"-\"&IF(DAY('QSO DB'!I8)<10,\"0\",\"\")&DAY('QSO DB'!I8))&\" \"&IF(ISBLANK('QSO DB'!J8),\"XXXX\",LEFT('QSO DB'!J8,4))&\" \"&UPPER('QSO DB'!K8)&REPT(\" \",14-LEN('QSO DB'!K8))&IF(ISBLANK('QSO DB'!L8),REPT(\"X\",3),'QSO DB'!L8&REPT(\" \",3-LEN('QSO DB'!L8)))&\" \"&IF(ISBLANK('QSO DB'!M8),REPT(\"X\",4),'QSO DB'!M8)&\"   \"&UPPER('QSO DB'!F8)&REPT(\" \",14-LEN('QSO DB'!F8))&IF(ISBLANK('QSO DB'!G8),REPT(\"X\",3),'QSO DB'!G8&REPT(\" \",3-LEN('QSO DB'!G8)))&\" \"&IF(ISBLANK('QSO DB'!H8),REPT(\"X\",4),'QSO DB'!H8)))","v":""}]
[{"$f":"IF(OR(LEFT(A23,3)=\"END\",A23=\"\"),\"\",IF(ISBLANK('QSO DB'!D9),\"END-OF-LOG:\",\"QSO:\"&'QSO DB'!D9&REPT(\" \",6-LEN('QSO DB'!D9))&\" \"&IF(ISBLANK('QSO DB'!E9),\"xx\",\"\")&UPPER('QSO DB'!E9)&\" \"&IF(ISBLANK('QSO DB'!I9),REPT(\"X\",10),YEAR('QSO DB'!I9)&\"-\"&IF(MONTH('QSO DB'!I9)<10,\"0\",\"\")&MONTH('QSO DB'!I9)&\"-\"&IF(DAY('QSO DB'!I9)<10,\"0\",\"\")&DAY('QSO DB'!I9))&\" \"&IF(ISBLANK('QSO DB'!J9),\"XXXX\",LEFT('QSO DB'!J9,4))&\" \"&UPPER('QSO DB'!K9)&REPT(\" \",14-LEN('QSO DB'!K9))&IF(ISBLANK('QSO DB'!L9),REPT(\"X\",3),'QSO DB'!L9&REPT(\" \",3-LEN('QSO DB'!L9)))&\" \"&IF(ISBLANK('QSO DB'!M9),REPT(\"X\",4),'QSO DB'!M9)&\"   \"&UPPER('QSO DB'!F9)&REPT(\" \",14-LEN('QSO DB'!F9))&IF(ISBLANK('QSO DB'!G9),REPT(\"X\",3),'QSO DB'!G9&REPT(\" \",3-LEN('QSO DB'!G9)))&\" \"&IF(ISBLANK('QSO DB'!H9),REPT(\"X\",4),'QSO DB'!H9)))","v":""}]
[{"$f":"IF(OR(LEFT(A24,3)=\"END\",A24=\"\"),\"\",IF(ISBLANK('QSO DB'!D10),\"END-OF-LOG:\",\"QSO:\"&'QSO DB'!D10&REPT(\" \",6-LEN('QSO DB'!D10))&\" \"&IF(ISBLANK('QSO DB'!E10),\"xx\",\"\")&UPPER('QSO DB'!E10)&\" \"&IF(ISBLANK('QSO DB'!I10),REPT(\"X\",10),YEAR('QSO DB'!I10)&\"-\"&IF(MONTH('QSO DB'!I10)<10,\"0\",\"\")&MONTH('QSO DB'!I10)&\"-\"&IF(DAY('QSO DB'!I10)<10,\"0\",\"\")&DAY('QSO DB'!I10))&\" \"&IF(ISBLANK('QSO DB'!J10),\"XXXX\",LEFT('QSO DB'!J10,4))&\" \"&UPPER('QSO DB'!K10)&REPT(\" \",14-LEN('QSO DB'!K10))&IF(ISBLANK('QSO DB'!L10),REPT(\"X\",3),'QSO DB'!L10&REPT(\" \",3-LEN('QSO DB'!L10)))&\" \"&IF(ISBLANK('QSO DB'!M10),REPT(\"X\",4),'QSO DB'!M10)&\"   \"&UPPER('QSO DB'!F10)&REPT(\" \",14-LEN('QSO DB'!F10))&IF(ISBLANK('QSO DB'!G10),REPT(\"X\",3),'QSO DB'!G10&REPT(\" \",3-LEN('QSO DB'!G10)))&\" \"&IF(ISBLANK('QSO DB'!H10),REPT(\"X\",4),'QSO DB'!H10)))","v":""}]
[{"$f":"IF(OR(LEFT(A25,3)=\"END\",A25=\"\"),\"\",IF(ISBLANK('QSO DB'!D11),\"END-OF-LOG:\",\"QSO:\"&'QSO DB'!D11&REPT(\" \",6-LEN('QSO DB'!D11))&\" \"&IF(ISBLANK('QSO DB'!E11),\"xx\",\"\")&UPPER('QSO DB'!E11)&\" \"&IF(ISBLANK('QSO DB'!I11),REPT(\"X\",10),YEAR('QSO DB'!I11)&\"-\"&IF(MONTH('QSO DB'!I11)<10,\"0\",\"\")&MONTH('QSO DB'!I11)&\"-\"&IF(DAY('QSO DB'!I11)<10,\"0\",\"\")&DAY('QSO DB'!I11))&\" \"&IF(ISBLANK('QSO DB'!J11),\"XXXX\",LEFT('QSO DB'!J11,4))&\" \"&UPPER('QSO DB'!K11)&REPT(\" \",14-LEN('QSO DB'!K11))&IF(ISBLANK('QSO DB'!L11),REPT(\"X\",3),'QSO DB'!L11&REPT(\" \",3-LEN('QSO DB'!L11)))&\" \"&IF(ISBLANK('QSO DB'!M11),REPT(\"X\",4),'QSO DB'!M11)&\"   \"&UPPER('QSO DB'!F11)&REPT(\" \",14-LEN('QSO DB'!F11))&IF(ISBLANK('QSO DB'!G11),REPT(\"X\",3),'QSO DB'!G11&REPT(\" \",3-LEN('QSO DB'!G11)))&\" \"&IF(ISBLANK('QSO DB'!H11),REPT(\"X\",4),'QSO DB'!H11)))","v":""}]
[{"$f":"IF(OR(LEFT(A26,3)=\"END\",A26=\"\"),\"\",IF(ISBLANK('QSO DB'!D12),\"END-OF-LOG:\",\"QSO:\"&'QSO DB'!D12&REPT(\" \",6-LEN('QSO DB'!D12))&\" \"&IF(ISBLANK('QSO DB'!E12),\"xx\",\"\")&UPPER('QSO DB'!E12)&\" \"&IF(ISBLANK('QSO DB'!I12),REPT(\"X\",10),YEAR('QSO DB'!I12)&\"-\"&IF(MONTH('QSO DB'!I12)<10,\"0\",\"\")&MONTH('QSO DB'!I12)&\"-\"&IF(DAY('QSO DB'!I12)<10,\"0\",\"\")&DAY('QSO DB'!I12))&\" \"&IF(ISBLANK('QSO DB'!J12),\"XXXX\",LEFT('QSO DB'!J12,4))&\" \"&UPPER('QSO DB'!K12)&REPT(\" \",14-LEN('QSO DB'!K12))&IF(ISBLANK('QSO DB'!L12),REPT(\"X\",3),'QSO DB'!L12&REPT(\" \",3-LEN('QSO DB'!L12)))&\" \"&IF(ISBLANK('QSO DB'!M12),REPT(\"X\",4),'QSO DB'!M12)&\"   \"&UPPER('QSO DB'!F12)&REPT(\" \",14-LEN('QSO DB'!F12))&IF(ISBLANK('QSO DB'!G12),REPT(\"X\",3),'QSO DB'!G12&REPT(\" \",3-LEN('QSO DB'!G12)))&\" \"&IF(ISBLANK('QSO DB'!H12),REPT(\"X\",4),'QSO DB'!H12)))","v":""}]
[{"$f":"IF(OR(LEFT(A27,3)=\"END\",A27=\"\"),\"\",IF(ISBLANK('QSO DB'!D13),\"END-OF-LOG:\",\"QSO:\"&'QSO DB'!D13&REPT(\" \",6-LEN('QSO DB'!D13))&\" \"&IF(ISBLANK('QSO DB'!E13),\"xx\",\"\")&UPPER('QSO DB'!E13)&\" \"&IF(ISBLANK('QSO DB'!I13),REPT(\"X\",10),YEAR('QSO DB'!I13)&\"-\"&IF(MONTH('QSO DB'!I13)<10,\"0\",\"\")&MONTH('QSO DB'!I13)&\"-\"&IF(DAY('QSO DB'!I13)<10,\"0\",\"\")&DAY('QSO DB'!I13))&\" \"&IF(ISBLANK('QSO DB'!J13),\"XXXX\",LEFT('QSO DB'!J13,4))&\" \"&UPPER('QSO DB'!K13)&REPT(\" \",14-LEN('QSO DB'!K13))&IF(ISBLANK('QSO DB'!L13),REPT(\"X\",3),'QSO DB'!L13&REPT(\" \",3-LEN('QSO DB'!L13)))&\" \"&IF(ISBLANK('QSO DB'!M13),REPT(\"X\",4),'QSO DB'!M13)&\"   \"&UPPER('QSO DB'!F13)&REPT(\" \",14-LEN('QSO DB'!F13))&IF(ISBLANK('QSO DB'!G13),REPT(\"X\",3),'QSO DB'!G13&REPT(\" \",3-LEN('QSO DB'!G13)))&\" \"&IF(ISBLANK('QSO DB'!H13),REPT(\"X\",4),'QSO DB'!H13)))","v":""}]
[{"$f":"IF(OR(LEFT(A28,3)=\"END\",A28=\"\"),\"\",IF(ISBLANK('QSO DB'!D14),\"END-OF-LOG:\",\"QSO:\"&'QSO DB'!D14&REPT(\" \",6-LEN('QSO DB'!D14))&\" \"&IF(ISBLANK('QSO DB'!E14),\"xx\",\"\")&UPPER('QSO DB'!E14)&\" \"&IF(ISBLANK('QSO DB'!I14),REPT(\"X\",10),YEAR('QSO DB'!I14)&\"-\"&IF(MONTH('QSO DB'!I14)<10,\"0\",\"\")&MONTH('QSO DB'!I14)&\"-\"&IF(DAY('QSO DB'!I14)<10,\"0\",\"\")&DAY('QSO DB'!I14))&\" \"&IF(ISBLANK('QSO DB'!J14),\"XXXX\",LEFT('QSO DB'!J14,4))&\" \"&UPPER('QSO DB'!K14)&REPT(\" \",14-LEN('QSO DB'!K14))&IF(ISBLANK('QSO DB'!L14),REPT(\"X\",3),'QSO DB'!L14&REPT(\" \",3-LEN('QSO DB'!L14)))&\" \"&IF(ISBLANK('QSO DB'!M14),REPT(\"X\",4),'QSO DB'!M14)&\"   \"&UPPER('QSO DB'!F14)&REPT(\" \",14-LEN('QSO DB'!F14))&IF(ISBLANK('QSO DB'!G14),REPT(\"X\",3),'QSO DB'!G14&REPT(\" \",3-LEN('QSO DB'!G14)))&\" \"&IF(ISBLANK('QSO DB'!H14),REPT(\"X\",4),'QSO DB'!H14)))","v":""}]
[{"$f":"IF(OR(LEFT(A29,3)=\"END\",A29=\"\"),\"\",IF(ISBLANK('QSO DB'!D15),\"END-OF-LOG:\",\"QSO:\"&'QSO DB'!D15&REPT(\" \",6-LEN('QSO DB'!D15))&\" \"&IF(ISBLANK('QSO DB'!E15),\"xx\",\"\")&UPPER('QSO DB'!E15)&\" \"&IF(ISBLANK('QSO DB'!I15),REPT(\"X\",10),YEAR('QSO DB'!I15)&\"-\"&IF(MONTH('QSO DB'!I15)<10,\"0\",\"\")&MONTH('QSO DB'!I15)&\"-\"&IF(DAY('QSO DB'!I15)<10,\"0\",\"\")&DAY('QSO DB'!I15))&\" \"&IF(ISBLANK('QSO DB'!J15),\"XXXX\",LEFT('QSO DB'!J15,4))&\" \"&UPPER('QSO DB'!K15)&REPT(\" \",14-LEN('QSO DB'!K15))&IF(ISBLANK('QSO DB'!L15),REPT(\"X\",3),'QSO DB'!L15&REPT(\" \",3-LEN('QSO DB'!L15)))&\" \"&IF(ISBLANK('QSO DB'!M15),REPT(\"X\",4),'QSO DB'!M15)&\"   \"&UPPER('QSO DB'!F15)&REPT(\" \",14-LEN('QSO DB'!F15))&IF(ISBLANK('QSO DB'!G15),REPT(\"X\",3),'QSO DB'!G15&REPT(\" \",3-LEN('QSO DB'!G15)))&\" \"&IF(ISBLANK('QSO DB'!H15),REPT(\"X\",4),'QSO DB'!H15)))","v":""}]
[{"$f":"IF(OR(LEFT(A30,3)=\"END\",A30=\"\"),\"\",IF(ISBLANK('QSO DB'!D16),\"END-OF-LOG:\",\"QSO:\"&'QSO DB'!D16&REPT(\" \",6-LEN('QSO DB'!D16))&\" \"&IF(ISBLANK('QSO DB'!E16),\"xx\",\"\")&UPPER('QSO DB'!E16)&\" \"&IF(ISBLANK('QSO DB'!I16),REPT(\"X\",10),YEAR('QSO DB'!I16)&\"-\"&IF(MONTH('QSO DB'!I16)<10,\"0\",\"\")&MONTH('QSO DB'!I16)&\"-\"&IF(DAY('QSO DB'!I16)<10,\"0\",\"\")&DAY('QSO DB'!I16))&\" \"&IF(ISBLANK('QSO DB'!J16),\"XXXX\",LEFT('QSO DB'!J16,4))&\" \"&UPPER('QSO DB'!K16)&REPT(\" \",14-LEN('QSO DB'!K16))&IF(ISBLANK('QSO DB'!L16),REPT(\"X\",3),'QSO DB'!L16&REPT(\" \",3-LEN('QSO DB'!L16)))&\" \"&IF(ISBLANK('QSO DB'!M16),REPT(\"X\",4),'QSO DB'!M16)&\"   \"&UPPER('QSO DB'!F16)&REPT(\" \",14-LEN('QSO DB'!F16))&IF(ISBLANK('QSO DB'!G16),REPT(\"X\",3),'QSO DB'!G16&REPT(\" \",3-LEN('QSO DB'!G16)))&\" \"&IF(ISBLANK('QSO DB'!H16),REPT(\"X\",4),'QSO DB'!H16)))","v":""}]
[{"$f":"IF(OR(LEFT(A31,3)=\"END\",A31=\"\"),\"\",IF(ISBLANK('QSO DB'!D17),\"END-OF-LOG:\",\"QSO:\"&'QSO DB'!D17&REPT(\" \",6-LEN('QSO DB'!D17))&\" \"&IF(ISBLANK('QSO DB'!E17),\"xx\",\"\")&UPPER('QSO DB'!E17)&\" \"&IF(ISBLANK('QSO DB'!I17),REPT(\"X\",10),YEAR('QSO DB'!I17)&\"-\"&IF(MONTH('QSO DB'!I17)<10,\"0\",\"\")&MONTH('QSO DB'!I17)&\"-\"&IF(DAY('QSO DB'!I17)<10,\"0\",\"\")&DAY('QSO DB'!I17))&\" \"&IF(ISBLANK('QSO DB'!J17),\"XXXX\",LEFT('QSO DB'!J17,4))&\" \"&UPPER('QSO DB'!K17)&REPT(\" \",14-LEN('QSO DB'!K17))&IF(ISBLANK('QSO DB'!L17),REPT(\"X\",3),'QSO DB'!L17&REPT(\" \",3-LEN('QSO DB'!L17)))&\" \"&IF(ISBLANK('QSO DB'!M17),REPT(\"X\",4),'QSO DB'!M17)&\"   \"&UPPER('QSO DB'!F17)&REPT(\" \",14-LEN('QSO DB'!F17))&IF(ISBLANK('QSO DB'!G17),REPT(\"X\",3),'QSO DB'!G17&REPT(\" \",3-LEN('QSO DB'!G17)))&\" \"&IF(ISBLANK('QSO DB'!H17),REPT(\"X\",4),'QSO DB'!H17)))","v":""}]
[{"$f":"IF(OR(LEFT(A32,3)=\"END\",A32=\"\"),\"\",IF(ISBLANK('QSO DB'!D18),\"END-OF-LOG:\",\"QSO:\"&'QSO DB'!D18&REPT(\" \",6-LEN('QSO DB'!D18))&\" \"&IF(ISBLANK('QSO DB'!E18),\"xx\",\"\")&UPPER('QSO DB'!E18)&\" \"&IF(ISBLANK('QSO DB'!I18),REPT(\"X\",10),YEAR('QSO DB'!I18)&\"-\"&IF(MONTH('QSO DB'!I18)<10,\"0\",\"\")&MONTH('QSO DB'!I18)&\"-\"&IF(DAY('QSO DB'!I18)<10,\"0\",\"\")&DAY('QSO DB'!I18))&\" \"&IF(ISBLANK('QSO DB'!J18),\"XXXX\",LEFT('QSO DB'!J18,4))&\" \"&UPPER('QSO DB'!K18)&REPT(\" \",14-LEN('QSO DB'!K18))&IF(ISBLANK('QSO DB'!L18),REPT(\"X\",3),'QSO DB'!L18&REPT(\" \",3-LEN('QSO DB'!L18)))&\" \"&IF(ISBLANK('QSO DB'!M18),REPT(\"X\",4),'QSO DB'!M18)&\"   \"&UPPER('QSO DB'!F18)&REPT(\" \",14-LEN('QSO DB'!F18))&IF(ISBLANK('QSO DB'!G18),REPT(\"X\",3),'QSO DB'!G18&REPT(\" \",3-LEN('QSO DB'!G18)))&\" \"&IF(ISBLANK('QSO DB'!H18),REPT(\"X\",4),'QSO DB'!H18)))","v":""}]
[{"$f":"IF(OR(LEFT(A33,3)=\"END\",A33=\"\"),\"\",IF(ISBLANK('QSO DB'!D19),\"END-OF-LOG:\",\"QSO:\"&'QSO DB'!D19&REPT(\" \",6-LEN('QSO DB'!D19))&\" \"&IF(ISBLANK('QSO DB'!E19),\"xx\",\"\")&UPPER('QSO DB'!E19)&\" \"&IF(ISBLANK('QSO DB'!I19),REPT(\"X\",10),YEAR('QSO DB'!I19)&\"-\"&IF(MONTH('QSO DB'!I19)<10,\"0\",\"\")&MONTH('QSO DB'!I19)&\"-\"&IF(DAY('QSO DB'!I19)<10,\"0\",\"\")&DAY('QSO DB'!I19))&\" \"&IF(ISBLANK('QSO DB'!J19),\"XXXX\",LEFT('QSO DB'!J19,4))&\" \"&UPPER('QSO DB'!K19)&REPT(\" \",14-LEN('QSO DB'!K19))&IF(ISBLANK('QSO DB'!L19),REPT(\"X\",3),'QSO DB'!L19&REPT(\" \",3-LEN('QSO DB'!L19)))&\" \"&IF(ISBLANK('QSO DB'!M19),REPT(\"X\",4),'QSO DB'!M19)&\"   \"&UPPER('QSO DB'!F19)&REPT(\" \",14-LEN('QSO DB'!F19))&IF(ISBLANK('QSO DB'!G19),REPT(\"X\",3),'QSO DB'!G19&REPT(\" \",3-LEN('QSO DB'!G19)))&\" \"&IF(ISBLANK('QSO DB'!H19),REPT(\"X\",4),'QSO DB'!H19)))","v":""}]
[{"$f":"IF(OR(LEFT(A34,3)=\"END\",A34=\"\"),\"\",IF(ISBLANK('QSO DB'!D20),\"END-OF-LOG:\",\"QSO:\"&'QSO DB'!D20&REPT(\" \",6-LEN('QSO DB'!D20))&\" \"&IF(ISBLANK('QSO DB'!E20),\"xx\",\"\")&UPPER('QSO DB'!E20)&\" \"&IF(ISBLANK('QSO DB'!I20),REPT(\"X\",10),YEAR('QSO DB'!I20)&\"-\"&IF(MONTH('QSO DB'!I20)<10,\"0\",\"\")&MONTH('QSO DB'!I20)&\"-\"&IF(DAY('QSO DB'!I20)<10,\"0\",\"\")&DAY('QSO DB'!I20))&\" \"&IF(ISBLANK('QSO DB'!J20),\"XXXX\",LEFT('QSO DB'!J20,4))&\" \"&UPPER('QSO DB'!K20)&REPT(\" \",14-LEN('QSO DB'!K20))&IF(ISBLANK('QSO DB'!L20),REPT(\"X\",3),'QSO DB'!L20&REPT(\" \",3-LEN('QSO DB'!L20)))&\" \"&IF(ISBLANK('QSO DB'!M20),REPT(\"X\",4),'QSO DB'!M20)&\"   \"&UPPER('QSO DB'!F20)&REPT(\" \",14-LEN('QSO DB'!F20))&IF(ISBLANK('QSO DB'!G20),REPT(\"X\",3),'QSO DB'!G20&REPT(\" \",3-LEN('QSO DB'!G20)))&\" \"&IF(ISBLANK('QSO DB'!H20),REPT(\"X\",4),'QSO DB'!H20)))","v":""}]
[{"$f":"IF(OR(LEFT(A35,3)=\"END\",A35=\"\"),\"\",IF(ISBLANK('QSO DB'!D21),\"END-OF-LOG:\",\"QSO:\"&'QSO DB'!D21&REPT(\" \",6-LEN('QSO DB'!D21))&\" \"&IF(ISBLANK('QSO DB'!E21),\"xx\",\"\")&UPPER('QSO DB'!E21)&\" \"&IF(ISBLANK('QSO DB'!I21),REPT(\"X\",10),YEAR('QSO DB'!I21)&\"-\"&IF(MONTH('QSO DB'!I21)<10,\"0\",\"\")&MONTH('QSO DB'!I21)&\"-\"&IF(DAY('QSO DB'!I21)<10,\"0\",\"\")&DAY('QSO DB'!I21))&\" \"&IF(ISBLANK('QSO DB'!J21),\"XXXX\",LEFT('QSO DB'!J21,4))&\" \"&UPPER('QSO DB'!K21)&REPT(\" \",14-LEN('QSO DB'!K21))&IF(ISBLANK('QSO DB'!L21),REPT(\"X\",3),'QSO DB'!L21&REPT(\" \",3-LEN('QSO DB'!L21)))&\" \"&IF(ISBLANK('QSO DB'!M21),REPT(\"X\",4),'QSO DB'!M21)&\"   \"&UPPER('QSO DB'!F21)&REPT(\" \",14-LEN('QSO DB'!F21))&IF(ISBLANK('QSO DB'!G21),REPT(\"X\",3),'QSO DB'!G21&REPT(\" \",3-LEN('QSO DB'!G21)))&\" \"&IF(ISBLANK('QSO DB'!H21),REPT(\"X\",4),'QSO DB'!H21)))","v":""}]
[{"$f":"IF(OR(LEFT(A36,3)=\"END\",A36=\"\"),\"\",IF(ISBLANK('QSO DB'!D22),\"END-OF-LOG:\",\"QSO:\"&'QSO DB'!D22&REPT(\" \",6-LEN('QSO DB'!D22))&\" \"&IF(ISBLANK('QSO DB'!E22),\"xx\",\"\")&UPPER('QSO DB'!E22)&\" \"&IF(ISBLANK('QSO DB'!I22),REPT(\"X\",10),YEAR('QSO DB'!I22)&\"-\"&IF(MONTH('QSO DB'!I22)<10,\"0\",\"\")&MONTH('QSO DB'!I22)&\"-\"&IF(DAY('QSO DB'!I22)<10,\"0\",\"\")&DAY('QSO DB'!I22))&\" \"&IF(ISBLANK('QSO DB'!J22),\"XXXX\",LEFT('QSO DB'!J22,4))&\" \"&UPPER('QSO DB'!K22)&REPT(\" \",14-LEN('QSO DB'!K22))&IF(ISBLANK('QSO DB'!L22),REPT(\"X\",3),'QSO DB'!L22&REPT(\" \",3-LEN('QSO DB'!L22)))&\" \"&IF(ISBLANK('QSO DB'!M22),REPT(\"X\",4),'QSO DB'!M22)&\"   \"&UPPER('QSO DB'!F22)&REPT(\" \",14-LEN('QSO DB'!F22))&IF(ISBLANK('QSO DB'!G22),REPT(\"X\",3),'QSO DB'!G22&REPT(\" \",3-LEN('QSO DB'!G22)))&\" \"&IF(ISBLANK('QSO DB'!H22),REPT(\"X\",4),'QSO DB'!H22)))","v":""}]
[{"$f":"IF(OR(LEFT(A37,3)=\"END\",A37=\"\"),\"\",IF(ISBLANK('QSO DB'!D23),\"END-OF-LOG:\",\"QSO:\"&'QSO DB'!D23&REPT(\" \",6-LEN('QSO DB'!D23))&\" \"&IF(ISBLANK('QSO DB'!E23),\"xx\",\"\")&UPPER('QSO DB'!E23)&\" \"&IF(ISBLANK('QSO DB'!I23),REPT(\"X\",10),YEAR('QSO DB'!I23)&\"-\"&IF(MONTH('QSO DB'!I23)<10,\"0\",\"\")&MONTH('QSO DB'!I23)&\"-\"&IF(DAY('QSO DB'!I23)<10,\"0\",\"\")&DAY('QSO DB'!I23))&\" \"&IF(ISBLANK('QSO DB'!J23),\"XXXX\",LEFT('QSO DB'!J23,4))&\" \"&UPPER('QSO DB'!K23)&REPT(\" \",14-LEN('QSO DB'!K23))&IF(ISBLANK('QSO DB'!L23),REPT(\"X\",3),'QSO DB'!L23&REPT(\" \",3-LEN('QSO DB'!L23)))&\" \"&IF(ISBLANK('QSO DB'!M23),REPT(\"X\",4),'QSO DB'!M23)&\"   \"&UPPER('QSO DB'!F23)&REPT(\" \",14-LEN('QSO DB'!F23))&IF(ISBLANK('QSO DB'!G23),REPT(\"X\",3),'QSO DB'!G23&REPT(\" \",3-LEN('QSO DB'!G23)))&\" \"&IF(ISBLANK('QSO DB'!H23),REPT(\"X\",4),'QSO DB'!H23)))","v":""}]
[{"$f":"IF(OR(LEFT(A38,3)=\"END\",A38=\"\"),\"\",IF(ISBLANK('QSO DB'!D24),\"END-OF-LOG:\",\"QSO:\"&'QSO DB'!D24&REPT(\" \",6-LEN('QSO DB'!D24))&\" \"&IF(ISBLANK('QSO DB'!E24),\"xx\",\"\")&UPPER('QSO DB'!E24)&\" \"&IF(ISBLANK('QSO DB'!I24),REPT(\"X\",10),YEAR('QSO DB'!I24)&\"-\"&IF(MONTH('QSO DB'!I24)<10,\"0\",\"\")&MONTH('QSO DB'!I24)&\"-\"&IF(DAY('QSO DB'!I24)<10,\"0\",\"\")&DAY('QSO DB'!I24))&\" \"&IF(ISBLANK('QSO DB'!J24),\"XXXX\",LEFT('QSO DB'!J24,4))&\" \"&UPPER('QSO DB'!K24)&REPT(\" \",14-LEN('QSO DB'!K24))&IF(ISBLANK('QSO DB'!L24),REPT(\"X\",3),'QSO DB'!L24&REPT(\" \",3-LEN('QSO DB'!L24)))&\" \"&IF(ISBLANK('QSO DB'!M24),REPT(\"X\",4),'QSO DB'!M24)&\"   \"&UPPER('QSO DB'!F24)&REPT(\" \",14-LEN('QSO DB'!F24))&IF(ISBLANK('QSO DB'!G24),REPT(\"X\",3),'QSO DB'!G24&REPT(\" \",3-LEN('QSO DB'!G24)))&\" \"&IF(ISBLANK('QSO DB'!H24),REPT(\"X\",4),'QSO DB'!H24)))","v":""}]
[{"$f":"IF(OR(LEFT(A39,3)=\"END\",A39=\"\"),\"\",IF(ISBLANK('QSO DB'!D25),\"END-OF-LOG:\",\"QSO:\"&'QSO DB'!D25&REPT(\" \",6-LEN('QSO DB'!D25))&\" \"&IF(ISBLANK('QSO DB'!E25),\"xx\",\"\")&UPPER('QSO DB'!E25)&\" \"&IF(ISBLANK('QSO DB'!I25),REPT(\"X\",10),YEAR('QSO DB'!I25)&\"-\"&IF(MONTH('QSO DB'!I25)<10,\"0\",\"\")&MONTH('QSO DB'!I25)&\"-\"&IF(DAY('QSO DB'!I25)<10,\"0\",\"\")&DAY('QSO DB'!I25))&\" \"&IF(ISBLANK('QSO DB'!J25),\"XXXX\",LEFT('QSO DB'!J25,4))&\" \"&UPPER('QSO DB'!K25)&REPT(\" \",14-LEN('QSO DB'!K25))&IF(ISBLANK('QSO DB'!L25),REPT(\"X\",3),'QSO DB'!L25&REPT(\" \",3-LEN('QSO DB'!L25)))&\" \"&IF(ISBLANK('QSO DB'!M25),REPT(\"X\",4),'QSO DB'!M25)&\"   \"&UPPER('QSO DB'!F25)&REPT(\" \",14-LEN('QSO DB'!F25))&IF(ISBLANK('QSO DB'!G25),REPT(\"X\",3),'QSO DB'!G25&REPT(\" \",3-LEN('QSO DB'!G25)))&\" \"&IF(ISBLANK('QSO DB'!H25),REPT(\"X\",4),'QSO DB'!H25)))","v":""}]
[{"$f":"IF(OR(LEFT(A40,3)=\"END\",A40=\"\"),\"\",IF(ISBLANK('QSO DB'!D26),\"END-OF-LOG:\",\"QSO:\"&'QSO DB'!D26&REPT(\" \",6-LEN('QSO DB'!D26))&\" \"&IF(ISBLANK('QSO DB'!E26),\"xx\",\"\")&UPPER('QSO DB'!E26)&\" \"&IF(ISBLANK('QSO DB'!I26),REPT(\"X\",10),YEAR('QSO DB'!I26)&\"-\"&IF(MONTH('QSO DB'!I26)<10,\"0\",\"\")&MONTH('QSO DB'!I26)&\"-\"&IF(DAY('QSO DB'!I26)<10,\"0\",\"\")&DAY('QSO DB'!I26))&\" \"&IF(ISBLANK('QSO DB'!J26),\"XXXX\",LEFT('QSO DB'!J26,4))&\" \"&UPPER('QSO DB'!K26)&REPT(\" \",14-LEN('QSO DB'!K26))&IF(ISBLANK('QSO DB'!L26),REPT(\"X\",3),'QSO DB'!L26&REPT(\" \",3-LEN('QSO DB'!L26)))&\" \"&IF(ISBLANK('QSO DB'!M26),REPT(\"X\",4),'QSO DB'!M26)&\"   \"&UPPER('QSO DB'!F26)&REPT(\" \",14-LEN('QSO DB'!F26))&IF(ISBLANK('QSO DB'!G26),REPT(\"X\",3),'QSO DB'!G26&REPT(\" \",3-LEN('QSO DB'!G26)))&\" \"&IF(ISBLANK('QSO DB'!H26),REPT(\"X\",4),'QSO DB'!H26)))","v":""}]
[{"$f":"IF(OR(LEFT(A41,3)=\"END\",A41=\"\"),\"\",IF(ISBLANK('QSO DB'!D27),\"END-OF-LOG:\",\"QSO:\"&'QSO DB'!D27&REPT(\" \",6-LEN('QSO DB'!D27))&\" \"&IF(ISBLANK('QSO DB'!E27),\"xx\",\"\")&UPPER('QSO DB'!E27)&\" \"&IF(ISBLANK('QSO DB'!I27),REPT(\"X\",10),YEAR('QSO DB'!I27)&\"-\"&IF(MONTH('QSO DB'!I27)<10,\"0\",\"\")&MONTH('QSO DB'!I27)&\"-\"&IF(DAY('QSO DB'!I27)<10,\"0\",\"\")&DAY('QSO DB'!I27))&\" \"&IF(ISBLANK('QSO DB'!J27),\"XXXX\",LEFT('QSO DB'!J27,4))&\" \"&UPPER('QSO DB'!K27)&REPT(\" \",14-LEN('QSO DB'!K27))&IF(ISBLANK('QSO DB'!L27),REPT(\"X\",3),'QSO DB'!L27&REPT(\" \",3-LEN('QSO DB'!L27)))&\" \"&IF(ISBLANK('QSO DB'!M27),REPT(\"X\",4),'QSO DB'!M27)&\"   \"&UPPER('QSO DB'!F27)&REPT(\" \",14-LEN('QSO DB'!F27))&IF(ISBLANK('QSO DB'!G27),REPT(\"X\",3),'QSO DB'!G27&REPT(\" \",3-LEN('QSO DB'!G27)))&\" \"&IF(ISBLANK('QSO DB'!H27),REPT(\"X\",4),'QSO DB'!H27)))","v":""}]
[{"$f":"IF(OR(LEFT(A42,3)=\"END\",A42=\"\"),\"\",IF(ISBLANK('QSO DB'!D28),\"END-OF-LOG:\",\"QSO:\"&'QSO DB'!D28&REPT(\" \",6-LEN('QSO DB'!D28))&\" \"&IF(ISBLANK('QSO DB'!E28),\"xx\",\"\")&UPPER('QSO DB'!E28)&\" \"&IF(ISBLANK('QSO DB'!I28),REPT(\"X\",10),YEAR('QSO DB'!I28)&\"-\"&IF(MONTH('QSO DB'!I28)<10,\"0\",\"\")&MONTH('QSO DB'!I28)&\"-\"&IF(DAY('QSO DB'!I28)<10,\"0\",\"\")&DAY('QSO DB'!I28))&\" \"&IF(ISBLANK('QSO DB'!J28),\"XXXX\",LEFT('QSO DB'!J28,4))&\" \"&UPPER('QSO DB'!K28)&REPT(\" \",14-LEN('QSO DB'!K28))&IF(ISBLANK('QSO DB'!L28),REPT(\"X\",3),'QSO DB'!L28&REPT(\" \",3-LEN('QSO DB'!L28)))&\" \"&IF(ISBLANK('QSO DB'!M28),REPT(\"X\",4),'QSO DB'!M28)&\"   \"&UPPER('QSO DB'!F28)&REPT(\" \",14-LEN('QSO DB'!F28))&IF(ISBLANK('QSO DB'!G28),REPT(\"X\",3),'QSO DB'!G28&REPT(\" \",3-LEN('QSO DB'!G28)))&\" \"&IF(ISBLANK('QSO DB'!H28),REPT(\"X\",4),'QSO DB'!H28)))","v":""}]
[{"$f":"IF(OR(LEFT(A43,3)=\"END\",A43=\"\"),\"\",IF(ISBLANK('QSO DB'!D29),\"END-OF-LOG:\",\"QSO:\"&'QSO DB'!D29&REPT(\" \",6-LEN('QSO DB'!D29))&\" \"&IF(ISBLANK('QSO DB'!E29),\"xx\",\"\")&UPPER('QSO DB'!E29)&\" \"&IF(ISBLANK('QSO DB'!I29),REPT(\"X\",10),YEAR('QSO DB'!I29)&\"-\"&IF(MONTH('QSO DB'!I29)<10,\"0\",\"\")&MONTH('QSO DB'!I29)&\"-\"&IF(DAY('QSO DB'!I29)<10,\"0\",\"\")&DAY('QSO DB'!I29))&\" \"&IF(ISBLANK('QSO DB'!J29),\"XXXX\",LEFT('QSO DB'!J29,4))&\" \"&UPPER('QSO DB'!K29)&REPT(\" \",14-LEN('QSO DB'!K29))&IF(ISBLANK('QSO DB'!L29),REPT(\"X\",3),'QSO DB'!L29&REPT(\" \",3-LEN('QSO DB'!L29)))&\" \"&IF(ISBLANK('QSO DB'!M29),REPT(\"X\",4),'QSO DB'!M29)&\"   \"&UPPER('QSO DB'!F29)&REPT(\" \",14-LEN('QSO DB'!F29))&IF(ISBLANK('QSO DB'!G29),REPT(\"X\",3),'QSO DB'!G29&REPT(\" \",3-LEN('QSO DB'!G29)))&\" \"&IF(ISBLANK('QSO DB'!H29),REPT(\"X\",4),'QSO DB'!H29)))","v":""}]
[{"$f":"IF(OR(LEFT(A44,3)=\"END\",A44=\"\"),\"\",IF(ISBLANK('QSO DB'!D30),\"END-OF-LOG:\",\"QSO:\"&'QSO DB'!D30&REPT(\" \",6-LEN('QSO DB'!D30))&\" \"&IF(ISBLANK('QSO DB'!E30),\"xx\",\"\")&UPPER('QSO DB'!E30)&\" \"&IF(ISBLANK('QSO DB'!I30),REPT(\"X\",10),YEAR('QSO DB'!I30)&\"-\"&IF(MONTH('QSO DB'!I30)<10,\"0\",\"\")&MONTH('QSO DB'!I30)&\"-\"&IF(DAY('QSO DB'!I30)<10,\"0\",\"\")&DAY('QSO DB'!I30))&\" \"&IF(ISBLANK('QSO DB'!J30),\"XXXX\",LEFT('QSO DB'!J30,4))&\" \"&UPPER('QSO DB'!K30)&REPT(\" \",14-LEN('QSO DB'!K30))&IF(ISBLANK('QSO DB'!L30),REPT(\"X\",3),'QSO DB'!L30&REPT(\" \",3-LEN('QSO DB'!L30)))&\" \"&IF(ISBLANK('QSO DB'!M30),REPT(\"X\",4),'QSO DB'!M30)&\"   \"&UPPER('QSO DB'!F30)&REPT(\" \",14-LEN('QSO DB'!F30))&IF(ISBLANK('QSO DB'!G30),REPT(\"X\",3),'QSO DB'!G30&REPT(\" \",3-LEN('QSO DB'!G30)))&\" \"&IF(ISBLANK('QSO DB'!H30),REPT(\"X\",4),'QSO DB'!H30)))","v":""}]
[{"$f":"IF(OR(LEFT(A45,3)=\"END\",A45=\"\"),\"\",IF(ISBLANK('QSO DB'!D31),\"END-OF-LOG:\",\"QSO:\"&'QSO DB'!D31&REPT(\" \",6-LEN('QSO DB'!D31))&\" \"&IF(ISBLANK('QSO DB'!E31),\"xx\",\"\")&UPPER('QSO DB'!E31)&\" \"&IF(ISBLANK('QSO DB'!I31),REPT(\"X\",10),YEAR('QSO DB'!I31)&\"-\"&IF(MONTH('QSO DB'!I31)<10,\"0\",\"\")&MONTH('QSO DB'!I31)&\"-\"&IF(DAY('QSO DB'!I31)<10,\"0\",\"\")&DAY('QSO DB'!I31))&\" \"&IF(ISBLANK('QSO DB'!J31),\"XXXX\",LEFT('QSO DB'!J31,4))&\" \"&UPPER('QSO DB'!K31)&REPT(\" \",14-LEN('QSO DB'!K31))&IF(ISBLANK('QSO DB'!L31),REPT(\"X\",3),'QSO DB'!L31&REPT(\" \",3-LEN('QSO DB'!L31)))&\" \"&IF(ISBLANK('QSO DB'!M31),REPT(\"X\",4),'QSO DB'!M31)&\"   \"&UPPER('QSO DB'!F31)&REPT(\" \",14-LEN('QSO DB'!F31))&IF(ISBLANK('QSO DB'!G31),REPT(\"X\",3),'QSO DB'!G31&REPT(\" \",3-LEN('QSO DB'!G31)))&\" \"&IF(ISBLANK('QSO DB'!H31),REPT(\"X\",4),'QSO DB'!H31)))","v":""}]
[{"$f":"IF(OR(LEFT(A46,3)=\"END\",A46=\"\"),\"\",IF(ISBLANK('QSO DB'!D32),\"END-OF-LOG:\",\"QSO:\"&'QSO DB'!D32&REPT(\" \",6-LEN('QSO DB'!D32))&\" \"&IF(ISBLANK('QSO DB'!E32),\"xx\",\"\")&UPPER('QSO DB'!E32)&\" \"&IF(ISBLANK('QSO DB'!I32),REPT(\"X\",10),YEAR('QSO DB'!I32)&\"-\"&IF(MONTH('QSO DB'!I32)<10,\"0\",\"\")&MONTH('QSO DB'!I32)&\"-\"&IF(DAY('QSO DB'!I32)<10,\"0\",\"\")&DAY('QSO DB'!I32))&\" \"&IF(ISBLANK('QSO DB'!J32),\"XXXX\",LEFT('QSO DB'!J32,4))&\" \"&UPPER('QSO DB'!K32)&REPT(\" \",14-LEN('QSO DB'!K32))&IF(ISBLANK('QSO DB'!L32),REPT(\"X\",3),'QSO DB'!L32&REPT(\" \",3-LEN('QSO DB'!L32)))&\" \"&IF(ISBLANK('QSO DB'!M32),REPT(\"X\",4),'QSO DB'!M32)&\"   \"&UPPER('QSO DB'!F32)&REPT(\" \",14-LEN('QSO DB'!F32))&IF(ISBLANK('QSO DB'!G32),REPT(\"X\",3),'QSO DB'!G32&REPT(\" \",3-LEN('QSO DB'!G32)))&\" \"&IF(ISBLANK('QSO DB'!H32),REPT(\"X\",4),'QSO DB'!H32)))","v":""}]
[{"$f":"IF(OR(LEFT(A47,3)=\"END\",A47=\"\"),\"\",IF(ISBLANK('QSO DB'!D33),\"END-OF-LOG:\",\"QSO:\"&'QSO DB'!D33&REPT(\" \",6-LEN('QSO DB'!D33))&\" \"&IF(ISBLANK('QSO DB'!E33),\"xx\",\"\")&UPPER('QSO DB'!E33)&\" \"&IF(ISBLANK('QSO DB'!I33),REPT(\"X\",10),YEAR('QSO DB'!I33)&\"-\"&IF(MONTH('QSO DB'!I33)<10,\"0\",\"\")&MONTH('QSO DB'!I33)&\"-\"&IF(DAY('QSO DB'!I33)<10,\"0\",\"\")&DAY('QSO DB'!I33))&\" \"&IF(ISBLANK('QSO DB'!J33),\"XXXX\",LEFT('QSO DB'!J33,4))&\" \"&UPPER('QSO DB'!K33)&REPT(\" \",14-LEN('QSO DB'!K33))&IF(ISBLANK('QSO DB'!L33),REPT(\"X\",3),'QSO DB'!L33&REPT(\" \",3-LEN('QSO DB'!L33)))&\" \"&IF(ISBLANK('QSO DB'!M33),REPT(\"X\",4),'QSO DB'!M33)&\"   \"&UPPER('QSO DB'!F33)&REPT(\" \",14-LEN('QSO DB'!F33))&IF(ISBLANK('QSO DB'!G33),REPT(\"X\",3),'QSO DB'!G33&REPT(\" \",3-LEN('QSO DB'!G33)))&\" \"&IF(ISBLANK('QSO DB'!H33),REPT(\"X\",4),'QSO DB'!H33)))","v":""}]
[{"$f":"IF(OR(LEFT(A48,3)=\"END\",A48=\"\"),\"\",IF(ISBLANK('QSO DB'!D34),\"END-OF-LOG:\",\"QSO:\"&'QSO DB'!D34&REPT(\" \",6-LEN('QSO DB'!D34))&\" \"&IF(ISBLANK('QSO DB'!E34),\"xx\",\"\")&UPPER('QSO DB'!E34)&\" \"&IF(ISBLANK('QSO DB'!I34),REPT(\"X\",10),YEAR('QSO DB'!I34)&\"-\"&IF(MONTH('QSO DB'!I34)<10,\"0\",\"\")&MONTH('QSO DB'!I34)&\"-\"&IF(DAY('QSO DB'!I34)<10,\"0\",\"\")&DAY('QSO DB'!I34))&\" \"&IF(ISBLANK('QSO DB'!J34),\"XXXX\",LEFT('QSO DB'!J34,4))&\" \"&UPPER('QSO DB'!K34)&REPT(\" \",14-LEN('QSO DB'!K34))&IF(ISBLANK('QSO DB'!L34),REPT(\"X\",3),'QSO DB'!L34&REPT(\" \",3-LEN('QSO DB'!L34)))&\" \"&IF(ISBLANK('QSO DB'!M34),REPT(\"X\",4),'QSO DB'!M34)&\"   \"&UPPER('QSO DB'!F34)&REPT(\" \",14-LEN('QSO DB'!F34))&IF(ISBLANK('QSO DB'!G34),REPT(\"X\",3),'QSO DB'!G34&REPT(\" \",3-LEN('QSO DB'!G34)))&\" \"&IF(ISBLANK('QSO DB'!H34),REPT(\"X\",4),'QSO DB'!H34)))","v":""}]
[{"$f":"IF(OR(LEFT(A49,3)=\"END\",A49=\"\"),\"\",IF(ISBLANK('QSO DB'!D35),\"END-OF-LOG:\",\"QSO:\"&'QSO DB'!D35&REPT(\" \",6-LEN('QSO DB'!D35))&\" \"&IF(ISBLANK('QSO DB'!E35),\"xx\",\"\")&UPPER('QSO DB'!E35)&\" \"&IF(ISBLANK('QSO DB'!I35),REPT(\"X\",10),YEAR('QSO DB'!I35)&\"-\"&IF(MONTH('QSO DB'!I35)<10,\"0\",\"\")&MONTH('QSO DB'!I35)&\"-\"&IF(DAY('QSO DB'!I35)<10,\"0\",\"\")&DAY('QSO DB'!I35))&\" \"&IF(ISBLANK('QSO DB'!J35),\"XXXX\",LEFT('QSO DB'!J35,4))&\" \"&UPPER('QSO DB'!K35)&REPT(\" \",14-LEN('QSO DB'!K35))&IF(ISBLANK('QSO DB'!L35),REPT(\"X\",3),'QSO DB'!L35&REPT(\" \",3-LEN('QSO DB'!L35)))&\" \"&IF(ISBLANK('QSO DB'!M35),REPT(\"X\",4),'QSO DB'!M35)&\"   \"&UPPER('QSO DB'!F35)&REPT(\" \",14-LEN('QSO DB'!F35))&IF(ISBLANK('QSO DB'!G35),REPT(\"X\",3),'QSO DB'!G35&REPT(\" \",3-LEN('QSO DB'!G35)))&\" \"&IF(ISBLANK('QSO DB'!H35),REPT(\"X\",4),'QSO DB'!H35)))","v":""}]
[{"$f":"IF(OR(LEFT(A50,3)=\"END\",A50=\"\"),\"\",IF(ISBLANK('QSO DB'!D36),\"END-OF-LOG:\",\"QSO:\"&'QSO DB'!D36&REPT(\" \",6-LEN('QSO DB'!D36))&\" \"&IF(ISBLANK('QSO DB'!E36),\"xx\",\"\")&UPPER('QSO DB'!E36)&\" \"&IF(ISBLANK('QSO DB'!I36),REPT(\"X\",10),YEAR('QSO DB'!I36)&\"-\"&IF(MONTH('QSO DB'!I36)<10,\"0\",\"\")&MONTH('QSO DB'!I36)&\"-\"&IF(DAY('QSO DB'!I36)<10,\"0\",\"\")&DAY('QSO DB'!I36))&\" \"&IF(ISBLANK('QSO DB'!J36),\"XXXX\",LEFT('QSO DB'!J36,4))&\" \"&UPPER('QSO DB'!K36)&REPT(\" \",14-LEN('QSO DB'!K36))&IF(ISBLANK('QSO DB'!L36),REPT(\"X\",3),'QSO DB'!L36&REPT(\" \",3-LEN('QSO DB'!L36)))&\" \"&IF(ISBLANK('QSO DB'!M36),REPT(\"X\",4),'QSO DB'!M36)&\"   \"&UPPER('QSO DB'!F36)&REPT(\" \",14-LEN('QSO DB'!F36))&IF(ISBLANK('QSO DB'!G36),REPT(\"X\",3),'QSO DB'!G36&REPT(\" \",3-LEN('QSO DB'!G36)))&\" \"&IF(ISBLANK('QSO DB'!H36),REPT(\"X\",4),'QSO DB'!H36)))","v":""}]
[{"$f":"IF(OR(LEFT(A51,3)=\"END\",A51=\"\"),\"\",IF(ISBLANK('QSO DB'!D37),\"END-OF-LOG:\",\"QSO:\"&'QSO DB'!D37&REPT(\" \",6-LEN('QSO DB'!D37))&\" \"&IF(ISBLANK('QSO DB'!E37),\"xx\",\"\")&UPPER('QSO DB'!E37)&\" \"&IF(ISBLANK('QSO DB'!I37),REPT(\"X\",10),YEAR('QSO DB'!I37)&\"-\"&IF(MONTH('QSO DB'!I37)<10,\"0\",\"\")&MONTH('QSO DB'!I37)&\"-\"&IF(DAY('QSO DB'!I37)<10,\"0\",\"\")&DAY('QSO DB'!I37))&\" \"&IF(ISBLANK('QSO DB'!J37),\"XXXX\",LEFT('QSO DB'!J37,4))&\" \"&UPPER('QSO DB'!K37)&REPT(\" \",14-LEN('QSO DB'!K37))&IF(ISBLANK('QSO DB'!L37),REPT(\"X\",3),'QSO DB'!L37&REPT(\" \",3-LEN('QSO DB'!L37)))&\" \"&IF(ISBLANK('QSO DB'!M37),REPT(\"X\",4),'QSO DB'!M37)&\"   \"&UPPER('QSO DB'!F37)&REPT(\" \",14-LEN('QSO DB'!F37))&IF(ISBLANK('QSO DB'!G37),REPT(\"X\",3),'QSO DB'!G37&REPT(\" \",3-LEN('QSO DB'!G37)))&\" \"&IF(ISBLANK('QSO DB'!H37),REPT(\"X\",4),'QSO DB'!H37)))","v":""}]
[{"$f":"IF(OR(LEFT(A52,3)=\"END\",A52=\"\"),\"\",IF(ISBLANK('QSO DB'!D38),\"END-OF-LOG:\",\"QSO:\"&'QSO DB'!D38&REPT(\" \",6-LEN('QSO DB'!D38))&\" \"&IF(ISBLANK('QSO DB'!E38),\"xx\",\"\")&UPPER('QSO DB'!E38)&\" \"&IF(ISBLANK('QSO DB'!I38),REPT(\"X\",10),YEAR('QSO DB'!I38)&\"-\"&IF(MONTH('QSO DB'!I38)<10,\"0\",\"\")&MONTH('QSO DB'!I38)&\"-\"&IF(DAY('QSO DB'!I38)<10,\"0\",\"\")&DAY('QSO DB'!I38))&\" \"&IF(ISBLANK('QSO DB'!J38),\"XXXX\",LEFT('QSO DB'!J38,4))&\" \"&UPPER('QSO DB'!K38)&REPT(\" \",14-LEN('QSO DB'!K38))&IF(ISBLANK('QSO DB'!L38),REPT(\"X\",3),'QSO DB'!L38&REPT(\" \",3-LEN('QSO DB'!L38)))&\" \"&IF(ISBLANK('QSO DB'!M38),REPT(\"X\",4),'QSO DB'!M38)&\"   \"&UPPER('QSO DB'!F38)&REPT(\" \",14-LEN('QSO DB'!F38))&IF(ISBLANK('QSO DB'!G38),REPT(\"X\",3),'QSO DB'!G38&REPT(\" \",3-LEN('QSO DB'!G38)))&\" \"&IF(ISBLANK('QSO DB'!H38),REPT(\"X\",4),'QSO DB'!H38)))","v":""}]
[{"$f":"IF(OR(LEFT(A53,3)=\"END\",A53=\"\"),\"\",IF(ISBLANK('QSO DB'!D39),\"END-OF-LOG:\",\"QSO:\"&'QSO DB'!D39&REPT(\" \",6-LEN('QSO DB'!D39))&\" \"&IF(ISBLANK('QSO DB'!E39),\"xx\",\"\")&UPPER('QSO DB'!E39)&\" \"&IF(ISBLANK('QSO DB'!I39),REPT(\"X\",10),YEAR('QSO DB'!I39)&\"-\"&IF(MONTH('QSO DB'!I39)<10,\"0\",\"\")&MONTH('QSO DB'!I39)&\"-\"&IF(DAY('QSO DB'!I39)<10,\"0\",\"\")&DAY('QSO DB'!I39))&\" \"&IF(ISBLANK('QSO DB'!J39),\"XXXX\",LEFT('QSO DB'!J39,4))&\" \"&UPPER('QSO DB'!K39)&REPT(\" \",14-LEN('QSO DB'!K39))&IF(ISBLANK('QSO DB'!L39),REPT(\"X\",3),'QSO DB'!L39&REPT(\" \",3-LEN('QSO DB'!L39)))&\" \"&IF(ISBLANK('QSO DB'!M39),REPT(\"X\",4),'QSO DB'!M39)&\"   \"&UPPER('QSO DB'!F39)&REPT(\" \",14-LEN('QSO DB'!F39))&IF(ISBLANK('QSO DB'!G39),REPT(\"X\",3),'QSO DB'!G39&REPT(\" \",3-LEN('QSO DB'!G39)))&\" \"&IF(ISBLANK('QSO DB'!H39),REPT(\"X\",4),'QSO DB'!H39)))","v":""}]
[{"$f":"IF(OR(LEFT(A54,3)=\"END\",A54=\"\"),\"\",IF(ISBLANK('QSO DB'!D40),\"END-OF-LOG:\",\"QSO:\"&'QSO DB'!D40&REPT(\" \",6-LEN('QSO DB'!D40))&\" \"&IF(ISBLANK('QSO DB'!E40),\"xx\",\"\")&UPPER('QSO DB'!E40)&\" \"&IF(ISBLANK('QSO DB'!I40),REPT(\"X\",10),YEAR('QSO DB'!I40)&\"-\"&IF(MONTH('QSO DB'!I40)<10,\"0\",\"\")&MONTH('QSO DB'!I40)&\"-\"&IF(DAY('QSO DB'!I40)<10,\"0\",\"\")&DAY('QSO DB'!I40))&\" \"&IF(ISBLANK('QSO DB'!J40),\"XXXX\",LEFT('QSO DB'!J40,4))&\" \"&UPPER('QSO DB'!K40)&REPT(\" \",14-LEN('QSO DB'!K40))&IF(ISBLANK('QSO DB'!L40),REPT(\"X\",3),'QSO DB'!L40&REPT(\" \",3-LEN('QSO DB'!L40)))&\" \"&IF(ISBLANK('QSO DB'!M40),REPT(\"X\",4),'QSO DB'!M40)&\"   \"&UPPER('QSO DB'!F40)&REPT(\" \",14-LEN('QSO DB'!F40))&IF(ISBLANK('QSO DB'!G40),REPT(\"X\",3),'QSO DB'!G40&REPT(\" \",3-LEN('QSO DB'!G40)))&\" \"&IF(ISBLANK('QSO DB'!H40),REPT(\"X\",4),'QSO DB'!H40)))","v":""}]
[{"$f":"IF(OR(LEFT(A55,3)=\"END\",A55=\"\"),\"\",IF(ISBLANK('QSO DB'!D41),\"END-OF-LOG:\",\"QSO:\"&'QSO DB'!D41&REPT(\" \",6-LEN('QSO DB'!D41))&\" \"&IF(ISBLANK('QSO DB'!E41),\"xx\",\"\")&UPPER('QSO DB'!E41)&\" \"&IF(ISBLANK('QSO DB'!I41),REPT(\"X\",10),YEAR('QSO DB'!I41)&\"-\"&IF(MONTH('QSO DB'!I41)<10,\"0\",\"\")&MONTH('QSO DB'!I41)&\"-\"&IF(DAY('QSO DB'!I41)<10,\"0\",\"\")&DAY('QSO DB'!I41))&\" \"&IF(ISBLANK('QSO DB'!J41),\"XXXX\",LEFT('QSO DB'!J41,4))&\" \"&UPPER('QSO DB'!K41)&REPT(\" \",14-LEN('QSO DB'!K41))&IF(ISBLANK('QSO DB'!L41),REPT(\"X\",3),'QSO DB'!L41&REPT(\" \",3-LEN('QSO DB'!L41)))&\" \"&IF(ISBLANK('QSO DB'!M41),REPT(\"X\",4),'QSO DB'!M41)&\"   \"&UPPER('QSO DB'!F41)&REPT(\" \",14-LEN('QSO DB'!F41))&IF(ISBLANK('QSO DB'!G41),REPT(\"X\",3),'QSO DB'!G41&REPT(\" \",3-LEN('QSO DB'!G41)))&\" \"&IF(ISBLANK('QSO DB'!H41),REPT(\"X\",4),'QSO DB'!H41)))","v":""}]
[{"$f":"IF(OR(LEFT(A56,3)=\"END\",A56=\"\"),\"\",IF(ISBLANK('QSO DB'!D42),\"END-OF-LOG:\",\"QSO:\"&'QSO DB'!D42&REPT(\" \",6-LEN('QSO DB'!D42))&\" \"&IF(ISBLANK('QSO DB'!E42),\"xx\",\"\")&UPPER('QSO DB'!E42)&\" \"&IF(ISBLANK('QSO DB'!I42),REPT(\"X\",10),YEAR('QSO DB'!I42)&\"-\"&IF(MONTH('QSO DB'!I42)<10,\"0\",\"\")&MONTH('QSO DB'!I42)&\"-\"&IF(DAY('QSO DB'!I42)<10,\"0\",\"\")&DAY('QSO DB'!I42))&\" \"&IF(ISBLANK('QSO DB'!J42),\"XXXX\",LEFT('QSO DB'!J42,4))&\" \"&UPPER('QSO DB'!K42)&REPT(\" \",14-LEN('QSO DB'!K42))&IF(ISBLANK('QSO DB'!L42),REPT(\"X\",3),'QSO DB'!L42&REPT(\" \",3-LEN('QSO DB'!L42)))&\" \"&IF(ISBLANK('QSO DB'!M42),REPT(\"X\",4),'QSO DB'!M42)&\"   \"&UPPER('QSO DB'!F42)&REPT(\" \",14-LEN('QSO DB'!F42))&IF(ISBLANK('QSO DB'!G42),REPT(\"X\",3),'QSO DB'!G42&REPT(\" \",3-LEN('QSO DB'!G42)))&\" \"&IF(ISBLANK('QSO DB'!H42),REPT(\"X\",4),'QSO DB'!H42)))","v":""}]
[{"$f":"IF(OR(LEFT(A57,3)=\"END\",A57=\"\"),\"\",IF(ISBLANK('QSO DB'!D43),\"END-OF-LOG:\",\"QSO:\"&'QSO DB'!D43&REPT(\" \",6-LEN('QSO DB'!D43))&\" \"&IF(ISBLANK('QSO DB'!E43),\"xx\",\"\")&UPPER('QSO DB'!E43)&\" \"&IF(ISBLANK('QSO DB'!I43),REPT(\"X\",10),YEAR('QSO DB'!I43)&\"-\"&IF(MONTH('QSO DB'!I43)<10,\"0\",\"\")&MONTH('QSO DB'!I43)&\"-\"&IF(DAY('QSO DB'!I43)<10,\"0\",\"\")&DAY('QSO DB'!I43))&\" \"&IF(ISBLANK('QSO DB'!J43),\"XXXX\",LEFT('QSO DB'!J43,4))&\" \"&UPPER('QSO DB'!K43)&REPT(\" \",14-LEN('QSO DB'!K43))&IF(ISBLANK('QSO DB'!L43),REPT(\"X\",3),'QSO DB'!L43&REPT(\" \",3-LEN('QSO DB'!L43)))&\" \"&IF(ISBLANK('QSO DB'!M43),REPT(\"X\",4),'QSO DB'!M43)&\"   \"&UPPER('QSO DB'!F43)&REPT(\" \",14-LEN('QSO DB'!F43))&IF(ISBLANK('QSO DB'!G43),REPT(\"X\",3),'QSO DB'!G43&REPT(\" \",3-LEN('QSO DB'!G43)))&\" \"&IF(ISBLANK('QSO DB'!H43),REPT(\"X\",4),'QSO DB'!H43)))","v":""}]
[{"$f":"IF(OR(LEFT(A58,3)=\"END\",A58=\"\"),\"\",IF(ISBLANK('QSO DB'!D44),\"END-OF-LOG:\",\"QSO:\"&'QSO DB'!D44&REPT(\" \",6-LEN('QSO DB'!D44))&\" \"&IF(ISBLANK('QSO DB'!E44),\"xx\",\"\")&UPPER('QSO DB'!E44)&\" \"&IF(ISBLANK('QSO DB'!I44),REPT(\"X\",10),YEAR('QSO DB'!I44)&\"-\"&IF(MONTH('QSO DB'!I44)<10,\"0\",\"\")&MONTH('QSO DB'!I44)&\"-\"&IF(DAY('QSO DB'!I44)<10,\"0\",\"\")&DAY('QSO DB'!I44))&\" \"&IF(ISBLANK('QSO DB'!J44),\"XXXX\",LEFT('QSO DB'!J44,4))&\" \"&UPPER('QSO DB'!K44)&REPT(\" \",14-LEN('QSO DB'!K44))&IF(ISBLANK('QSO DB'!L44),REPT(\"X\",3),'QSO DB'!L44&REPT(\" \",3-LEN('QSO DB'!L44)))&\" \"&IF(ISBLANK('QSO DB'!M44),REPT(\"X\",4),'QSO DB'!M44)&\"   \"&UPPER('QSO DB'!F44)&REPT(\" \",14-LEN('QSO DB'!F44))&IF(ISBLANK('QSO DB'!G44),REPT(\"X\",3),'QSO DB'!G44&REPT(\" \",3-LEN('QSO DB'!G44)))&\" \"&IF(ISBLANK('QSO DB'!H44),REPT(\"X\",4),'QSO DB'!H44)))","v":""}]
[{"$f":"IF(OR(LEFT(A59,3)=\"END\",A59=\"\"),\"\",IF(ISBLANK('QSO DB'!D45),\"END-OF-LOG:\",\"QSO:\"&'QSO DB'!D45&REPT(\" \",6-LEN('QSO DB'!D45))&\" \"&IF(ISBLANK('QSO DB'!E45),\"xx\",\"\")&UPPER('QSO DB'!E45)&\" \"&IF(ISBLANK('QSO DB'!I45),REPT(\"X\",10),YEAR('QSO DB'!I45)&\"-\"&IF(MONTH('QSO DB'!I45)<10,\"0\",\"\")&MONTH('QSO DB'!I45)&\"-\"&IF(DAY('QSO DB'!I45)<10,\"0\",\"\")&DAY('QSO DB'!I45))&\" \"&IF(ISBLANK('QSO DB'!J45),\"XXXX\",LEFT('QSO DB'!J45,4))&\" \"&UPPER('QSO DB'!K45)&REPT(\" \",14-LEN('QSO DB'!K45))&IF(ISBLANK('QSO DB'!L45),REPT(\"X\",3),'QSO DB'!L45&REPT(\" \",3-LEN('QSO DB'!L45)))&\" \"&IF(ISBLANK('QSO DB'!M45),REPT(\"X\",4),'QSO DB'!M45)&\"   \"&UPPER('QSO DB'!F45)&REPT(\" \",14-LEN('QSO DB'!F45))&IF(ISBLANK('QSO DB'!G45),REPT(\"X\",3),'QSO DB'!G45&REPT(\" \",3-LEN('QSO DB'!G45)))&\" \"&IF(ISBLANK('QSO DB'!H45),REPT(\"X\",4),'QSO DB'!H45)))","v":""}]
[{"$f":"IF(OR(LEFT(A60,3)=\"END\",A60=\"\"),\"\",IF(ISBLANK('QSO DB'!D46),\"END-OF-LOG:\",\"QSO:\"&'QSO DB'!D46&REPT(\" \",6-LEN('QSO DB'!D46))&\" \"&IF(ISBLANK('QSO DB'!E46),\"xx\",\"\")&UPPER('QSO DB'!E46)&\" \"&IF(ISBLANK('QSO DB'!I46),REPT(\"X\",10),YEAR('QSO DB'!I46)&\"-\"&IF(MONTH('QSO DB'!I46)<10,\"0\",\"\")&MONTH('QSO DB'!I46)&\"-\"&IF(DAY('QSO DB'!I46)<10,\"0\",\"\")&DAY('QSO DB'!I46))&\" \"&IF(ISBLANK('QSO DB'!J46),\"XXXX\",LEFT('QSO DB'!J46,4))&\" \"&UPPER('QSO DB'!K46)&REPT(\" \",14-LEN('QSO DB'!K46))&IF(ISBLANK('QSO DB'!L46),REPT(\"X\",3),'QSO DB'!L46&REPT(\" \",3-LEN('QSO DB'!L46)))&\" \"&IF(ISBLANK('QSO DB'!M46),REPT(\"X\",4),'QSO DB'!M46)&\"   \"&UPPER('QSO DB'!F46)&REPT(\" \",14-LEN('QSO DB'!F46))&IF(ISBLANK('QSO DB'!G46),REPT(\"X\",3),'QSO DB'!G46&REPT(\" \",3-LEN('QSO DB'!G46)))&\" \"&IF(ISBLANK('QSO DB'!H46),REPT(\"X\",4),'QSO DB'!H46)))","v":""}]
[{"$f":"IF(OR(LEFT(A61,3)=\"END\",A61=\"\"),\"\",IF(ISBLANK('QSO DB'!D47),\"END-OF-LOG:\",\"QSO:\"&'QSO DB'!D47&REPT(\" \",6-LEN('QSO DB'!D47))&\" \"&IF(ISBLANK('QSO DB'!E47),\"xx\",\"\")&UPPER('QSO DB'!E47)&\" \"&IF(ISBLANK('QSO DB'!I47),REPT(\"X\",10),YEAR('QSO DB'!I47)&\"-\"&IF(MONTH('QSO DB'!I47)<10,\"0\",\"\")&MONTH('QSO DB'!I47)&\"-\"&IF(DAY('QSO DB'!I47)<10,\"0\",\"\")&DAY('QSO DB'!I47))&\" \"&IF(ISBLANK('QSO DB'!J47),\"XXXX\",LEFT('QSO DB'!J47,4))&\" \"&UPPER('QSO DB'!K47)&REPT(\" \",14-LEN('QSO DB'!K47))&IF(ISBLANK('QSO DB'!L47),REPT(\"X\",3),'QSO DB'!L47&REPT(\" \",3-LEN('QSO DB'!L47)))&\" \"&IF(ISBLANK('QSO DB'!M47),REPT(\"X\",4),'QSO DB'!M47)&\"   \"&UPPER('QSO DB'!F47)&REPT(\" \",14-LEN('QSO DB'!F47))&IF(ISBLANK('QSO DB'!G47),REPT(\"X\",3),'QSO DB'!G47&REPT(\" \",3-LEN('QSO DB'!G47)))&\" \"&IF(ISBLANK('QSO DB'!H47),REPT(\"X\",4),'QSO DB'!H47)))","v":""}]
[{"$f":"IF(OR(LEFT(A62,3)=\"END\",A62=\"\"),\"\",IF(ISBLANK('QSO DB'!D48),\"END-OF-LOG:\",\"QSO:\"&'QSO DB'!D48&REPT(\" \",6-LEN('QSO DB'!D48))&\" \"&IF(ISBLANK('QSO DB'!E48),\"xx\",\"\")&UPPER('QSO DB'!E48)&\" \"&IF(ISBLANK('QSO DB'!I48),REPT(\"X\",10),YEAR('QSO DB'!I48)&\"-\"&IF(MONTH('QSO DB'!I48)<10,\"0\",\"\")&MONTH('QSO DB'!I48)&\"-\"&IF(DAY('QSO DB'!I48)<10,\"0\",\"\")&DAY('QSO DB'!I48))&\" \"&IF(ISBLANK('QSO DB'!J48),\"XXXX\",LEFT('QSO DB'!J48,4))&\" \"&UPPER('QSO DB'!K48)&REPT(\" \",14-LEN('QSO DB'!K48))&IF(ISBLANK('QSO DB'!L48),REPT(\"X\",3),'QSO DB'!L48&REPT(\" \",3-LEN('QSO DB'!L48)))&\" \"&IF(ISBLANK('QSO DB'!M48),REPT(\"X\",4),'QSO DB'!M48)&\"   \"&UPPER('QSO DB'!F48)&REPT(\" \",14-LEN('QSO DB'!F48))&IF(ISBLANK('QSO DB'!G48),REPT(\"X\",3),'QSO DB'!G48&REPT(\" \",3-LEN('QSO DB'!G48)))&\" \"&IF(ISBLANK('QSO DB'!H48),REPT(\"X\",4),'QSO DB'!H48)))","v":""}]
[{"$f":"IF(OR(LEFT(A63,3)=\"END\",A63=\"\"),\"\",IF(ISBLANK('QSO DB'!D49),\"END-OF-LOG:\",\"QSO:\"&'QSO DB'!D49&REPT(\" \",6-LEN('QSO DB'!D49))&\" \"&IF(ISBLANK('QSO DB'!E49),\"xx\",\"\")&UPPER('QSO DB'!E49)&\" \"&IF(ISBLANK('QSO DB'!I49),REPT(\"X\",10),YEAR('QSO DB'!I49)&\"-\"&IF(MONTH('QSO DB'!I49)<10,\"0\",\"\")&MONTH('QSO DB'!I49)&\"-\"&IF(DAY('QSO DB'!I49)<10,\"0\",\"\")&DAY('QSO DB'!I49))&\" \"&IF(ISBLANK('QSO DB'!J49),\"XXXX\",LEFT('QSO DB'!J49,4))&\" \"&UPPER('QSO DB'!K49)&REPT(\" \",14-LEN('QSO DB'!K49))&IF(ISBLANK('QSO DB'!L49),REPT(\"X\",3),'QSO DB'!L49&REPT(\" \",3-LEN('QSO DB'!L49)))&\" \"&IF(ISBLANK('QSO DB'!M49),REPT(\"X\",4),'QSO DB'!M49)&\"   \"&UPPER('QSO DB'!F49)&REPT(\" \",14-LEN('QSO DB'!F49))&IF(ISBLANK('QSO DB'!G49),REPT(\"X\",3),'QSO DB'!G49&REPT(\" \",3-LEN('QSO DB'!G49)))&\" \"&IF(ISBLANK('QSO DB'!H49),REPT(\"X\",4),'QSO DB'!H49)))","v":""}]
[{"$f":"IF(OR(LEFT(A64,3)=\"END\",A64=\"\"),\"\",IF(ISBLANK('QSO DB'!D50),\"END-OF-LOG:\",\"QSO:\"&'QSO DB'!D50&REPT(\" \",6-LEN('QSO DB'!D50))&\" \"&IF(ISBLANK('QSO DB'!E50),\"xx\",\"\")&UPPER('QSO DB'!E50)&\" \"&IF(ISBLANK('QSO DB'!I50),REPT(\"X\",10),YEAR('QSO DB'!I50)&\"-\"&IF(MONTH('QSO DB'!I50)<10,\"0\",\"\")&MONTH('QSO DB'!I50)&\"-\"&IF(DAY('QSO DB'!I50)<10,\"0\",\"\")&DAY('QSO DB'!I50))&\" \"&IF(ISBLANK('QSO DB'!J50),\"XXXX\",LEFT('QSO DB'!J50,4))&\" \"&UPPER('QSO DB'!K50)&REPT(\" \",14-LEN('QSO DB'!K50))&IF(ISBLANK('QSO DB'!L50),REPT(\"X\",3),'QSO DB'!L50&REPT(\" \",3-LEN('QSO DB'!L50)))&\" \"&IF(ISBLANK('QSO DB'!M50),REPT(\"X\",4),'QSO DB'!M50)&\"   \"&UPPER('QSO DB'!F50)&REPT(\" \",14-LEN('QSO DB'!F50))&IF(ISBLANK('QSO DB'!G50),REPT(\"X\",3),'QSO DB'!G50&REPT(\" \",3-LEN('QSO DB'!G50)))&\" \"&IF(ISBLANK('QSO DB'!H50),REPT(\"X\",4),'QSO DB'!H50)))","v":""}]
[{"$f":"IF(OR(LEFT(A65,3)=\"END\",A65=\"\"),\"\",IF(ISBLANK('QSO DB'!D51),\"END-OF-LOG:\",\"QSO:\"&'QSO DB'!D51&REPT(\" \",6-LEN('QSO DB'!D51))&\" \"&IF(ISBLANK('QSO DB'!E51),\"xx\",\"\")&UPPER('QSO DB'!E51)&\" \"&IF(ISBLANK('QSO DB'!I51),REPT(\"X\",10),YEAR('QSO DB'!I51)&\"-\"&IF(MONTH('QSO DB'!I51)<10,\"0\",\"\")&MONTH('QSO DB'!I51)&\"-\"&IF(DAY('QSO DB'!I51)<10,\"0\",\"\")&DAY('QSO DB'!I51))&\" \"&IF(ISBLANK('QSO DB'!J51),\"XXXX\",LEFT('QSO DB'!J51,4))&\" \"&UPPER('QSO DB'!K51)&REPT(\" \",14-LEN('QSO DB'!K51))&IF(ISBLANK('QSO DB'!L51),REPT(\"X\",3),'QSO DB'!L51&REPT(\" \",3-LEN('QSO DB'!L51)))&\" \"&IF(ISBLANK('QSO DB'!M51),REPT(\"X\",4),'QSO DB'!M51)&\"   \"&UPPER('QSO DB'!F51)&REPT(\" \",14-LEN('QSO DB'!F51))&IF(ISBLANK('QSO DB'!G51),REPT(\"X\",3),'QSO DB'!G51&REPT(\" \",3-LEN('QSO DB'!G51)))&\" \"&IF(ISBLANK('QSO DB'!H51),REPT(\"X\",4),'QSO DB'!H51)))","v":""}]
[{"$f":"IF(OR(LEFT(A66,3)=\"END\",A66=\"\"),\"\",IF(ISBLANK('QSO DB'!D52),\"END-OF-LOG:\",\"QSO:\"&'QSO DB'!D52&REPT(\" \",6-LEN('QSO DB'!D52))&\" \"&IF(ISBLANK('QSO DB'!E52),\"xx\",\"\")&UPPER('QSO DB'!E52)&\" \"&IF(ISBLANK('QSO DB'!I52),REPT(\"X\",10),YEAR('QSO DB'!I52)&\"-\"&IF(MONTH('QSO DB'!I52)<10,\"0\",\"\")&MONTH('QSO DB'!I52)&\"-\"&IF(DAY('QSO DB'!I52)<10,\"0\",\"\")&DAY('QSO DB'!I52))&\" \"&IF(ISBLANK('QSO DB'!J52),\"XXXX\",LEFT('QSO DB'!J52,4))&\" \"&UPPER('QSO DB'!K52)&REPT(\" \",14-LEN('QSO DB'!K52))&IF(ISBLANK('QSO DB'!L52),REPT(\"X\",3),'QSO DB'!L52&REPT(\" \",3-LEN('QSO DB'!L52)))&\" \"&IF(ISBLANK('QSO DB'!M52),REPT(\"X\",4),'QSO DB'!M52)&\"   \"&UPPER('QSO DB'!F52)&REPT(\" \",14-LEN('QSO DB'!F52))&IF(ISBLANK('QSO DB'!G52),REPT(\"X\",3),'QSO DB'!G52&REPT(\" \",3-LEN('QSO DB'!G52)))&\" \"&IF(ISBLANK('QSO DB'!H52),REPT(\"X\",4),'QSO DB'!H52)))","v":""}]
[{"$f":"IF(OR(LEFT(A67,3)=\"END\",A67=\"\"),\"\",IF(ISBLANK('QSO DB'!D53),\"END-OF-LOG:\",\"QSO:\"&'QSO DB'!D53&REPT(\" \",6-LEN('QSO DB'!D53))&\" \"&IF(ISBLANK('QSO DB'!E53),\"xx\",\"\")&UPPER('QSO DB'!E53)&\" \"&IF(ISBLANK('QSO DB'!I53),REPT(\"X\",10),YEAR('QSO DB'!I53)&\"-\"&IF(MONTH('QSO DB'!I53)<10,\"0\",\"\")&MONTH('QSO DB'!I53)&\"-\"&IF(DAY('QSO DB'!I53)<10,\"0\",\"\")&DAY('QSO DB'!I53))&\" \"&IF(ISBLANK('QSO DB'!J53),\"XXXX\",LEFT('QSO DB'!J53,4))&\" \"&UPPER('QSO DB'!K53)&REPT(\" \",14-LEN('QSO DB'!K53))&IF(ISBLANK('QSO DB'!L53),REPT(\"X\",3),'QSO DB'!L53&REPT(\" \",3-LEN('QSO DB'!L53)))&\" \"&IF(ISBLANK('QSO DB'!M53),REPT(\"X\",4),'QSO DB'!M53)&\"   \"&UPPER('QSO DB'!F53)&REPT(\" \",14-LEN('QSO DB'!F53))&IF(ISBLANK('QSO DB'!G53),REPT(\"X\",3),'QSO DB'!G53&REPT(\" \",3-LEN('QSO DB'!G53)))&\" \"&IF(ISBLANK('QSO DB'!H53),REPT(\"X\",4),'QSO DB'!H53)))","v":""}]
[{"$f":"IF(OR(LEFT(A68,3)=\"END\",A68=\"\"),\"\",IF(ISBLANK('QSO DB'!D54),\"END-OF-LOG:\",\"QSO:\"&'QSO DB'!D54&REPT(\" \",6-LEN('QSO DB'!D54))&\" \"&IF(ISBLANK('QSO DB'!E54),\"xx\",\"\")&UPPER('QSO DB'!E54)&\" \"&IF(ISBLANK('QSO DB'!I54),REPT(\"X\",10),YEAR('QSO DB'!I54)&\"-\"&IF(MONTH('QSO DB'!I54)<10,\"0\",\"\")&MONTH('QSO DB'!I54)&\"-\"&IF(DAY('QSO DB'!I54)<10,\"0\",\"\")&DAY('QSO DB'!I54))&\" \"&IF(ISBLANK('QSO DB'!J54),\"XXXX\",LEFT('QSO DB'!J54,4))&\" \"&UPPER('QSO DB'!K54)&REPT(\" \",14-LEN('QSO DB'!K54))&IF(ISBLANK('QSO DB'!L54),REPT(\"X\",3),'QSO DB'!L54&REPT(\" \",3-LEN('QSO DB'!L54)))&\" \"&IF(ISBLANK('QSO DB'!M54),REPT(\"X\",4),'QSO DB'!M54)&\"   \"&UPPER('QSO DB'!F54)&REPT(\" \",14-LEN('QSO DB'!F54))&IF(ISBLANK('QSO DB'!G54),REPT(\"X\",3),'QSO DB'!G54&REPT(\" \",3-LEN('QSO DB'!G54)))&\" \"&IF(ISBLANK('QSO DB'!H54),REPT(\"X\",4),'QSO DB'!H54)))","v":""}]
[{"$f":"IF(OR(LEFT(A69,3)=\"END\",A69=\"\"),\"\",IF(ISBLANK('QSO DB'!D55),\"END-OF-LOG:\",\"QSO:\"&'QSO DB'!D55&REPT(\" \",6-LEN('QSO DB'!D55))&\" \"&IF(ISBLANK('QSO DB'!E55),\"xx\",\"\")&UPPER('QSO DB'!E55)&\" \"&IF(ISBLANK('QSO DB'!I55),REPT(\"X\",10),YEAR('QSO DB'!I55)&\"-\"&IF(MONTH('QSO DB'!I55)<10,\"0\",\"\")&MONTH('QSO DB'!I55)&\"-\"&IF(DAY('QSO DB'!I55)<10,\"0\",\"\")&DAY('QSO DB'!I55))&\" \"&IF(ISBLANK('QSO DB'!J55),\"XXXX\",LEFT('QSO DB'!J55,4))&\" \"&UPPER('QSO DB'!K55)&REPT(\" \",14-LEN('QSO DB'!K55))&IF(ISBLANK('QSO DB'!L55),REPT(\"X\",3),'QSO DB'!L55&REPT(\" \",3-LEN('QSO DB'!L55)))&\" \"&IF(ISBLANK('QSO DB'!M55),REPT(\"X\",4),'QSO DB'!M55)&\"   \"&UPPER('QSO DB'!F55)&REPT(\" \",14-LEN('QSO DB'!F55))&IF(ISBLANK('QSO DB'!G55),REPT(\"X\",3),'QSO DB'!G55&REPT(\" \",3-LEN('QSO DB'!G55)))&\" \"&IF(ISBLANK('QSO DB'!H55),REPT(\"X\",4),'QSO DB'!H55)))","v":""}]
[{"$f":"IF(OR(LEFT(A70,3)=\"END\",A70=\"\"),\"\",IF(ISBLANK('QSO DB'!D56),\"END-OF-LOG:\",\"QSO:\"&'QSO DB'!D56&REPT(\" \",6-LEN('QSO DB'!D56))&\" \"&IF(ISBLANK('QSO DB'!E56),\"xx\",\"\")&UPPER('QSO DB'!E56)&\" \"&IF(ISBLANK('QSO DB'!I56),REPT(\"X\",10),YEAR('QSO DB'!I56)&\"-\"&IF(MONTH('QSO DB'!I56)<10,\"0\",\"\")&MONTH('QSO DB'!I56)&\"-\"&IF(DAY('QSO DB'!I56)<10,\"0\",\"\")&DAY('QSO DB'!I56))&\" \"&IF(ISBLANK('QSO DB'!J56),\"XXXX\",LEFT('QSO DB'!J56,4))&\" \"&UPPER('QSO DB'!K56)&REPT(\" \",14-LEN('QSO DB'!K56))&IF(ISBLANK('QSO DB'!L56),REPT(\"X\",3),'QSO DB'!L56&REPT(\" \",3-LEN('QSO DB'!L56)))&\" \"&IF(ISBLANK('QSO DB'!M56),REPT(\"X\",4),'QSO DB'!M56)&\"   \"&UPPER('QSO DB'!F56)&REPT(\" \",14-LEN('QSO DB'!F56))&IF(ISBLANK('QSO DB'!G56),REPT(\"X\",3),'QSO DB'!G56&REPT(\" \",3-LEN('QSO DB'!G56)))&\" \"&IF(ISBLANK('QSO DB'!H56),REPT(\"X\",4),'QSO DB'!H56)))","v":""}]
[{"$f":"IF(OR(LEFT(A71,3)=\"END\",A71=\"\"),\"\",IF(ISBLANK('QSO DB'!D57),\"END-OF-LOG:\",\"QSO:\"&'QSO DB'!D57&REPT(\" \",6-LEN('QSO DB'!D57))&\" \"&IF(ISBLANK('QSO DB'!E57),\"xx\",\"\")&UPPER('QSO DB'!E57)&\" \"&IF(ISBLANK('QSO DB'!I57),REPT(\"X\",10),YEAR('QSO DB'!I57)&\"-\"&IF(MONTH('QSO DB'!I57)<10,\"0\",\"\")&MONTH('QSO DB'!I57)&\"-\"&IF(DAY('QSO DB'!I57)<10,\"0\",\"\")&DAY('QSO DB'!I57))&\" \"&IF(ISBLANK('QSO DB'!J57),\"XXXX\",LEFT('QSO DB'!J57,4))&\" \"&UPPER('QSO DB'!K57)&REPT(\" \",14-LEN('QSO DB'!K57))&IF(ISBLANK('QSO DB'!L57),REPT(\"X\",3),'QSO DB'!L57&REPT(\" \",3-LEN('QSO DB'!L57)))&\" \"&IF(ISBLANK('QSO DB'!M57),REPT(\"X\",4),'QSO DB'!M57)&\"   \"&UPPER('QSO DB'!F57)&REPT(\" \",14-LEN('QSO DB'!F57))&IF(ISBLANK('QSO DB'!G57),REPT(\"X\",3),'QSO DB'!G57&REPT(\" \",3-LEN('QSO DB'!G57)))&\" \"&IF(ISBLANK('QSO DB'!H57),REPT(\"X\",4),'QSO DB'!H57)))","v":""}]
[{"$f":"IF(OR(LEFT(A72,3)=\"END\",A72=\"\"),\"\",IF(ISBLANK('QSO DB'!D58),\"END-OF-LOG:\",\"QSO:\"&'QSO DB'!D58&REPT(\" \",6-LEN('QSO DB'!D58))&\" \"&IF(ISBLANK('QSO DB'!E58),\"xx\",\"\")&UPPER('QSO DB'!E58)&\" \"&IF(ISBLANK('QSO DB'!I58),REPT(\"X\",10),YEAR('QSO DB'!I58)&\"-\"&IF(MONTH('QSO DB'!I58)<10,\"0\",\"\")&MONTH('QSO DB'!I58)&\"-\"&IF(DAY('QSO DB'!I58)<10,\"0\",\"\")&DAY('QSO DB'!I58))&\" \"&IF(ISBLANK('QSO DB'!J58),\"XXXX\",LEFT('QSO DB'!J58,4))&\" \"&UPPER('QSO DB'!K58)&REPT(\" \",14-LEN('QSO DB'!K58))&IF(ISBLANK('QSO DB'!L58),REPT(\"X\",3),'QSO DB'!L58&REPT(\" \",3-LEN('QSO DB'!L58)))&\" \"&IF(ISBLANK('QSO DB'!M58),REPT(\"X\",4),'QSO DB'!M58)&\"   \"&UPPER('QSO DB'!F58)&REPT(\" \",14-LEN('QSO DB'!F58))&IF(ISBLANK('QSO DB'!G58),REPT(\"X\",3),'QSO DB'!G58&REPT(\" \",3-LEN('QSO DB'!G58)))&\" \"&IF(ISBLANK('QSO DB'!H58),REPT(\"X\",4),'QSO DB'!H58)))","v":""}]
[{"$f":"IF(OR(LEFT(A73,3)=\"END\",A73=\"\"),\"\",IF(ISBLANK('QSO DB'!D59),\"END-OF-LOG:\",\"QSO:\"&'QSO DB'!D59&REPT(\" \",6-LEN('QSO DB'!D59))&\" \"&IF(ISBLANK('QSO DB'!E59),\"xx\",\"\")&UPPER('QSO DB'!E59)&\" \"&IF(ISBLANK('QSO DB'!I59),REPT(\"X\",10),YEAR('QSO DB'!I59)&\"-\"&IF(MONTH('QSO DB'!I59)<10,\"0\",\"\")&MONTH('QSO DB'!I59)&\"-\"&IF(DAY('QSO DB'!I59)<10,\"0\",\"\")&DAY('QSO DB'!I59))&\" \"&IF(ISBLANK('QSO DB'!J59),\"XXXX\",LEFT('QSO DB'!J59,4))&\" \"&UPPER('QSO DB'!K59)&REPT(\" \",14-LEN('QSO DB'!K59))&IF(ISBLANK('QSO DB'!L59),REPT(\"X\",3),'QSO DB'!L59&REPT(\" \",3-LEN('QSO DB'!L59)))&\" \"&IF(ISBLANK('QSO DB'!M59),REPT(\"X\",4),'QSO DB'!M59)&\"   \"&UPPER('QSO DB'!F59)&REPT(\" \",14-LEN('QSO DB'!F59))&IF(ISBLANK('QSO DB'!G59),REPT(\"X\",3),'QSO DB'!G59&REPT(\" \",3-LEN('QSO DB'!G59)))&\" \"&IF(ISBLANK('QSO DB'!H59),REPT(\"X\",4),'QSO DB'!H59)))","v":""}]
[{"$f":"IF(OR(LEFT(A74,3)=\"END\",A74=\"\"),\"\",IF(ISBLANK('QSO DB'!D60),\"END-OF-LOG:\",\"QSO:\"&'QSO DB'!D60&REPT(\" \",6-LEN('QSO DB'!D60))&\" \"&IF(ISBLANK('QSO DB'!E60),\"xx\",\"\")&UPPER('QSO DB'!E60)&\" \"&IF(ISBLANK('QSO DB'!I60),REPT(\"X\",10),YEAR('QSO DB'!I60)&\"-\"&IF(MONTH('QSO DB'!I60)<10,\"0\",\"\")&MONTH('QSO DB'!I60)&\"-\"&IF(DAY('QSO DB'!I60)<10,\"0\",\"\")&DAY('QSO DB'!I60))&\" \"&IF(ISBLANK('QSO DB'!J60),\"XXXX\",LEFT('QSO DB'!J60,4))&\" \"&UPPER('QSO DB'!K60)&REPT(\" \",14-LEN('QSO DB'!K60))&IF(ISBLANK('QSO DB'!L60),REPT(\"X\",3),'QSO DB'!L60&REPT(\" \",3-LEN('QSO DB'!L60)))&\" \"&IF(ISBLANK('QSO DB'!M60),REPT(\"X\",4),'QSO DB'!M60)&\"   \"&UPPER('QSO DB'!F60)&REPT(\" \",14-LEN('QSO DB'!F60))&IF(ISBLANK('QSO DB'!G60),REPT(\"X\",3),'QSO DB'!G60&REPT(\" \",3-LEN('QSO DB'!G60)))&\" \"&IF(ISBLANK('QSO DB'!H60),REPT(\"X\",4),'QSO DB'!H60)))","v":""}]
[{"$f":"IF(OR(LEFT(A75,3)=\"END\",A75=\"\"),\"\",IF(ISBLANK('QSO DB'!D61),\"END-OF-LOG:\",\"QSO:\"&'QSO DB'!D61&REPT(\" \",6-LEN('QSO DB'!D61))&\" \"&IF(ISBLANK('QSO DB'!E61),\"xx\",\"\")&UPPER('QSO DB'!E61)&\" \"&IF(ISBLANK('QSO DB'!I61),REPT(\"X\",10),YEAR('QSO DB'!I61)&\"-\"&IF(MONTH('QSO DB'!I61)<10,\"0\",\"\")&MONTH('QSO DB'!I61)&\"-\"&IF(DAY('QSO DB'!I61)<10,\"0\",\"\")&DAY('QSO DB'!I61))&\" \"&IF(ISBLANK('QSO DB'!J61),\"XXXX\",LEFT('QSO DB'!J61,4))&\" \"&UPPER('QSO DB'!K61)&REPT(\" \",14-LEN('QSO DB'!K61))&IF(ISBLANK('QSO DB'!L61),REPT(\"X\",3),'QSO DB'!L61&REPT(\" \",3-LEN('QSO DB'!L61)))&\" \"&IF(ISBLANK('QSO DB'!M61),REPT(\"X\",4),'QSO DB'!M61)&\"   \"&UPPER('QSO DB'!F61)&REPT(\" \",14-LEN('QSO DB'!F61))&IF(ISBLANK('QSO DB'!G61),REPT(\"X\",3),'QSO DB'!G61&REPT(\" \",3-LEN('QSO DB'!G61)))&\" \"&IF(ISBLANK('QSO DB'!H61),REPT(\"X\",4),'QSO DB'!H61)))","v":""}]
[{"$f":"IF(OR(LEFT(A76,3)=\"END\",A76=\"\"),\"\",IF(ISBLANK('QSO DB'!D62),\"END-OF-LOG:\",\"QSO:\"&'QSO DB'!D62&REPT(\" \",6-LEN('QSO DB'!D62))&\" \"&IF(ISBLANK('QSO DB'!E62),\"xx\",\"\")&UPPER('QSO DB'!E62)&\" \"&IF(ISBLANK('QSO DB'!I62),REPT(\"X\",10),YEAR('QSO DB'!I62)&\"-\"&IF(MONTH('QSO DB'!I62)<10,\"0\",\"\")&MONTH('QSO DB'!I62)&\"-\"&IF(DAY('QSO DB'!I62)<10,\"0\",\"\")&DAY('QSO DB'!I62))&\" \"&IF(ISBLANK('QSO DB'!J62),\"XXXX\",LEFT('QSO DB'!J62,4))&\" \"&UPPER('QSO DB'!K62)&REPT(\" \",14-LEN('QSO DB'!K62))&IF(ISBLANK('QSO DB'!L62),REPT(\"X\",3),'QSO DB'!L62&REPT(\" \",3-LEN('QSO DB'!L62)))&\" \"&IF(ISBLANK('QSO DB'!M62),REPT(\"X\",4),'QSO DB'!M62)&\"   \"&UPPER('QSO DB'!F62)&REPT(\" \",14-LEN('QSO DB'!F62))&IF(ISBLANK('QSO DB'!G62),REPT(\"X\",3),'QSO DB'!G62&REPT(\" \",3-LEN('QSO DB'!G62)))&\" \"&IF(ISBLANK('QSO DB'!H62),REPT(\"X\",4),'QSO DB'!H62)))","v":""}]
[{"$f":"IF(OR(LEFT(A77,3)=\"END\",A77=\"\"),\"\",IF(ISBLANK('QSO DB'!D63),\"END-OF-LOG:\",\"QSO:\"&'QSO DB'!D63&REPT(\" \",6-LEN('QSO DB'!D63))&\" \"&IF(ISBLANK('QSO DB'!E63),\"xx\",\"\")&UPPER('QSO DB'!E63)&\" \"&IF(ISBLANK('QSO DB'!I63),REPT(\"X\",10),YEAR('QSO DB'!I63)&\"-\"&IF(MONTH('QSO DB'!I63)<10,\"0\",\"\")&MONTH('QSO DB'!I63)&\"-\"&IF(DAY('QSO DB'!I63)<10,\"0\",\"\")&DAY('QSO DB'!I63))&\" \"&IF(ISBLANK('QSO DB'!J63),\"XXXX\",LEFT('QSO DB'!J63,4))&\" \"&UPPER('QSO DB'!K63)&REPT(\" \",14-LEN('QSO DB'!K63))&IF(ISBLANK('QSO DB'!L63),REPT(\"X\",3),'QSO DB'!L63&REPT(\" \",3-LEN('QSO DB'!L63)))&\" \"&IF(ISBLANK('QSO DB'!M63),REPT(\"X\",4),'QSO DB'!M63)&\"   \"&UPPER('QSO DB'!F63)&REPT(\" \",14-LEN('QSO DB'!F63))&IF(ISBLANK('QSO DB'!G63),REPT(\"X\",3),'QSO DB'!G63&REPT(\" \",3-LEN('QSO DB'!G63)))&\" \"&IF(ISBLANK('QSO DB'!H63),REPT(\"X\",4),'QSO DB'!H63)))","v":""}]
[{"$f":"IF(OR(LEFT(A78,3)=\"END\",A78=\"\"),\"\",IF(ISBLANK('QSO DB'!D64),\"END-OF-LOG:\",\"QSO:\"&'QSO DB'!D64&REPT(\" \",6-LEN('QSO DB'!D64))&\" \"&IF(ISBLANK('QSO DB'!E64),\"xx\",\"\")&UPPER('QSO DB'!E64)&\" \"&IF(ISBLANK('QSO DB'!I64),REPT(\"X\",10),YEAR('QSO DB'!I64)&\"-\"&IF(MONTH('QSO DB'!I64)<10,\"0\",\"\")&MONTH('QSO DB'!I64)&\"-\"&IF(DAY('QSO DB'!I64)<10,\"0\",\"\")&DAY('QSO DB'!I64))&\" \"&IF(ISBLANK('QSO DB'!J64),\"XXXX\",LEFT('QSO DB'!J64,4))&\" \"&UPPER('QSO DB'!K64)&REPT(\" \",14-LEN('QSO DB'!K64))&IF(ISBLANK('QSO DB'!L64),REPT(\"X\",3),'QSO DB'!L64&REPT(\" \",3-LEN('QSO DB'!L64)))&\" \"&IF(ISBLANK('QSO DB'!M64),REPT(\"X\",4),'QSO DB'!M64)&\"   \"&UPPER('QSO DB'!F64)&REPT(\" \",14-LEN('QSO DB'!F64))&IF(ISBLANK('QSO DB'!G64),REPT(\"X\",3),'QSO DB'!G64&REPT(\" \",3-LEN('QSO DB'!G64)))&\" \"&IF(ISBLANK('QSO DB'!H64),REPT(\"X\",4),'QSO DB'!H64)))","v":""}]
[{"$f":"IF(OR(LEFT(A79,3)=\"END\",A79=\"\"),\"\",IF(ISBLANK('QSO DB'!D65),\"END-OF-LOG:\",\"QSO:\"&'QSO DB'!D65&REPT(\" \",6-LEN('QSO DB'!D65))&\" \"&IF(ISBLANK('QSO DB'!E65),\"xx\",\"\")&UPPER('QSO DB'!E65)&\" \"&IF(ISBLANK('QSO DB'!I65),REPT(\"X\",10),YEAR('QSO DB'!I65)&\"-\"&IF(MONTH('QSO DB'!I65)<10,\"0\",\"\")&MONTH('QSO DB'!I65)&\"-\"&IF(DAY('QSO DB'!I65)<10,\"0\",\"\")&DAY('QSO DB'!I65))&\" \"&IF(ISBLANK('QSO DB'!J65),\"XXXX\",LEFT('QSO DB'!J65,4))&\" \"&UPPER('QSO DB'!K65)&REPT(\" \",14-LEN('QSO DB'!K65))&IF(ISBLANK('QSO DB'!L65),REPT(\"X\",3),'QSO DB'!L65&REPT(\" \",3-LEN('QSO DB'!L65)))&\" \"&IF(ISBLANK('QSO DB'!M65),REPT(\"X\",4),'QSO DB'!M65)&\"   \"&UPPER('QSO DB'!F65)&REPT(\" \",14-LEN('QSO DB'!F65))&IF(ISBLANK('QSO DB'!G65),REPT(\"X\",3),'QSO DB'!G65&REPT(\" \",3-LEN('QSO DB'!G65)))&\" \"&IF(ISBLANK('QSO DB'!H65),REPT(\"X\",4),'QSO DB'!H65)))","v":""}]
[{"$f":"IF(OR(LEFT(A80,3)=\"END\",A80=\"\"),\"\",IF(ISBLANK('QSO DB'!D66),\"END-OF-LOG:\",\"QSO:\"&'QSO DB'!D66&REPT(\" \",6-LEN('QSO DB'!D66))&\" \"&IF(ISBLANK('QSO DB'!E66),\"xx\",\"\")&UPPER('QSO DB'!E66)&\" \"&IF(ISBLANK('QSO DB'!I66),REPT(\"X\",10),YEAR('QSO DB'!I66)&\"-\"&IF(MONTH('QSO DB'!I66)<10,\"0\",\"\")&MONTH('QSO DB'!I66)&\"-\"&IF(DAY('QSO DB'!I66)<10,\"0\",\"\")&DAY('QSO DB'!I66))&\" \"&IF(ISBLANK('QSO DB'!J66),\"XXXX\",LEFT('QSO DB'!J66,4))&\" \"&UPPER('QSO DB'!K66)&REPT(\" \",14-LEN('QSO DB'!K66))&IF(ISBLANK('QSO DB'!L66),REPT(\"X\",3),'QSO DB'!L66&REPT(\" \",3-LEN('QSO DB'!L66)))&\" \"&IF(ISBLANK('QSO DB'!M66),REPT(\"X\",4),'QSO DB'!M66)&\"   \"&UPPER('QSO DB'!F66)&REPT(\" \",14-LEN('QSO DB'!F66))&IF(ISBLANK('QSO DB'!G66),REPT(\"X\",3),'QSO DB'!G66&REPT(\" \",3-LEN('QSO DB'!G66)))&\" \"&IF(ISBLANK('QSO DB'!H66),REPT(\"X\",4),'QSO DB'!H66)))","v":""}]
[{"$f":"IF(OR(LEFT(A81,3)=\"END\",A81=\"\"),\"\",IF(ISBLANK('QSO DB'!D67),\"END-OF-LOG:\",\"QSO:\"&'QSO DB'!D67&REPT(\" \",6-LEN('QSO DB'!D67))&\" \"&IF(ISBLANK('QSO DB'!E67),\"xx\",\"\")&UPPER('QSO DB'!E67)&\" \"&IF(ISBLANK('QSO DB'!I67),REPT(\"X\",10),YEAR('QSO DB'!I67)&\"-\"&IF(MONTH('QSO DB'!I67)<10,\"0\",\"\")&MONTH('QSO DB'!I67)&\"-\"&IF(DAY('QSO DB'!I67)<10,\"0\",\"\")&DAY('QSO DB'!I67))&\" \"&IF(ISBLANK('QSO DB'!J67),\"XXXX\",LEFT('QSO DB'!J67,4))&\" \"&UPPER('QSO DB'!K67)&REPT(\" \",14-LEN('QSO DB'!K67))&IF(ISBLANK('QSO DB'!L67),REPT(\"X\",3),'QSO DB'!L67&REPT(\" \",3-LEN('QSO DB'!L67)))&\" \"&IF(ISBLANK('QSO DB'!M67),REPT(\"X\",4),'QSO DB'!M67)&\"   \"&UPPER('QSO DB'!F67)&REPT(\" \",14-LEN('QSO DB'!F67))&IF(ISBLANK('QSO DB'!G67),REPT(\"X\",3),'QSO DB'!G67&REPT(\" \",3-LEN('QSO DB'!G67)))&\" \"&IF(ISBLANK('QSO DB'!H67),REPT(\"X\",4),'QSO DB'!H67)))","v":""}]
[{"$f":"IF(OR(LEFT(A82,3)=\"END\",A82=\"\"),\"\",IF(ISBLANK('QSO DB'!D68),\"END-OF-LOG:\",\"QSO:\"&'QSO DB'!D68&REPT(\" \",6-LEN('QSO DB'!D68))&\" \"&IF(ISBLANK('QSO DB'!E68),\"xx\",\"\")&UPPER('QSO DB'!E68)&\" \"&IF(ISBLANK('QSO DB'!I68),REPT(\"X\",10),YEAR('QSO DB'!I68)&\"-\"&IF(MONTH('QSO DB'!I68)<10,\"0\",\"\")&MONTH('QSO DB'!I68)&\"-\"&IF(DAY('QSO DB'!I68)<10,\"0\",\"\")&DAY('QSO DB'!I68))&\" \"&IF(ISBLANK('QSO DB'!J68),\"XXXX\",LEFT('QSO DB'!J68,4))&\" \"&UPPER('QSO DB'!K68)&REPT(\" \",14-LEN('QSO DB'!K68))&IF(ISBLANK('QSO DB'!L68),REPT(\"X\",3),'QSO DB'!L68&REPT(\" \",3-LEN('QSO DB'!L68)))&\" \"&IF(ISBLANK('QSO DB'!M68),REPT(\"X\",4),'QSO DB'!M68)&\"   \"&UPPER('QSO DB'!F68)&REPT(\" \",14-LEN('QSO DB'!F68))&IF(ISBLANK('QSO DB'!G68),REPT(\"X\",3),'QSO DB'!G68&REPT(\" \",3-LEN('QSO DB'!G68)))&\" \"&IF(ISBLANK('QSO DB'!H68),REPT(\"X\",4),'QSO DB'!H68)))","v":""}]
[{"$f":"IF(OR(LEFT(A83,3)=\"END\",A83=\"\"),\"\",IF(ISBLANK('QSO DB'!D69),\"END-OF-LOG:\",\"QSO:\"&'QSO DB'!D69&REPT(\" \",6-LEN('QSO DB'!D69))&\" \"&IF(ISBLANK('QSO DB'!E69),\"xx\",\"\")&UPPER('QSO DB'!E69)&\" \"&IF(ISBLANK('QSO DB'!I69),REPT(\"X\",10),YEAR('QSO DB'!I69)&\"-\"&IF(MONTH('QSO DB'!I69)<10,\"0\",\"\")&MONTH('QSO DB'!I69)&\"-\"&IF(DAY('QSO DB'!I69)<10,\"0\",\"\")&DAY('QSO DB'!I69))&\" \"&IF(ISBLANK('QSO DB'!J69),\"XXXX\",LEFT('QSO DB'!J69,4))&\" \"&UPPER('QSO DB'!K69)&REPT(\" \",14-LEN('QSO DB'!K69))&IF(ISBLANK('QSO DB'!L69),REPT(\"X\",3),'QSO DB'!L69&REPT(\" \",3-LEN('QSO DB'!L69)))&\" \"&IF(ISBLANK('QSO DB'!M69),REPT(\"X\",4),'QSO DB'!M69)&\"   \"&UPPER('QSO DB'!F69)&REPT(\" \",14-LEN('QSO DB'!F69))&IF(ISBLANK('QSO DB'!G69),REPT(\"X\",3),'QSO DB'!G69&REPT(\" \",3-LEN('QSO DB'!G69)))&\" \"&IF(ISBLANK('QSO DB'!H69),REPT(\"X\",4),'QSO DB'!H69)))","v":""}]
[{"$f":"IF(OR(LEFT(A84,3)=\"END\",A84=\"\"),\"\",IF(ISBLANK('QSO DB'!D70),\"END-OF-LOG:\",\"QSO:\"&'QSO DB'!D70&REPT(\" \",6-LEN('QSO DB'!D70))&\" \"&IF(ISBLANK('QSO DB'!E70),\"xx\",\"\")&UPPER('QSO DB'!E70)&\" \"&IF(ISBLANK('QSO DB'!I70),REPT(\"X\",10),YEAR('QSO DB'!I70)&\"-\"&IF(MONTH('QSO DB'!I70)<10,\"0\",\"\")&MONTH('QSO DB'!I70)&\"-\"&IF(DAY('QSO DB'!I70)<10,\"0\",\"\")&DAY('QSO DB'!I70))&\" \"&IF(ISBLANK('QSO DB'!J70),\"XXXX\",LEFT('QSO DB'!J70,4))&\" \"&UPPER('QSO DB'!K70)&REPT(\" \",14-LEN('QSO DB'!K70))&IF(ISBLANK('QSO DB'!L70),REPT(\"X\",3),'QSO DB'!L70&REPT(\" \",3-LEN('QSO DB'!L70)))&\" \"&IF(ISBLANK('QSO DB'!M70),REPT(\"X\",4),'QSO DB'!M70)&\"   \"&UPPER('QSO DB'!F70)&REPT(\" \",14-LEN('QSO DB'!F70))&IF(ISBLANK('QSO DB'!G70),REPT(\"X\",3),'QSO DB'!G70&REPT(\" \",3-LEN('QSO DB'!G70)))&\" \"&IF(ISBLANK('QSO DB'!H70),REPT(\"X\",4),'QSO DB'!H70)))","v":""}]
[{"$f":"IF(OR(LEFT(A85,3)=\"END\",A85=\"\"),\"\",IF(ISBLANK('QSO DB'!D71),\"END-OF-LOG:\",\"QSO:\"&'QSO DB'!D71&REPT(\" \",6-LEN('QSO DB'!D71))&\" \"&IF(ISBLANK('QSO DB'!E71),\"xx\",\"\")&UPPER('QSO DB'!E71)&\" \"&IF(ISBLANK('QSO DB'!I71),REPT(\"X\",10),YEAR('QSO DB'!I71)&\"-\"&IF(MONTH('QSO DB'!I71)<10,\"0\",\"\")&MONTH('QSO DB'!I71)&\"-\"&IF(DAY('QSO DB'!I71)<10,\"0\",\"\")&DAY('QSO DB'!I71))&\" \"&IF(ISBLANK('QSO DB'!J71),\"XXXX\",LEFT('QSO DB'!J71,4))&\" \"&UPPER('QSO DB'!K71)&REPT(\" \",14-LEN('QSO DB'!K71))&IF(ISBLANK('QSO DB'!L71),REPT(\"X\",3),'QSO DB'!L71&REPT(\" \",3-LEN('QSO DB'!L71)))&\" \"&IF(ISBLANK('QSO DB'!M71),REPT(\"X\",4),'QSO DB'!M71)&\"   \"&UPPER('QSO DB'!F71)&REPT(\" \",14-LEN('QSO DB'!F71))&IF(ISBLANK('QSO DB'!G71),REPT(\"X\",3),'QSO DB'!G71&REPT(\" \",3-LEN('QSO DB'!G71)))&\" \"&IF(ISBLANK('QSO DB'!H71),REPT(\"X\",4),'QSO DB'!H71)))","v":""}]
[{"$f":"IF(OR(LEFT(A86,3)=\"END\",A86=\"\"),\"\",IF(ISBLANK('QSO DB'!D72),\"END-OF-LOG:\",\"QSO:\"&'QSO DB'!D72&REPT(\" \",6-LEN('QSO DB'!D72))&\" \"&IF(ISBLANK('QSO DB'!E72),\"xx\",\"\")&UPPER('QSO DB'!E72)&\" \"&IF(ISBLANK('QSO DB'!I72),REPT(\"X\",10),YEAR('QSO DB'!I72)&\"-\"&IF(MONTH('QSO DB'!I72)<10,\"0\",\"\")&MONTH('QSO DB'!I72)&\"-\"&IF(DAY('QSO DB'!I72)<10,\"0\",\"\")&DAY('QSO DB'!I72))&\" \"&IF(ISBLANK('QSO DB'!J72),\"XXXX\",LEFT('QSO DB'!J72,4))&\" \"&UPPER('QSO DB'!K72)&REPT(\" \",14-LEN('QSO DB'!K72))&IF(ISBLANK('QSO DB'!L72),REPT(\"X\",3),'QSO DB'!L72&REPT(\" \",3-LEN('QSO DB'!L72)))&\" \"&IF(ISBLANK('QSO DB'!M72),REPT(\"X\",4),'QSO DB'!M72)&\"   \"&UPPER('QSO DB'!F72)&REPT(\" \",14-LEN('QSO DB'!F72))&IF(ISBLANK('QSO DB'!G72),REPT(\"X\",3),'QSO DB'!G72&REPT(\" \",3-LEN('QSO DB'!G72)))&\" \"&IF(ISBLANK('QSO DB'!H72),REPT(\"X\",4),'QSO DB'!H72)))","v":""}]
[{"$f":"IF(OR(LEFT(A87,3)=\"END\",A87=\"\"),\"\",IF(ISBLANK('QSO DB'!D73),\"END-OF-LOG:\",\"QSO:\"&'QSO DB'!D73&REPT(\" \",6-LEN('QSO DB'!D73))&\" \"&IF(ISBLANK('QSO DB'!E73),\"xx\",\"\")&UPPER('QSO DB'!E73)&\" \"&IF(ISBLANK('QSO DB'!I73),REPT(\"X\",10),YEAR('QSO DB'!I73)&\"-\"&IF(MONTH('QSO DB'!I73)<10,\"0\",\"\")&MONTH('QSO DB'!I73)&\"-\"&IF(DAY('QSO DB'!I73)<10,\"0\",\"\")&DAY('QSO DB'!I73))&\" \"&IF(ISBLANK('QSO DB'!J73),\"XXXX\",LEFT('QSO DB'!J73,4))&\" \"&UPPER('QSO DB'!K73)&REPT(\" \",14-LEN('QSO DB'!K73))&IF(ISBLANK('QSO DB'!L73),REPT(\"X\",3),'QSO DB'!L73&REPT(\" \",3-LEN('QSO DB'!L73)))&\" \"&IF(ISBLANK('QSO DB'!M73),REPT(\"X\",4),'QSO DB'!M73)&\"   \"&UPPER('QSO DB'!F73)&REPT(\" \",14-LEN('QSO DB'!F73))&IF(ISBLANK('QSO DB'!G73),REPT(\"X\",3),'QSO DB'!G73&REPT(\" \",3-LEN('QSO DB'!G73)))&\" \"&IF(ISBLANK('QSO DB'!H73),REPT(\"X\",4),'QSO DB'!H73)))","v":""}]
[{"$f":"IF(OR(LEFT(A88,3)=\"END\",A88=\"\"),\"\",IF(ISBLANK('QSO DB'!D74),\"END-OF-LOG:\",\"QSO:\"&'QSO DB'!D74&REPT(\" \",6-LEN('QSO DB'!D74))&\" \"&IF(ISBLANK('QSO DB'!E74),\"xx\",\"\")&UPPER('QSO DB'!E74)&\" \"&IF(ISBLANK('QSO DB'!I74),REPT(\"X\",10),YEAR('QSO DB'!I74)&\"-\"&IF(MONTH('QSO DB'!I74)<10,\"0\",\"\")&MONTH('QSO DB'!I74)&\"-\"&IF(DAY('QSO DB'!I74)<10,\"0\",\"\")&DAY('QSO DB'!I74))&\" \"&IF(ISBLANK('QSO DB'!J74),\"XXXX\",LEFT('QSO DB'!J74,4))&\" \"&UPPER('QSO DB'!K74)&REPT(\" \",14-LEN('QSO DB'!K74))&IF(ISBLANK('QSO DB'!L74),REPT(\"X\",3),'QSO DB'!L74&REPT(\" \",3-LEN('QSO DB'!L74)))&\" \"&IF(ISBLANK('QSO DB'!M74),REPT(\"X\",4),'QSO DB'!M74)&\"   \"&UPPER('QSO DB'!F74)&REPT(\" \",14-LEN('QSO DB'!F74))&IF(ISBLANK('QSO DB'!G74),REPT(\"X\",3),'QSO DB'!G74&REPT(\" \",3-LEN('QSO DB'!G74)))&\" \"&IF(ISBLANK('QSO DB'!H74),REPT(\"X\",4),'QSO DB'!H74)))","v":""}]
[{"$f":"IF(OR(LEFT(A89,3)=\"END\",A89=\"\"),\"\",IF(ISBLANK('QSO DB'!D75),\"END-OF-LOG:\",\"QSO:\"&'QSO DB'!D75&REPT(\" \",6-LEN('QSO DB'!D75))&\" \"&IF(ISBLANK('QSO DB'!E75),\"xx\",\"\")&UPPER('QSO DB'!E75)&\" \"&IF(ISBLANK('QSO DB'!I75),REPT(\"X\",10),YEAR('QSO DB'!I75)&\"-\"&IF(MONTH('QSO DB'!I75)<10,\"0\",\"\")&MONTH('QSO DB'!I75)&\"-\"&IF(DAY('QSO DB'!I75)<10,\"0\",\"\")&DAY('QSO DB'!I75))&\" \"&IF(ISBLANK('QSO DB'!J75),\"XXXX\",LEFT('QSO DB'!J75,4))&\" \"&UPPER('QSO DB'!K75)&REPT(\" \",14-LEN('QSO DB'!K75))&IF(ISBLANK('QSO DB'!L75),REPT(\"X\",3),'QSO DB'!L75&REPT(\" \",3-LEN('QSO DB'!L75)))&\" \"&IF(ISBLANK('QSO DB'!M75),REPT(\"X\",4),'QSO DB'!M75)&\"   \"&UPPER('QSO DB'!F75)&REPT(\" \",14-LEN('QSO DB'!F75))&IF(ISBLANK('QSO DB'!G75),REPT(\"X\",3),'QSO DB'!G75&REPT(\" \",3-LEN('QSO DB'!G75)))&\" \"&IF(ISBLANK('QSO DB'!H75),REPT(\"X\",4),'QSO DB'!H75)))","v":""}]
[{"$f":"IF(OR(LEFT(A90,3)=\"END\",A90=\"\"),\"\",IF(ISBLANK('QSO DB'!D76),\"END-OF-LOG:\",\"QSO:\"&'QSO DB'!D76&REPT(\" \",6-LEN('QSO DB'!D76))&\" \"&IF(ISBLANK('QSO DB'!E76),\"xx\",\"\")&UPPER('QSO DB'!E76)&\" \"&IF(ISBLANK('QSO DB'!I76),REPT(\"X\",10),YEAR('QSO DB'!I76)&\"-\"&IF(MONTH('QSO DB'!I76)<10,\"0\",\"\")&MONTH('QSO DB'!I76)&\"-\"&IF(DAY('QSO DB'!I76)<10,\"0\",\"\")&DAY('QSO DB'!I76))&\" \"&IF(ISBLANK('QSO DB'!J76),\"XXXX\",LEFT('QSO DB'!J76,4))&\" \"&UPPER('QSO DB'!K76)&REPT(\" \",14-LEN('QSO DB'!K76))&IF(ISBLANK('QSO DB'!L76),REPT(\"X\",3),'QSO DB'!L76&REPT(\" \",3-LEN('QSO DB'!L76)))&\" \"&IF(ISBLANK('QSO DB'!M76),REPT(\"X\",4),'QSO DB'!M76)&\"   \"&UPPER('QSO DB'!F76)&REPT(\" \",14-LEN('QSO DB'!F76))&IF(ISBLANK('QSO DB'!G76),REPT(\"X\",3),'QSO DB'!G76&REPT(\" \",3-LEN('QSO DB'!G76)))&\" \"&IF(ISBLANK('QSO DB'!H76),REPT(\"X\",4),'QSO DB'!H76)))","v":""}]
[{"$f":"IF(OR(LEFT(A91,3)=\"END\",A91=\"\"),\"\",IF(ISBLANK('QSO DB'!D77),\"END-OF-LOG:\",\"QSO:\"&'QSO DB'!D77&REPT(\" \",6-LEN('QSO DB'!D77))&\" \"&IF(ISBLANK('QSO DB'!E77),\"xx\",\"\")&UPPER('QSO DB'!E77)&\" \"&IF(ISBLANK('QSO DB'!I77),REPT(\"X\",10),YEAR('QSO DB'!I77)&\"-\"&IF(MONTH('QSO DB'!I77)<10,\"0\",\"\")&MONTH('QSO DB'!I77)&\"-\"&IF(DAY('QSO DB'!I77)<10,\"0\",\"\")&DAY('QSO DB'!I77))&\" \"&IF(ISBLANK('QSO DB'!J77),\"XXXX\",LEFT('QSO DB'!J77,4))&\" \"&UPPER('QSO DB'!K77)&REPT(\" \",14-LEN('QSO DB'!K77))&IF(ISBLANK('QSO DB'!L77),REPT(\"X\",3),'QSO DB'!L77&REPT(\" \",3-LEN('QSO DB'!L77)))&\" \"&IF(ISBLANK('QSO DB'!M77),REPT(\"X\",4),'QSO DB'!M77)&\"   \"&UPPER('QSO DB'!F77)&REPT(\" \",14-LEN('QSO DB'!F77))&IF(ISBLANK('QSO DB'!G77),REPT(\"X\",3),'QSO DB'!G77&REPT(\" \",3-LEN('QSO DB'!G77)))&\" \"&IF(ISBLANK('QSO DB'!H77),REPT(\"X\",4),'QSO DB'!H77)))","v":""}]
[{"$f":"IF(OR(LEFT(A92,3)=\"END\",A92=\"\"),\"\",IF(ISBLANK('QSO DB'!D78),\"END-OF-LOG:\",\"QSO:\"&'QSO DB'!D78&REPT(\" \",6-LEN('QSO DB'!D78))&\" \"&IF(ISBLANK('QSO DB'!E78),\"xx\",\"\")&UPPER('QSO DB'!E78)&\" \"&IF(ISBLANK('QSO DB'!I78),REPT(\"X\",10),YEAR('QSO DB'!I78)&\"-\"&IF(MONTH('QSO DB'!I78)<10,\"0\",\"\")&MONTH('QSO DB'!I78)&\"-\"&IF(DAY('QSO DB'!I78)<10,\"0\",\"\")&DAY('QSO DB'!I78))&\" \"&IF(ISBLANK('QSO DB'!J78),\"XXXX\",LEFT('QSO DB'!J78,4))&\" \"&UPPER('QSO DB'!K78)&REPT(\" \",14-LEN('QSO DB'!K78))&IF(ISBLANK('QSO DB'!L78),REPT(\"X\",3),'QSO DB'!L78&REPT(\" \",3-LEN('QSO DB'!L78)))&\" \"&IF(ISBLANK('QSO DB'!M78),REPT(\"X\",4),'QSO DB'!M78)&\"   \"&UPPER('QSO DB'!F78)&REPT(\" \",14-LEN('QSO DB'!F78))&IF(ISBLANK('QSO DB'!G78),REPT(\"X\",3),'QSO DB'!G78&REPT(\" \",3-LEN('QSO DB'!G78)))&\" \"&IF(ISBLANK('QSO DB'!H78),REPT(\"X\",4),'QSO DB'!H78)))","v":""}]
[{"$f":"IF(OR(LEFT(A93,3)=\"END\",A93=\"\"),\"\",IF(ISBLANK('QSO DB'!D79),\"END-OF-LOG:\",\"QSO:\"&'QSO DB'!D79&REPT(\" \",6-LEN('QSO DB'!D79))&\" \"&IF(ISBLANK('QSO DB'!E79),\"xx\",\"\")&UPPER('QSO DB'!E79)&\" \"&IF(ISBLANK('QSO DB'!I79),REPT(\"X\",10),YEAR('QSO DB'!I79)&\"-\"&IF(MONTH('QSO DB'!I79)<10,\"0\",\"\")&MONTH('QSO DB'!I79)&\"-\"&IF(DAY('QSO DB'!I79)<10,\"0\",\"\")&DAY('QSO DB'!I79))&\" \"&IF(ISBLANK('QSO DB'!J79),\"XXXX\",LEFT('QSO DB'!J79,4))&\" \"&UPPER('QSO DB'!K79)&REPT(\" \",14-LEN('QSO DB'!K79))&IF(ISBLANK('QSO DB'!L79),REPT(\"X\",3),'QSO DB'!L79&REPT(\" \",3-LEN('QSO DB'!L79)))&\" \"&IF(ISBLANK('QSO DB'!M79),REPT(\"X\",4),'QSO DB'!M79)&\"   \"&UPPER('QSO DB'!F79)&REPT(\" \",14-LEN('QSO DB'!F79))&IF(ISBLANK('QSO DB'!G79),REPT(\"X\",3),'QSO DB'!G79&REPT(\" \",3-LEN('QSO DB'!G79)))&\" \"&IF(ISBLANK('QSO DB'!H79),REPT(\"X\",4),'QSO DB'!H79)))","v":""}]
[{"$f":"IF(OR(LEFT(A94,3)=\"END\",A94=\"\"),\"\",IF(ISBLANK('QSO DB'!D80),\"END-OF-LOG:\",\"QSO:\"&'QSO DB'!D80&REPT(\" \",6-LEN('QSO DB'!D80))&\" \"&IF(ISBLANK('QSO DB'!E80),\"xx\",\"\")&UPPER('QSO DB'!E80)&\" \"&IF(ISBLANK('QSO DB'!I80),REPT(\"X\",10),YEAR('QSO DB'!I80)&\"-\"&IF(MONTH('QSO DB'!I80)<10,\"0\",\"\")&MONTH('QSO DB'!I80)&\"-\"&IF(DAY('QSO DB'!I80)<10,\"0\",\"\")&DAY('QSO DB'!I80))&\" \"&IF(ISBLANK('QSO DB'!J80),\"XXXX\",LEFT('QSO DB'!J80,4))&\" \"&UPPER('QSO DB'!K80)&REPT(\" \",14-LEN('QSO DB'!K80))&IF(ISBLANK('QSO DB'!L80),REPT(\"X\",3),'QSO DB'!L80&REPT(\" \",3-LEN('QSO DB'!L80)))&\" \"&IF(ISBLANK('QSO DB'!M80),REPT(\"X\",4),'QSO DB'!M80)&\"   \"&UPPER('QSO DB'!F80)&REPT(\" \",14-LEN('QSO DB'!F80))&IF(ISBLANK('QSO DB'!G80),REPT(\"X\",3),'QSO DB'!G80&REPT(\" \",3-LEN('QSO DB'!G80)))&\" \"&IF(ISBLANK('QSO DB'!H80),REPT(\"X\",4),'QSO DB'!H80)))","v":""}]
[{"$f":"IF(OR(LEFT(A95,3)=\"END\",A95=\"\"),\"\",IF(ISBLANK('QSO DB'!D81),\"END-OF-LOG:\",\"QSO:\"&'QSO DB'!D81&REPT(\" \",6-LEN('QSO DB'!D81))&\" \"&IF(ISBLANK('QSO DB'!E81),\"xx\",\"\")&UPPER('QSO DB'!E81)&\" \"&IF(ISBLANK('QSO DB'!I81),REPT(\"X\",10),YEAR('QSO DB'!I81)&\"-\"&IF(MONTH('QSO DB'!I81)<10,\"0\",\"\")&MONTH('QSO DB'!I81)&\"-\"&IF(DAY('QSO DB'!I81)<10,\"0\",\"\")&DAY('QSO DB'!I81))&\" \"&IF(ISBLANK('QSO DB'!J81),\"XXXX\",LEFT('QSO DB'!J81,4))&\" \"&UPPER('QSO DB'!K81)&REPT(\" \",14-LEN('QSO DB'!K81))&IF(ISBLANK('QSO DB'!L81),REPT(\"X\",3),'QSO DB'!L81&REPT(\" \",3-LEN('QSO DB'!L81)))&\" \"&IF(ISBLANK('QSO DB'!M81),REPT(\"X\",4),'QSO DB'!M81)&\"   \"&UPPER('QSO DB'!F81)&REPT(\" \",14-LEN('QSO DB'!F81))&IF(ISBLANK('QSO DB'!G81),REPT(\"X\",3),'QSO DB'!G81&REPT(\" \",3-LEN('QSO DB'!G81)))&\" \"&IF(ISBLANK('QSO DB'!H81),REPT(\"X\",4),'QSO DB'!H81)))","v":""}]
[{"$f":"IF(OR(LEFT(A96,3)=\"END\",A96=\"\"),\"\",IF(ISBLANK('QSO DB'!D82),\"END-OF-LOG:\",\"QSO:\"&'QSO DB'!D82&REPT(\" \",6-LEN('QSO DB'!D82))&\" \"&IF(ISBLANK('QSO DB'!E82),\"xx\",\"\")&UPPER('QSO DB'!E82)&\" \"&IF(ISBLANK('QSO DB'!I82),REPT(\"X\",10),YEAR('QSO DB'!I82)&\"-\"&IF(MONTH('QSO DB'!I82)<10,\"0\",\"\")&MONTH('QSO DB'!I82)&\"-\"&IF(DAY('QSO DB'!I82)<10,\"0\",\"\")&DAY('QSO DB'!I82))&\" \"&IF(ISBLANK('QSO DB'!J82),\"XXXX\",LEFT('QSO DB'!J82,4))&\" \"&UPPER('QSO DB'!K82)&REPT(\" \",14-LEN('QSO DB'!K82))&IF(ISBLANK('QSO DB'!L82),REPT(\"X\",3),'QSO DB'!L82&REPT(\" \",3-LEN('QSO DB'!L82)))&\" \"&IF(ISBLANK('QSO DB'!M82),REPT(\"X\",4),'QSO DB'!M82)&\"   \"&UPPER('QSO DB'!F82)&REPT(\" \",14-LEN('QSO DB'!F82))&IF(ISBLANK('QSO DB'!G82),REPT(\"X\",3),'QSO DB'!G82&REPT(\" \",3-LEN('QSO DB'!G82)))&\" \"&IF(ISBLANK('QSO DB'!H82),REPT(\"X\",4),'QSO DB'!H82)))","v":""}]
[{"$f":"IF(OR(LEFT(A97,3)=\"END\",A97=\"\"),\"\",IF(ISBLANK('QSO DB'!D83),\"END-OF-LOG:\",\"QSO:\"&'QSO DB'!D83&REPT(\" \",6-LEN('QSO DB'!D83))&\" \"&IF(ISBLANK('QSO DB'!E83),\"xx\",\"\")&UPPER('QSO DB'!E83)&\" \"&IF(ISBLANK('QSO DB'!I83),REPT(\"X\",10),YEAR('QSO DB'!I83)&\"-\"&IF(MONTH('QSO DB'!I83)<10,\"0\",\"\")&MONTH('QSO DB'!I83)&\"-\"&IF(DAY('QSO DB'!I83)<10,\"0\",\"\")&DAY('QSO DB'!I83))&\" \"&IF(ISBLANK('QSO DB'!J83),\"XXXX\",LEFT('QSO DB'!J83,4))&\" \"&UPPER('QSO DB'!K83)&REPT(\" \",14-LEN('QSO DB'!K83))&IF(ISBLANK('QSO DB'!L83),REPT(\"X\",3),'QSO DB'!L83&REPT(\" \",3-LEN('QSO DB'!L83)))&\" \"&IF(ISBLANK('QSO DB'!M83),REPT(\"X\",4),'QSO DB'!M83)&\"   \"&UPPER('QSO DB'!F83)&REPT(\" \",14-LEN('QSO DB'!F83))&IF(ISBLANK('QSO DB'!G83),REPT(\"X\",3),'QSO DB'!G83&REPT(\" \",3-LEN('QSO DB'!G83)))&\" \"&IF(ISBLANK('QSO DB'!H83),REPT(\"X\",4),'QSO DB'!H83)))","v":""}]
[{"$f":"IF(OR(LEFT(A98,3)=\"END\",A98=\"\"),\"\",IF(ISBLANK('QSO DB'!D84),\"END-OF-LOG:\",\"QSO:\"&'QSO DB'!D84&REPT(\" \",6-LEN('QSO DB'!D84))&\" \"&IF(ISBLANK('QSO DB'!E84),\"xx\",\"\")&UPPER('QSO DB'!E84)&\" \"&IF(ISBLANK('QSO DB'!I84),REPT(\"X\",10),YEAR('QSO DB'!I84)&\"-\"&IF(MONTH('QSO DB'!I84)<10,\"0\",\"\")&MONTH('QSO DB'!I84)&\"-\"&IF(DAY('QSO DB'!I84)<10,\"0\",\"\")&DAY('QSO DB'!I84))&\" \"&IF(ISBLANK('QSO DB'!J84),\"XXXX\",LEFT('QSO DB'!J84,4))&\" \"&UPPER('QSO DB'!K84)&REPT(\" \",14-LEN('QSO DB'!K84))&IF(ISBLANK('QSO DB'!L84),REPT(\"X\",3),'QSO DB'!L84&REPT(\" \",3-LEN('QSO DB'!L84)))&\" \"&IF(ISBLANK('QSO DB'!M84),REPT(\"X\",4),'QSO DB'!M84)&\"   \"&UPPER('QSO DB'!F84)&REPT(\" \",14-LEN('QSO DB'!F84))&IF(ISBLANK('QSO DB'!G84),REPT(\"X\",3),'QSO DB'!G84&REPT(\" \",3-LEN('QSO DB'!G84)))&\" \"&IF(ISBLANK('QSO DB'!H84),REPT(\"X\",4),'QSO DB'!H84)))","v":""}]
[{"$f":"IF(OR(LEFT(A99,3)=\"END\",A99=\"\"),\"\",IF(ISBLANK('QSO DB'!D85),\"END-OF-LOG:\",\"QSO:\"&'QSO DB'!D85&REPT(\" \",6-LEN('QSO DB'!D85))&\" \"&IF(ISBLANK('QSO DB'!E85),\"xx\",\"\")&UPPER('QSO DB'!E85)&\" \"&IF(ISBLANK('QSO DB'!I85),REPT(\"X\",10),YEAR('QSO DB'!I85)&\"-\"&IF(MONTH('QSO DB'!I85)<10,\"0\",\"\")&MONTH('QSO DB'!I85)&\"-\"&IF(DAY('QSO DB'!I85)<10,\"0\",\"\")&DAY('QSO DB'!I85))&\" \"&IF(ISBLANK('QSO DB'!J85),\"XXXX\",LEFT('QSO DB'!J85,4))&\" \"&UPPER('QSO DB'!K85)&REPT(\" \",14-LEN('QSO DB'!K85))&IF(ISBLANK('QSO DB'!L85),REPT(\"X\",3),'QSO DB'!L85&REPT(\" \",3-LEN('QSO DB'!L85)))&\" \"&IF(ISBLANK('QSO DB'!M85),REPT(\"X\",4),'QSO DB'!M85)&\"   \"&UPPER('QSO DB'!F85)&REPT(\" \",14-LEN('QSO DB'!F85))&IF(ISBLANK('QSO DB'!G85),REPT(\"X\",3),'QSO DB'!G85&REPT(\" \",3-LEN('QSO DB'!G85)))&\" \"&IF(ISBLANK('QSO DB'!H85),REPT(\"X\",4),'QSO DB'!H85)))","v":""}]
[{"$f":"IF(OR(LEFT(A100,3)=\"END\",A100=\"\"),\"\",IF(ISBLANK('QSO DB'!D86),\"END-OF-LOG:\",\"QSO:\"&'QSO DB'!D86&REPT(\" \",6-LEN('QSO DB'!D86))&\" \"&IF(ISBLANK('QSO DB'!E86),\"xx\",\"\")&UPPER('QSO DB'!E86)&\" \"&IF(ISBLANK('QSO DB'!I86),REPT(\"X\",10),YEAR('QSO DB'!I86)&\"-\"&IF(MONTH('QSO DB'!I86)<10,\"0\",\"\")&MONTH('QSO DB'!I86)&\"-\"&IF(DAY('QSO DB'!I86)<10,\"0\",\"\")&DAY('QSO DB'!I86))&\" \"&IF(ISBLANK('QSO DB'!J86),\"XXXX\",LEFT('QSO DB'!J86,4))&\" \"&UPPER('QSO DB'!K86)&REPT(\" \",14-LEN('QSO DB'!K86))&IF(ISBLANK('QSO DB'!L86),REPT(\"X\",3),'QSO DB'!L86&REPT(\" \",3-LEN('QSO DB'!L86)))&\" \"&IF(ISBLANK('QSO DB'!M86),REPT(\"X\",4),'QSO DB'!M86)&\"   \"&UPPER('QSO DB'!F86)&REPT(\" \",14-LEN('QSO DB'!F86))&IF(ISBLANK('QSO DB'!G86),REPT(\"X\",3),'QSO DB'!G86&REPT(\" \",3-LEN('QSO DB'!G86)))&\" \"&IF(ISBLANK('QSO DB'!H86),REPT(\"X\",4),'QSO DB'!H86)))","v":""}]
[{"$f":"IF(OR(LEFT(A101,3)=\"END\",A101=\"\"),\"\",IF(ISBLANK('QSO DB'!D87),\"END-OF-LOG:\",\"QSO:\"&'QSO DB'!D87&REPT(\" \",6-LEN('QSO DB'!D87))&\" \"&IF(ISBLANK('QSO DB'!E87),\"xx\",\"\")&UPPER('QSO DB'!E87)&\" \"&IF(ISBLANK('QSO DB'!I87),REPT(\"X\",10),YEAR('QSO DB'!I87)&\"-\"&IF(MONTH('QSO DB'!I87)<10,\"0\",\"\")&MONTH('QSO DB'!I87)&\"-\"&IF(DAY('QSO DB'!I87)<10,\"0\",\"\")&DAY('QSO DB'!I87))&\" \"&IF(ISBLANK('QSO DB'!J87),\"XXXX\",LEFT('QSO DB'!J87,4))&\" \"&UPPER('QSO DB'!K87)&REPT(\" \",14-LEN('QSO DB'!K87))&IF(ISBLANK('QSO DB'!L87),REPT(\"X\",3),'QSO DB'!L87&REPT(\" \",3-LEN('QSO DB'!L87)))&\" \"&IF(ISBLANK('QSO DB'!M87),REPT(\"X\",4),'QSO DB'!M87)&\"   \"&UPPER('QSO DB'!F87)&REPT(\" \",14-LEN('QSO DB'!F87))&IF(ISBLANK('QSO DB'!G87),REPT(\"X\",3),'QSO DB'!G87&REPT(\" \",3-LEN('QSO DB'!G87)))&\" \"&IF(ISBLANK('QSO DB'!H87),REPT(\"X\",4),'QSO DB'!H87)))","v":""}]
[{"$f":"IF(OR(LEFT(A102,3)=\"END\",A102=\"\"),\"\",IF(ISBLANK('QSO DB'!D88),\"END-OF-LOG:\",\"QSO:\"&'QSO DB'!D88&REPT(\" \",6-LEN('QSO DB'!D88))&\" \"&IF(ISBLANK('QSO DB'!E88),\"xx\",\"\")&UPPER('QSO DB'!E88)&\" \"&IF(ISBLANK('QSO DB'!I88),REPT(\"X\",10),YEAR('QSO DB'!I88)&\"-\"&IF(MONTH('QSO DB'!I88)<10,\"0\",\"\")&MONTH('QSO DB'!I88)&\"-\"&IF(DAY('QSO DB'!I88)<10,\"0\",\"\")&DAY('QSO DB'!I88))&\" \"&IF(ISBLANK('QSO DB'!J88),\"XXXX\",LEFT('QSO DB'!J88,4))&\" \"&UPPER('QSO DB'!K88)&REPT(\" \",14-LEN('QSO DB'!K88))&IF(ISBLANK('QSO DB'!L88),REPT(\"X\",3),'QSO DB'!L88&REPT(\" \",3-LEN('QSO DB'!L88)))&\" \"&IF(ISBLANK('QSO DB'!M88),REPT(\"X\",4),'QSO DB'!M88)&\"   \"&UPPER('QSO DB'!F88)&REPT(\" \",14-LEN('QSO DB'!F88))&IF(ISBLANK('QSO DB'!G88),REPT(\"X\",3),'QSO DB'!G88&REPT(\" \",3-LEN('QSO DB'!G88)))&\" \"&IF(ISBLANK('QSO DB'!H88),REPT(\"X\",4),'QSO DB'!H88)))","v":""}]
[{"$f":"IF(OR(LEFT(A103,3)=\"END\",A103=\"\"),\"\",IF(ISBLANK('QSO DB'!D89),\"END-OF-LOG:\",\"QSO:\"&'QSO DB'!D89&REPT(\" \",6-LEN('QSO DB'!D89))&\" \"&IF(ISBLANK('QSO DB'!E89),\"xx\",\"\")&UPPER('QSO DB'!E89)&\" \"&IF(ISBLANK('QSO DB'!I89),REPT(\"X\",10),YEAR('QSO DB'!I89)&\"-\"&IF(MONTH('QSO DB'!I89)<10,\"0\",\"\")&MONTH('QSO DB'!I89)&\"-\"&IF(DAY('QSO DB'!I89)<10,\"0\",\"\")&DAY('QSO DB'!I89))&\" \"&IF(ISBLANK('QSO DB'!J89),\"XXXX\",LEFT('QSO DB'!J89,4))&\" \"&UPPER('QSO DB'!K89)&REPT(\" \",14-LEN('QSO DB'!K89))&IF(ISBLANK('QSO DB'!L89),REPT(\"X\",3),'QSO DB'!L89&REPT(\" \",3-LEN('QSO DB'!L89)))&\" \"&IF(ISBLANK('QSO DB'!M89),REPT(\"X\",4),'QSO DB'!M89)&\"   \"&UPPER('QSO DB'!F89)&REPT(\" \",14-LEN('QSO DB'!F89))&IF(ISBLANK('QSO DB'!G89),REPT(\"X\",3),'QSO DB'!G89&REPT(\" \",3-LEN('QSO DB'!G89)))&\" \"&IF(ISBLANK('QSO DB'!H89),REPT(\"X\",4),'QSO DB'!H89)))","v":""}]
[{"$f":"IF(OR(LEFT(A104,3)=\"END\",A104=\"\"),\"\",IF(ISBLANK('QSO DB'!D90),\"END-OF-LOG:\",\"QSO:\"&'QSO DB'!D90&REPT(\" \",6-LEN('QSO DB'!D90))&\" \"&IF(ISBLANK('QSO DB'!E90),\"xx\",\"\")&UPPER('QSO DB'!E90)&\" \"&IF(ISBLANK('QSO DB'!I90),REPT(\"X\",10),YEAR('QSO DB'!I90)&\"-\"&IF(MONTH('QSO DB'!I90)<10,\"0\",\"\")&MONTH('QSO DB'!I90)&\"-\"&IF(DAY('QSO DB'!I90)<10,\"0\",\"\")&DAY('QSO DB'!I90))&\" \"&IF(ISBLANK('QSO DB'!J90),\"XXXX\",LEFT('QSO DB'!J90,4))&\" \"&UPPER('QSO DB'!K90)&REPT(\" \",14-LEN('QSO DB'!K90))&IF(ISBLANK('QSO DB'!L90),REPT(\"X\",3),'QSO DB'!L90&REPT(\" \",3-LEN('QSO DB'!L90)))&\" \"&IF(ISBLANK('QSO DB'!M90),REPT(\"X\",4),'QSO DB'!M90)&\"   \"&UPPER('QSO DB'!F90)&REPT(\" \",14-LEN('QSO DB'!F90))&IF(ISBLANK('QSO DB'!G90),REPT(\"X\",3),'QSO DB'!G90&REPT(\" \",3-LEN('QSO DB'!G90)))&\" \"&IF(ISBLANK('QSO DB'!H90),REPT(\"X\",4),'QSO DB'!H90)))","v":""}]
[{"$f":"IF(OR(LEFT(A105,3)=\"END\",A105=\"\"),\"\",IF(ISBLANK('QSO DB'!D91),\"END-OF-LOG:\",\"QSO:\"&'QSO DB'!D91&REPT(\" \",6-LEN('QSO DB'!D91))&\" \"&IF(ISBLANK('QSO DB'!E91),\"xx\",\"\")&UPPER('QSO DB'!E91)&\" \"&IF(ISBLANK('QSO DB'!I91),REPT(\"X\",10),YEAR('QSO DB'!I91)&\"-\"&IF(MONTH('QSO DB'!I91)<10,\"0\",\"\")&MONTH('QSO DB'!I91)&\"-\"&IF(DAY('QSO DB'!I91)<10,\"0\",\"\")&DAY('QSO DB'!I91))&\" \"&IF(ISBLANK('QSO DB'!J91),\"XXXX\",LEFT('QSO DB'!J91,4))&\" \"&UPPER('QSO DB'!K91)&REPT(\" \",14-LEN('QSO DB'!K91))&IF(ISBLANK('QSO DB'!L91),REPT(\"X\",3),'QSO DB'!L91&REPT(\" \",3-LEN('QSO DB'!L91)))&\" \"&IF(ISBLANK('QSO DB'!M91),REPT(\"X\",4),'QSO DB'!M91)&\"   \"&UPPER('QSO DB'!F91)&REPT(\" \",14-LEN('QSO DB'!F91))&IF(ISBLANK('QSO DB'!G91),REPT(\"X\",3),'QSO DB'!G91&REPT(\" \",3-LEN('QSO DB'!G91)))&\" \"&IF(ISBLANK('QSO DB'!H91),REPT(\"X\",4),'QSO DB'!H91)))","v":""}]
[{"$f":"IF(OR(LEFT(A106,3)=\"END\",A106=\"\"),\"\",IF(ISBLANK('QSO DB'!D92),\"END-OF-LOG:\",\"QSO:\"&'QSO DB'!D92&REPT(\" \",6-LEN('QSO DB'!D92))&\" \"&IF(ISBLANK('QSO DB'!E92),\"xx\",\"\")&UPPER('QSO DB'!E92)&\" \"&IF(ISBLANK('QSO DB'!I92),REPT(\"X\",10),YEAR('QSO DB'!I92)&\"-\"&IF(MONTH('QSO DB'!I92)<10,\"0\",\"\")&MONTH('QSO DB'!I92)&\"-\"&IF(DAY('QSO DB'!I92)<10,\"0\",\"\")&DAY('QSO DB'!I92))&\" \"&IF(ISBLANK('QSO DB'!J92),\"XXXX\",LEFT('QSO DB'!J92,4))&\" \"&UPPER('QSO DB'!K92)&REPT(\" \",14-LEN('QSO DB'!K92))&IF(ISBLANK('QSO DB'!L92),REPT(\"X\",3),'QSO DB'!L92&REPT(\" \",3-LEN('QSO DB'!L92)))&\" \"&IF(ISBLANK('QSO DB'!M92),REPT(\"X\",4),'QSO DB'!M92)&\"   \"&UPPER('QSO DB'!F92)&REPT(\" \",14-LEN('QSO DB'!F92))&IF(ISBLANK('QSO DB'!G92),REPT(\"X\",3),'QSO DB'!G92&REPT(\" \",3-LEN('QSO DB'!G92)))&\" \"&IF(ISBLANK('QSO DB'!H92),REPT(\"X\",4),'QSO DB'!H92)))","v":""}]
[{"$f":"IF(OR(LEFT(A107,3)=\"END\",A107=\"\"),\"\",IF(ISBLANK('QSO DB'!D93),\"END-OF-LOG:\",\"QSO:\"&'QSO DB'!D93&REPT(\" \",6-LEN('QSO DB'!D93))&\" \"&IF(ISBLANK('QSO DB'!E93),\"xx\",\"\")&UPPER('QSO DB'!E93)&\" \"&IF(ISBLANK('QSO DB'!I93),REPT(\"X\",10),YEAR('QSO DB'!I93)&\"-\"&IF(MONTH('QSO DB'!I93)<10,\"0\",\"\")&MONTH('QSO DB'!I93)&\"-\"&IF(DAY('QSO DB'!I93)<10,\"0\",\"\")&DAY('QSO DB'!I93))&\" \"&IF(ISBLANK('QSO DB'!J93),\"XXXX\",LEFT('QSO DB'!J93,4))&\" \"&UPPER('QSO DB'!K93)&REPT(\" \",14-LEN('QSO DB'!K93))&IF(ISBLANK('QSO DB'!L93),REPT(\"X\",3),'QSO DB'!L93&REPT(\" \",3-LEN('QSO DB'!L93)))&\" \"&IF(ISBLANK('QSO DB'!M93),REPT(\"X\",4),'QSO DB'!M93)&\"   \"&UPPER('QSO DB'!F93)&REPT(\" \",14-LEN('QSO DB'!F93))&IF(ISBLANK('QSO DB'!G93),REPT(\"X\",3),'QSO DB'!G93&REPT(\" \",3-LEN('QSO DB'!G93)))&\" \"&IF(ISBLANK('QSO DB'!H93),REPT(\"X\",4),'QSO DB'!H93)))","v":""}]
[{"$f":"IF(OR(LEFT(A108,3)=\"END\",A108=\"\"),\"\",IF(ISBLANK('QSO DB'!D94),\"END-OF-LOG:\",\"QSO:\"&'QSO DB'!D94&REPT(\" \",6-LEN('QSO DB'!D94))&\" \"&IF(ISBLANK('QSO DB'!E94),\"xx\",\"\")&UPPER('QSO DB'!E94)&\" \"&IF(ISBLANK('QSO DB'!I94),REPT(\"X\",10),YEAR('QSO DB'!I94)&\"-\"&IF(MONTH('QSO DB'!I94)<10,\"0\",\"\")&MONTH('QSO DB'!I94)&\"-\"&IF(DAY('QSO DB'!I94)<10,\"0\",\"\")&DAY('QSO DB'!I94))&\" \"&IF(ISBLANK('QSO DB'!J94),\"XXXX\",LEFT('QSO DB'!J94,4))&\" \"&UPPER('QSO DB'!K94)&REPT(\" \",14-LEN('QSO DB'!K94))&IF(ISBLANK('QSO DB'!L94),REPT(\"X\",3),'QSO DB'!L94&REPT(\" \",3-LEN('QSO DB'!L94)))&\" \"&IF(ISBLANK('QSO DB'!M94),REPT(\"X\",4),'QSO DB'!M94)&\"   \"&UPPER('QSO DB'!F94)&REPT(\" \",14-LEN('QSO DB'!F94))&IF(ISBLANK('QSO DB'!G94),REPT(\"X\",3),'QSO DB'!G94&REPT(\" \",3-LEN('QSO DB'!G94)))&\" \"&IF(ISBLANK('QSO DB'!H94),REPT(\"X\",4),'QSO DB'!H94)))","v":""}]
[{"$f":"IF(OR(LEFT(A109,3)=\"END\",A109=\"\"),\"\",IF(ISBLANK('QSO DB'!D95),\"END-OF-LOG:\",\"QSO:\"&'QSO DB'!D95&REPT(\" \",6-LEN('QSO DB'!D95))&\" \"&IF(ISBLANK('QSO DB'!E95),\"xx\",\"\")&UPPER('QSO DB'!E95)&\" \"&IF(ISBLANK('QSO DB'!I95),REPT(\"X\",10),YEAR('QSO DB'!I95)&\"-\"&IF(MONTH('QSO DB'!I95)<10,\"0\",\"\")&MONTH('QSO DB'!I95)&\"-\"&IF(DAY('QSO DB'!I95)<10,\"0\",\"\")&DAY('QSO DB'!I95))&\" \"&IF(ISBLANK('QSO DB'!J95),\"XXXX\",LEFT('QSO DB'!J95,4))&\" \"&UPPER('QSO DB'!K95)&REPT(\" \",14-LEN('QSO DB'!K95))&IF(ISBLANK('QSO DB'!L95),REPT(\"X\",3),'QSO DB'!L95&REPT(\" \",3-LEN('QSO DB'!L95)))&\" \"&IF(ISBLANK('QSO DB'!M95),REPT(\"X\",4),'QSO DB'!M95)&\"   \"&UPPER('QSO DB'!F95)&REPT(\" \",14-LEN('QSO DB'!F95))&IF(ISBLANK('QSO DB'!G95),REPT(\"X\",3),'QSO DB'!G95&REPT(\" \",3-LEN('QSO DB'!G95)))&\" \"&IF(ISBLANK('QSO DB'!H95),REPT(\"X\",4),'QSO DB'!H95)))","v":""}]
[{"$f":"IF(OR(LEFT(A110,3)=\"END\",A110=\"\"),\"\",IF(ISBLANK('QSO DB'!D96),\"END-OF-LOG:\",\"QSO:\"&'QSO DB'!D96&REPT(\" \",6-LEN('QSO DB'!D96))&\" \"&IF(ISBLANK('QSO DB'!E96),\"xx\",\"\")&UPPER('QSO DB'!E96)&\" \"&IF(ISBLANK('QSO DB'!I96),REPT(\"X\",10),YEAR('QSO DB'!I96)&\"-\"&IF(MONTH('QSO DB'!I96)<10,\"0\",\"\")&MONTH('QSO DB'!I96)&\"-\"&IF(DAY('QSO DB'!I96)<10,\"0\",\"\")&DAY('QSO DB'!I96))&\" \"&IF(ISBLANK('QSO DB'!J96),\"XXXX\",LEFT('QSO DB'!J96,4))&\" \"&UPPER('QSO DB'!K96)&REPT(\" \",14-LEN('QSO DB'!K96))&IF(ISBLANK('QSO DB'!L96),REPT(\"X\",3),'QSO DB'!L96&REPT(\" \",3-LEN('QSO DB'!L96)))&\" \"&IF(ISBLANK('QSO DB'!M96),REPT(\"X\",4),'QSO DB'!M96)&\"   \"&UPPER('QSO DB'!F96)&REPT(\" \",14-LEN('QSO DB'!F96))&IF(ISBLANK('QSO DB'!G96),REPT(\"X\",3),'QSO DB'!G96&REPT(\" \",3-LEN('QSO DB'!G96)))&\" \"&IF(ISBLANK('QSO DB'!H96),REPT(\"X\",4),'QSO DB'!H96)))","v":""}]
[{"$f":"IF(OR(LEFT(A111,3)=\"END\",A111=\"\"),\"\",IF(ISBLANK('QSO DB'!D97),\"END-OF-LOG:\",\"QSO:\"&'QSO DB'!D97&REPT(\" \",6-LEN('QSO DB'!D97))&\" \"&IF(ISBLANK('QSO DB'!E97),\"xx\",\"\")&UPPER('QSO DB'!E97)&\" \"&IF(ISBLANK('QSO DB'!I97),REPT(\"X\",10),YEAR('QSO DB'!I97)&\"-\"&IF(MONTH('QSO DB'!I97)<10,\"0\",\"\")&MONTH('QSO DB'!I97)&\"-\"&IF(DAY('QSO DB'!I97)<10,\"0\",\"\")&DAY('QSO DB'!I97))&\" \"&IF(ISBLANK('QSO DB'!J97),\"XXXX\",LEFT('QSO DB'!J97,4))&\" \"&UPPER('QSO DB'!K97)&REPT(\" \",14-LEN('QSO DB'!K97))&IF(ISBLANK('QSO DB'!L97),REPT(\"X\",3),'QSO DB'!L97&REPT(\" \",3-LEN('QSO DB'!L97)))&\" \"&IF(ISBLANK('QSO DB'!M97),REPT(\"X\",4),'QSO DB'!M97)&\"   \"&UPPER('QSO DB'!F97)&REPT(\" \",14-LEN('QSO DB'!F97))&IF(ISBLANK('QSO DB'!G97),REPT(\"X\",3),'QSO DB'!G97&REPT(\" \",3-LEN('QSO DB'!G97)))&\" \"&IF(ISBLANK('QSO DB'!H97),REPT(\"X\",4),'QSO DB'!H97)))","v":""}]
[{"$f":"IF(OR(LEFT(A112,3)=\"END\",A112=\"\"),\"\",IF(ISBLANK('QSO DB'!D98),\"END-OF-LOG:\",\"QSO:\"&'QSO DB'!D98&REPT(\" \",6-LEN('QSO DB'!D98))&\" \"&IF(ISBLANK('QSO DB'!E98),\"xx\",\"\")&UPPER('QSO DB'!E98)&\" \"&IF(ISBLANK('QSO DB'!I98),REPT(\"X\",10),YEAR('QSO DB'!I98)&\"-\"&IF(MONTH('QSO DB'!I98)<10,\"0\",\"\")&MONTH('QSO DB'!I98)&\"-\"&IF(DAY('QSO DB'!I98)<10,\"0\",\"\")&DAY('QSO DB'!I98))&\" \"&IF(ISBLANK('QSO DB'!J98),\"XXXX\",LEFT('QSO DB'!J98,4))&\" \"&UPPER('QSO DB'!K98)&REPT(\" \",14-LEN('QSO DB'!K98))&IF(ISBLANK('QSO DB'!L98),REPT(\"X\",3),'QSO DB'!L98&REPT(\" \",3-LEN('QSO DB'!L98)))&\" \"&IF(ISBLANK('QSO DB'!M98),REPT(\"X\",4),'QSO DB'!M98)&\"   \"&UPPER('QSO DB'!F98)&REPT(\" \",14-LEN('QSO DB'!F98))&IF(ISBLANK('QSO DB'!G98),REPT(\"X\",3),'QSO DB'!G98&REPT(\" \",3-LEN('QSO DB'!G98)))&\" \"&IF(ISBLANK('QSO DB'!H98),REPT(\"X\",4),'QSO DB'!H98)))","v":""}]
[{"$f":"IF(OR(LEFT(A113,3)=\"END\",A113=\"\"),\"\",IF(ISBLANK('QSO DB'!D99),\"END-OF-LOG:\",\"QSO:\"&'QSO DB'!D99&REPT(\" \",6-LEN('QSO DB'!D99))&\" \"&IF(ISBLANK('QSO DB'!E99),\"xx\",\"\")&UPPER('QSO DB'!E99)&\" \"&IF(ISBLANK('QSO DB'!I99),REPT(\"X\",10),YEAR('QSO DB'!I99)&\"-\"&IF(MONTH('QSO DB'!I99)<10,\"0\",\"\")&MONTH('QSO DB'!I99)&\"-\"&IF(DAY('QSO DB'!I99)<10,\"0\",\"\")&DAY('QSO DB'!I99))&\" \"&IF(ISBLANK('QSO DB'!J99),\"XXXX\",LEFT('QSO DB'!J99,4))&\" \"&UPPER('QSO DB'!K99)&REPT(\" \",14-LEN('QSO DB'!K99))&IF(ISBLANK('QSO DB'!L99),REPT(\"X\",3),'QSO DB'!L99&REPT(\" \",3-LEN('QSO DB'!L99)))&\" \"&IF(ISBLANK('QSO DB'!M99),REPT(\"X\",4),'QSO DB'!M99)&\"   \"&UPPER('QSO DB'!F99)&REPT(\" \",14-LEN('QSO DB'!F99))&IF(ISBLANK('QSO DB'!G99),REPT(\"X\",3),'QSO DB'!G99&REPT(\" \",3-LEN('QSO DB'!G99)))&\" \"&IF(ISBLANK('QSO DB'!H99),REPT(\"X\",4),'QSO DB'!H99)))","v":""}]
[{"$f":"IF(OR(LEFT(A114,3)=\"END\",A114=\"\"),\"\",IF(ISBLANK('QSO DB'!D100),\"END-OF-LOG:\",\"QSO:\"&'QSO DB'!D100&REPT(\" \",6-LEN('QSO DB'!D100))&\" \"&IF(ISBLANK('QSO DB'!E100),\"xx\",\"\")&UPPER('QSO DB'!E100)&\" \"&IF(ISBLANK('QSO DB'!I100),REPT(\"X\",10),YEAR('QSO DB'!I100)&\"-\"&IF(MONTH('QSO DB'!I100)<10,\"0\",\"\")&MONTH('QSO DB'!I100)&\"-\"&IF(DAY('QSO DB'!I100)<10,\"0\",\"\")&DAY('QSO DB'!I100))&\" \"&IF(ISBLANK('QSO DB'!J100),\"XXXX\",LEFT('QSO DB'!J100,4))&\" \"&UPPER('QSO DB'!K100)&REPT(\" \",14-LEN('QSO DB'!K100))&IF(ISBLANK('QSO DB'!L100),REPT(\"X\",3),'QSO DB'!L100&REPT(\" \",3-LEN('QSO DB'!L100)))&\" \"&IF(ISBLANK('QSO DB'!M100),REPT(\"X\",4),'QSO DB'!M100)&\"   \"&UPPER('QSO DB'!F100)&REPT(\" \",14-LEN('QSO DB'!F100))&IF(ISBLANK('QSO DB'!G100),REPT(\"X\",3),'QSO DB'!G100&REPT(\" \",3-LEN('QSO DB'!G100)))&\" \"&IF(ISBLANK('QSO DB'!H100),REPT(\"X\",4),'QSO DB'!H100)))","v":""}]
[{"$f":"IF(OR(LEFT(A115,3)=\"END\",A115=\"\"),\"\",IF(ISBLANK('QSO DB'!D101),\"END-OF-LOG:\",\"QSO:\"&'QSO DB'!D101&REPT(\" \",6-LEN('QSO DB'!D101))&\" \"&IF(ISBLANK('QSO DB'!E101),\"xx\",\"\")&UPPER('QSO DB'!E101)&\" \"&IF(ISBLANK('QSO DB'!I101),REPT(\"X\",10),YEAR('QSO DB'!I101)&\"-\"&IF(MONTH('QSO DB'!I101)<10,\"0\",\"\")&MONTH('QSO DB'!I101)&\"-\"&IF(DAY('QSO DB'!I101)<10,\"0\",\"\")&DAY('QSO DB'!I101))&\" \"&IF(ISBLANK('QSO DB'!J101),\"XXXX\",LEFT('QSO DB'!J101,4))&\" \"&UPPER('QSO DB'!K101)&REPT(\" \",14-LEN('QSO DB'!K101))&IF(ISBLANK('QSO DB'!L101),REPT(\"X\",3),'QSO DB'!L101&REPT(\" \",3-LEN('QSO DB'!L101)))&\" \"&IF(ISBLANK('QSO DB'!M101),REPT(\"X\",4),'QSO DB'!M101)&\"   \"&UPPER('QSO DB'!F101)&REPT(\" \",14-LEN('QSO DB'!F101))&IF(ISBLANK('QSO DB'!G101),REPT(\"X\",3),'QSO DB'!G101&REPT(\" \",3-LEN('QSO DB'!G101)))&\" \"&IF(ISBLANK('QSO DB'!H101),REPT(\"X\",4),'QSO DB'!H101)))","v":""}]
[{"$f":"IF(OR(LEFT(A116,3)=\"END\",A116=\"\"),\"\",IF(ISBLANK('QSO DB'!D102),\"END-OF-LOG:\",\"QSO:\"&'QSO DB'!D102&REPT(\" \",6-LEN('QSO DB'!D102))&\" \"&IF(ISBLANK('QSO DB'!E102),\"xx\",\"\")&UPPER('QSO DB'!E102)&\" \"&IF(ISBLANK('QSO DB'!I102),REPT(\"X\",10),YEAR('QSO DB'!I102)&\"-\"&IF(MONTH('QSO DB'!I102)<10,\"0\",\"\")&MONTH('QSO DB'!I102)&\"-\"&IF(DAY('QSO DB'!I102)<10,\"0\",\"\")&DAY('QSO DB'!I102))&\" \"&IF(ISBLANK('QSO DB'!J102),\"XXXX\",LEFT('QSO DB'!J102,4))&\" \"&UPPER('QSO DB'!K102)&REPT(\" \",14-LEN('QSO DB'!K102))&IF(ISBLANK('QSO DB'!L102),REPT(\"X\",3),'QSO DB'!L102&REPT(\" \",3-LEN('QSO DB'!L102)))&\" \"&IF(ISBLANK('QSO DB'!M102),REPT(\"X\",4),'QSO DB'!M102)&\"   \"&UPPER('QSO DB'!F102)&REPT(\" \",14-LEN('QSO DB'!F102))&IF(ISBLANK('QSO DB'!G102),REPT(\"X\",3),'QSO DB'!G102&REPT(\" \",3-LEN('QSO DB'!G102)))&\" \"&IF(ISBLANK('QSO DB'!H102),REPT(\"X\",4),'QSO DB'!H102)))","v":""}]
[{"$f":"IF(OR(LEFT(A117,3)=\"END\",A117=\"\"),\"\",IF(ISBLANK('QSO DB'!D103),\"END-OF-LOG:\",\"QSO:\"&'QSO DB'!D103&REPT(\" \",6-LEN('QSO DB'!D103))&\" \"&IF(ISBLANK('QSO DB'!E103),\"xx\",\"\")&UPPER('QSO DB'!E103)&\" \"&IF(ISBLANK('QSO DB'!I103),REPT(\"X\",10),YEAR('QSO DB'!I103)&\"-\"&IF(MONTH('QSO DB'!I103)<10,\"0\",\"\")&MONTH('QSO DB'!I103)&\"-\"&IF(DAY('QSO DB'!I103)<10,\"0\",\"\")&DAY('QSO DB'!I103))&\" \"&IF(ISBLANK('QSO DB'!J103),\"XXXX\",LEFT('QSO DB'!J103,4))&\" \"&UPPER('QSO DB'!K103)&REPT(\" \",14-LEN('QSO DB'!K103))&IF(ISBLANK('QSO DB'!L103),REPT(\"X\",3),'QSO DB'!L103&REPT(\" \",3-LEN('QSO DB'!L103)))&\" \"&IF(ISBLANK('QSO DB'!M103),REPT(\"X\",4),'QSO DB'!M103)&\"   \"&UPPER('QSO DB'!F103)&REPT(\" \",14-LEN('QSO DB'!F103))&IF(ISBLANK('QSO DB'!G103),REPT(\"X\",3),'QSO DB'!G103&REPT(\" \",3-LEN('QSO DB'!G103)))&\" \"&IF(ISBLANK('QSO DB'!H103),REPT(\"X\",4),'QSO DB'!H103)))","v":""}]
[{"$f":"IF(OR(LEFT(A118,3)=\"END\",A118=\"\"),\"\",IF(ISBLANK('QSO DB'!D104),\"END-OF-LOG:\",\"QSO:\"&'QSO DB'!D104&REPT(\" \",6-LEN('QSO DB'!D104))&\" \"&IF(ISBLANK('QSO DB'!E104),\"xx\",\"\")&UPPER('QSO DB'!E104)&\" \"&IF(ISBLANK('QSO DB'!I104),REPT(\"X\",10),YEAR('QSO DB'!I104)&\"-\"&IF(MONTH('QSO DB'!I104)<10,\"0\",\"\")&MONTH('QSO DB'!I104)&\"-\"&IF(DAY('QSO DB'!I104)<10,\"0\",\"\")&DAY('QSO DB'!I104))&\" \"&IF(ISBLANK('QSO DB'!J104),\"XXXX\",LEFT('QSO DB'!J104,4))&\" \"&UPPER('QSO DB'!K104)&REPT(\" \",14-LEN('QSO DB'!K104))&IF(ISBLANK('QSO DB'!L104),REPT(\"X\",3),'QSO DB'!L104&REPT(\" \",3-LEN('QSO DB'!L104)))&\" \"&IF(ISBLANK('QSO DB'!M104),REPT(\"X\",4),'QSO DB'!M104)&\"   \"&UPPER('QSO DB'!F104)&REPT(\" \",14-LEN('QSO DB'!F104))&IF(ISBLANK('QSO DB'!G104),REPT(\"X\",3),'QSO DB'!G104&REPT(\" \",3-LEN('QSO DB'!G104)))&\" \"&IF(ISBLANK('QSO DB'!H104),REPT(\"X\",4),'QSO DB'!H104)))","v":""}]
[{"$f":"IF(OR(LEFT(A119,3)=\"END\",A119=\"\"),\"\",IF(ISBLANK('QSO DB'!D105),\"END-OF-LOG:\",\"QSO:\"&'QSO DB'!D105&REPT(\" \",6-LEN('QSO DB'!D105))&\" \"&IF(ISBLANK('QSO DB'!E105),\"xx\",\"\")&UPPER('QSO DB'!E105)&\" \"&IF(ISBLANK('QSO DB'!I105),REPT(\"X\",10),YEAR('QSO DB'!I105)&\"-\"&IF(MONTH('QSO DB'!I105)<10,\"0\",\"\")&MONTH('QSO DB'!I105)&\"-\"&IF(DAY('QSO DB'!I105)<10,\"0\",\"\")&DAY('QSO DB'!I105))&\" \"&IF(ISBLANK('QSO DB'!J105),\"XXXX\",LEFT('QSO DB'!J105,4))&\" \"&UPPER('QSO DB'!K105)&REPT(\" \",14-LEN('QSO DB'!K105))&IF(ISBLANK('QSO DB'!L105),REPT(\"X\",3),'QSO DB'!L105&REPT(\" \",3-LEN('QSO DB'!L105)))&\" \"&IF(ISBLANK('QSO DB'!M105),REPT(\"X\",4),'QSO DB'!M105)&\"   \"&UPPER('QSO DB'!F105)&REPT(\" \",14-LEN('QSO DB'!F105))&IF(ISBLANK('QSO DB'!G105),REPT(\"X\",3),'QSO DB'!G105&REPT(\" \",3-LEN('QSO DB'!G105)))&\" \"&IF(ISBLANK('QSO DB'!H105),REPT(\"X\",4),'QSO DB'!H105)))","v":""}]
[{"$f":"IF(OR(LEFT(A120,3)=\"END\",A120=\"\"),\"\",IF(ISBLANK('QSO DB'!D106),\"END-OF-LOG:\",\"QSO:\"&'QSO DB'!D106&REPT(\" \",6-LEN('QSO DB'!D106))&\" \"&IF(ISBLANK('QSO DB'!E106),\"xx\",\"\")&UPPER('QSO DB'!E106)&\" \"&IF(ISBLANK('QSO DB'!I106),REPT(\"X\",10),YEAR('QSO DB'!I106)&\"-\"&IF(MONTH('QSO DB'!I106)<10,\"0\",\"\")&MONTH('QSO DB'!I106)&\"-\"&IF(DAY('QSO DB'!I106)<10,\"0\",\"\")&DAY('QSO DB'!I106))&\" \"&IF(ISBLANK('QSO DB'!J106),\"XXXX\",LEFT('QSO DB'!J106,4))&\" \"&UPPER('QSO DB'!K106)&REPT(\" \",14-LEN('QSO DB'!K106))&IF(ISBLANK('QSO DB'!L106),REPT(\"X\",3),'QSO DB'!L106&REPT(\" \",3-LEN('QSO DB'!L106)))&\" \"&IF(ISBLANK('QSO DB'!M106),REPT(\"X\",4),'QSO DB'!M106)&\"   \"&UPPER('QSO DB'!F106)&REPT(\" \",14-LEN('QSO DB'!F106))&IF(ISBLANK('QSO DB'!G106),REPT(\"X\",3),'QSO DB'!G106&REPT(\" \",3-LEN('QSO DB'!G106)))&\" \"&IF(ISBLANK('QSO DB'!H106),REPT(\"X\",4),'QSO DB'!H106)))","v":""}]
[{"$f":"IF(OR(LEFT(A121,3)=\"END\",A121=\"\"),\"\",IF(ISBLANK('QSO DB'!D107),\"END-OF-LOG:\",\"QSO:\"&'QSO DB'!D107&REPT(\" \",6-LEN('QSO DB'!D107))&\" \"&IF(ISBLANK('QSO DB'!E107),\"xx\",\"\")&UPPER('QSO DB'!E107)&\" \"&IF(ISBLANK('QSO DB'!I107),REPT(\"X\",10),YEAR('QSO DB'!I107)&\"-\"&IF(MONTH('QSO DB'!I107)<10,\"0\",\"\")&MONTH('QSO DB'!I107)&\"-\"&IF(DAY('QSO DB'!I107)<10,\"0\",\"\")&DAY('QSO DB'!I107))&\" \"&IF(ISBLANK('QSO DB'!J107),\"XXXX\",LEFT('QSO DB'!J107,4))&\" \"&UPPER('QSO DB'!K107)&REPT(\" \",14-LEN('QSO DB'!K107))&IF(ISBLANK('QSO DB'!L107),REPT(\"X\",3),'QSO DB'!L107&REPT(\" \",3-LEN('QSO DB'!L107)))&\" \"&IF(ISBLANK('QSO DB'!M107),REPT(\"X\",4),'QSO DB'!M107)&\"   \"&UPPER('QSO DB'!F107)&REPT(\" \",14-LEN('QSO DB'!F107))&IF(ISBLANK('QSO DB'!G107),REPT(\"X\",3),'QSO DB'!G107&REPT(\" \",3-LEN('QSO DB'!G107)))&\" \"&IF(ISBLANK('QSO DB'!H107),REPT(\"X\",4),'QSO DB'!H107)))","v":""}]
[{"$f":"IF(OR(LEFT(A122,3)=\"END\",A122=\"\"),\"\",IF(ISBLANK('QSO DB'!D108),\"END-OF-LOG:\",\"QSO:\"&'QSO DB'!D108&REPT(\" \",6-LEN('QSO DB'!D108))&\" \"&IF(ISBLANK('QSO DB'!E108),\"xx\",\"\")&UPPER('QSO DB'!E108)&\" \"&IF(ISBLANK('QSO DB'!I108),REPT(\"X\",10),YEAR('QSO DB'!I108)&\"-\"&IF(MONTH('QSO DB'!I108)<10,\"0\",\"\")&MONTH('QSO DB'!I108)&\"-\"&IF(DAY('QSO DB'!I108)<10,\"0\",\"\")&DAY('QSO DB'!I108))&\" \"&IF(ISBLANK('QSO DB'!J108),\"XXXX\",LEFT('QSO DB'!J108,4))&\" \"&UPPER('QSO DB'!K108)&REPT(\" \",14-LEN('QSO DB'!K108))&IF(ISBLANK('QSO DB'!L108),REPT(\"X\",3),'QSO DB'!L108&REPT(\" \",3-LEN('QSO DB'!L108)))&\" \"&IF(ISBLANK('QSO DB'!M108),REPT(\"X\",4),'QSO DB'!M108)&\"   \"&UPPER('QSO DB'!F108)&REPT(\" \",14-LEN('QSO DB'!F108))&IF(ISBLANK('QSO DB'!G108),REPT(\"X\",3),'QSO DB'!G108&REPT(\" \",3-LEN('QSO DB'!G108)))&\" \"&IF(ISBLANK('QSO DB'!H108),REPT(\"X\",4),'QSO DB'!H108)))","v":""}]
[{"$f":"IF(OR(LEFT(A123,3)=\"END\",A123=\"\"),\"\",IF(ISBLANK('QSO DB'!D109),\"END-OF-LOG:\",\"QSO:\"&'QSO DB'!D109&REPT(\" \",6-LEN('QSO DB'!D109))&\" \"&IF(ISBLANK('QSO DB'!E109),\"xx\",\"\")&UPPER('QSO DB'!E109)&\" \"&IF(ISBLANK('QSO DB'!I109),REPT(\"X\",10),YEAR('QSO DB'!I109)&\"-\"&IF(MONTH('QSO DB'!I109)<10,\"0\",\"\")&MONTH('QSO DB'!I109)&\"-\"&IF(DAY('QSO DB'!I109)<10,\"0\",\"\")&DAY('QSO DB'!I109))&\" \"&IF(ISBLANK('QSO DB'!J109),\"XXXX\",LEFT('QSO DB'!J109,4))&\" \"&UPPER('QSO DB'!K109)&REPT(\" \",14-LEN('QSO DB'!K109))&IF(ISBLANK('QSO DB'!L109),REPT(\"X\",3),'QSO DB'!L109&REPT(\" \",3-LEN('QSO DB'!L109)))&\" \"&IF(ISBLANK('QSO DB'!M109),REPT(\"X\",4),'QSO DB'!M109)&\"   \"&UPPER('QSO DB'!F109)&REPT(\" \",14-LEN('QSO DB'!F109))&IF(ISBLANK('QSO DB'!G109),REPT(\"X\",3),'QSO DB'!G109&REPT(\" \",3-LEN('QSO DB'!G109)))&\" \"&IF(ISBLANK('QSO DB'!H109),REPT(\"X\",4),'QSO DB'!H109)))","v":""}]
[{"$f":"IF(OR(LEFT(A124,3)=\"END\",A124=\"\"),\"\",IF(ISBLANK('QSO DB'!D110),\"END-OF-LOG:\",\"QSO:\"&'QSO DB'!D110&REPT(\" \",6-LEN('QSO DB'!D110))&\" \"&IF(ISBLANK('QSO DB'!E110),\"xx\",\"\")&UPPER('QSO DB'!E110)&\" \"&IF(ISBLANK('QSO DB'!I110),REPT(\"X\",10),YEAR('QSO DB'!I110)&\"-\"&IF(MONTH('QSO DB'!I110)<10,\"0\",\"\")&MONTH('QSO DB'!I110)&\"-\"&IF(DAY('QSO DB'!I110)<10,\"0\",\"\")&DAY('QSO DB'!I110))&\" \"&IF(ISBLANK('QSO DB'!J110),\"XXXX\",LEFT('QSO DB'!J110,4))&\" \"&UPPER('QSO DB'!K110)&REPT(\" \",14-LEN('QSO DB'!K110))&IF(ISBLANK('QSO DB'!L110),REPT(\"X\",3),'QSO DB'!L110&REPT(\" \",3-LEN('QSO DB'!L110)))&\" \"&IF(ISBLANK('QSO DB'!M110),REPT(\"X\",4),'QSO DB'!M110)&\"   \"&UPPER('QSO DB'!F110)&REPT(\" \",14-LEN('QSO DB'!F110))&IF(ISBLANK('QSO DB'!G110),REPT(\"X\",3),'QSO DB'!G110&REPT(\" \",3-LEN('QSO DB'!G110)))&\" \"&IF(ISBLANK('QSO DB'!H110),REPT(\"X\",4),'QSO DB'!H110)))","v":""}]
[{"$f":"IF(OR(LEFT(A125,3)=\"END\",A125=\"\"),\"\",IF(ISBLANK('QSO DB'!D111),\"END-OF-LOG:\",\"QSO:\"&'QSO DB'!D111&REPT(\" \",6-LEN('QSO DB'!D111))&\" \"&IF(ISBLANK('QSO DB'!E111),\"xx\",\"\")&UPPER('QSO DB'!E111)&\" \"&IF(ISBLANK('QSO DB'!I111),REPT(\"X\",10),YEAR('QSO DB'!I111)&\"-\"&IF(MONTH('QSO DB'!I111)<10,\"0\",\"\")&MONTH('QSO DB'!I111)&\"-\"&IF(DAY('QSO DB'!I111)<10,\"0\",\"\")&DAY('QSO DB'!I111))&\" \"&IF(ISBLANK('QSO DB'!J111),\"XXXX\",LEFT('QSO DB'!J111,4))&\" \"&UPPER('QSO DB'!K111)&REPT(\" \",14-LEN('QSO DB'!K111))&IF(ISBLANK('QSO DB'!L111),REPT(\"X\",3),'QSO DB'!L111&REPT(\" \",3-LEN('QSO DB'!L111)))&\" \"&IF(ISBLANK('QSO DB'!M111),REPT(\"X\",4),'QSO DB'!M111)&\"   \"&UPPER('QSO DB'!F111)&REPT(\" \",14-LEN('QSO DB'!F111))&IF(ISBLANK('QSO DB'!G111),REPT(\"X\",3),'QSO DB'!G111&REPT(\" \",3-LEN('QSO DB'!G111)))&\" \"&IF(ISBLANK('QSO DB'!H111),REPT(\"X\",4),'QSO DB'!H111)))","v":""}]
[{"$f":"IF(OR(LEFT(A126,3)=\"END\",A126=\"\"),\"\",IF(ISBLANK('QSO DB'!D112),\"END-OF-LOG:\",\"QSO:\"&'QSO DB'!D112&REPT(\" \",6-LEN('QSO DB'!D112))&\" \"&IF(ISBLANK('QSO DB'!E112),\"xx\",\"\")&UPPER('QSO DB'!E112)&\" \"&IF(ISBLANK('QSO DB'!I112),REPT(\"X\",10),YEAR('QSO DB'!I112)&\"-\"&IF(MONTH('QSO DB'!I112)<10,\"0\",\"\")&MONTH('QSO DB'!I112)&\"-\"&IF(DAY('QSO DB'!I112)<10,\"0\",\"\")&DAY('QSO DB'!I112))&\" \"&IF(ISBLANK('QSO DB'!J112),\"XXXX\",LEFT('QSO DB'!J112,4))&\" \"&UPPER('QSO DB'!K112)&REPT(\" \",14-LEN('QSO DB'!K112))&IF(ISBLANK('QSO DB'!L112),REPT(\"X\",3),'QSO DB'!L112&REPT(\" \",3-LEN('QSO DB'!L112)))&\" \"&IF(ISBLANK('QSO DB'!M112),REPT(\"X\",4),'QSO DB'!M112)&\"   \"&UPPER('QSO DB'!F112)&REPT(\" \",14-LEN('QSO DB'!F112))&IF(ISBLANK('QSO DB'!G112),REPT(\"X\",3),'QSO DB'!G112&REPT(\" \",3-LEN('QSO DB'!G112)))&\" \"&IF(ISBLANK('QSO DB'!H112),REPT(\"X\",4),'QSO DB'!H112)))","v":""}]
[{"$f":"IF(OR(LEFT(A127,3)=\"END\",A127=\"\"),\"\",IF(ISBLANK('QSO DB'!D113),\"END-OF-LOG:\",\"QSO:\"&'QSO DB'!D113&REPT(\" \",6-LEN('QSO DB'!D113))&\" \"&IF(ISBLANK('QSO DB'!E113),\"xx\",\"\")&UPPER('QSO DB'!E113)&\" \"&IF(ISBLANK('QSO DB'!I113),REPT(\"X\",10),YEAR('QSO DB'!I113)&\"-\"&IF(MONTH('QSO DB'!I113)<10,\"0\",\"\")&MONTH('QSO DB'!I113)&\"-\"&IF(DAY('QSO DB'!I113)<10,\"0\",\"\")&DAY('QSO DB'!I113))&\" \"&IF(ISBLANK('QSO DB'!J113),\"XXXX\",LEFT('QSO DB'!J113,4))&\" \"&UPPER('QSO DB'!K113)&REPT(\" \",14-LEN('QSO DB'!K113))&IF(ISBLANK('QSO DB'!L113),REPT(\"X\",3),'QSO DB'!L113&REPT(\" \",3-LEN('QSO DB'!L113)))&\" \"&IF(ISBLANK('QSO DB'!M113),REPT(\"X\",4),'QSO DB'!M113)&\"   \"&UPPER('QSO DB'!F113)&REPT(\" \",14-LEN('QSO DB'!F113))&IF(ISBLANK('QSO DB'!G113),REPT(\"X\",3),'QSO DB'!G113&REPT(\" \",3-LEN('QSO DB'!G113)))&\" \"&IF(ISBLANK('QSO DB'!H113),REPT(\"X\",4),'QSO DB'!H113)))","v":""}]
[{"$f":"IF(OR(LEFT(A128,3)=\"END\",A128=\"\"),\"\",IF(ISBLANK('QSO DB'!D114),\"END-OF-LOG:\",\"QSO:\"&'QSO DB'!D114&REPT(\" \",6-LEN('QSO DB'!D114))&\" \"&IF(ISBLANK('QSO DB'!E114),\"xx\",\"\")&UPPER('QSO DB'!E114)&\" \"&IF(ISBLANK('QSO DB'!I114),REPT(\"X\",10),YEAR('QSO DB'!I114)&\"-\"&IF(MONTH('QSO DB'!I114)<10,\"0\",\"\")&MONTH('QSO DB'!I114)&\"-\"&IF(DAY('QSO DB'!I114)<10,\"0\",\"\")&DAY('QSO DB'!I114))&\" \"&IF(ISBLANK('QSO DB'!J114),\"XXXX\",LEFT('QSO DB'!J114,4))&\" \"&UPPER('QSO DB'!K114)&REPT(\" \",14-LEN('QSO DB'!K114))&IF(ISBLANK('QSO DB'!L114),REPT(\"X\",3),'QSO DB'!L114&REPT(\" \",3-LEN('QSO DB'!L114)))&\" \"&IF(ISBLANK('QSO DB'!M114),REPT(\"X\",4),'QSO DB'!M114)&\"   \"&UPPER('QSO DB'!F114)&REPT(\" \",14-LEN('QSO DB'!F114))&IF(ISBLANK('QSO DB'!G114),REPT(\"X\",3),'QSO DB'!G114&REPT(\" \",3-LEN('QSO DB'!G114)))&\" \"&IF(ISBLANK('QSO DB'!H114),REPT(\"X\",4),'QSO DB'!H114)))","v":""}]
[{"$f":"IF(OR(LEFT(A129,3)=\"END\",A129=\"\"),\"\",IF(ISBLANK('QSO DB'!D115),\"END-OF-LOG:\",\"QSO:\"&'QSO DB'!D115&REPT(\" \",6-LEN('QSO DB'!D115))&\" \"&IF(ISBLANK('QSO DB'!E115),\"xx\",\"\")&UPPER('QSO DB'!E115)&\" \"&IF(ISBLANK('QSO DB'!I115),REPT(\"X\",10),YEAR('QSO DB'!I115)&\"-\"&IF(MONTH('QSO DB'!I115)<10,\"0\",\"\")&MONTH('QSO DB'!I115)&\"-\"&IF(DAY('QSO DB'!I115)<10,\"0\",\"\")&DAY('QSO DB'!I115))&\" \"&IF(ISBLANK('QSO DB'!J115),\"XXXX\",LEFT('QSO DB'!J115,4))&\" \"&UPPER('QSO DB'!K115)&REPT(\" \",14-LEN('QSO DB'!K115))&IF(ISBLANK('QSO DB'!L115),REPT(\"X\",3),'QSO DB'!L115&REPT(\" \",3-LEN('QSO DB'!L115)))&\" \"&IF(ISBLANK('QSO DB'!M115),REPT(\"X\",4),'QSO DB'!M115)&\"   \"&UPPER('QSO DB'!F115)&REPT(\" \",14-LEN('QSO DB'!F115))&IF(ISBLANK('QSO DB'!G115),REPT(\"X\",3),'QSO DB'!G115&REPT(\" \",3-LEN('QSO DB'!G115)))&\" \"&IF(ISBLANK('QSO DB'!H115),REPT(\"X\",4),'QSO DB'!H115)))","v":""}]
[{"$f":"IF(OR(LEFT(A130,3)=\"END\",A130=\"\"),\"\",IF(ISBLANK('QSO DB'!D116),\"END-OF-LOG:\",\"QSO:\"&'QSO DB'!D116&REPT(\" \",6-LEN('QSO DB'!D116))&\" \"&IF(ISBLANK('QSO DB'!E116),\"xx\",\"\")&UPPER('QSO DB'!E116)&\" \"&IF(ISBLANK('QSO DB'!I116),REPT(\"X\",10),YEAR('QSO DB'!I116)&\"-\"&IF(MONTH('QSO DB'!I116)<10,\"0\",\"\")&MONTH('QSO DB'!I116)&\"-\"&IF(DAY('QSO DB'!I116)<10,\"0\",\"\")&DAY('QSO DB'!I116))&\" \"&IF(ISBLANK('QSO DB'!J116),\"XXXX\",LEFT('QSO DB'!J116,4))&\" \"&UPPER('QSO DB'!K116)&REPT(\" \",14-LEN('QSO DB'!K116))&IF(ISBLANK('QSO DB'!L116),REPT(\"X\",3),'QSO DB'!L116&REPT(\" \",3-LEN('QSO DB'!L116)))&\" \"&IF(ISBLANK('QSO DB'!M116),REPT(\"X\",4),'QSO DB'!M116)&\"   \"&UPPER('QSO DB'!F116)&REPT(\" \",14-LEN('QSO DB'!F116))&IF(ISBLANK('QSO DB'!G116),REPT(\"X\",3),'QSO DB'!G116&REPT(\" \",3-LEN('QSO DB'!G116)))&\" \"&IF(ISBLANK('QSO DB'!H116),REPT(\"X\",4),'QSO DB'!H116)))","v":""}]
[{"$f":"IF(OR(LEFT(A131,3)=\"END\",A131=\"\"),\"\",IF(ISBLANK('QSO DB'!D117),\"END-OF-LOG:\",\"QSO:\"&'QSO DB'!D117&REPT(\" \",6-LEN('QSO DB'!D117))&\" \"&IF(ISBLANK('QSO DB'!E117),\"xx\",\"\")&UPPER('QSO DB'!E117)&\" \"&IF(ISBLANK('QSO DB'!I117),REPT(\"X\",10),YEAR('QSO DB'!I117)&\"-\"&IF(MONTH('QSO DB'!I117)<10,\"0\",\"\")&MONTH('QSO DB'!I117)&\"-\"&IF(DAY('QSO DB'!I117)<10,\"0\",\"\")&DAY('QSO DB'!I117))&\" \"&IF(ISBLANK('QSO DB'!J117),\"XXXX\",LEFT('QSO DB'!J117,4))&\" \"&UPPER('QSO DB'!K117)&REPT(\" \",14-LEN('QSO DB'!K117))&IF(ISBLANK('QSO DB'!L117),REPT(\"X\",3),'QSO DB'!L117&REPT(\" \",3-LEN('QSO DB'!L117)))&\" \"&IF(ISBLANK('QSO DB'!M117),REPT(\"X\",4),'QSO DB'!M117)&\"   \"&UPPER('QSO DB'!F117)&REPT(\" \",14-LEN('QSO DB'!F117))&IF(ISBLANK('QSO DB'!G117),REPT(\"X\",3),'QSO DB'!G117&REPT(\" \",3-LEN('QSO DB'!G117)))&\" \"&IF(ISBLANK('QSO DB'!H117),REPT(\"X\",4),'QSO DB'!H117)))","v":""}]
[{"$f":"IF(OR(LEFT(A132,3)=\"END\",A132=\"\"),\"\",IF(ISBLANK('QSO DB'!D118),\"END-OF-LOG:\",\"QSO:\"&'QSO DB'!D118&REPT(\" \",6-LEN('QSO DB'!D118))&\" \"&IF(ISBLANK('QSO DB'!E118),\"xx\",\"\")&UPPER('QSO DB'!E118)&\" \"&IF(ISBLANK('QSO DB'!I118),REPT(\"X\",10),YEAR('QSO DB'!I118)&\"-\"&IF(MONTH('QSO DB'!I118)<10,\"0\",\"\")&MONTH('QSO DB'!I118)&\"-\"&IF(DAY('QSO DB'!I118)<10,\"0\",\"\")&DAY('QSO DB'!I118))&\" \"&IF(ISBLANK('QSO DB'!J118),\"XXXX\",LEFT('QSO DB'!J118,4))&\" \"&UPPER('QSO DB'!K118)&REPT(\" \",14-LEN('QSO DB'!K118))&IF(ISBLANK('QSO DB'!L118),REPT(\"X\",3),'QSO DB'!L118&REPT(\" \",3-LEN('QSO DB'!L118)))&\" \"&IF(ISBLANK('QSO DB'!M118),REPT(\"X\",4),'QSO DB'!M118)&\"   \"&UPPER('QSO DB'!F118)&REPT(\" \",14-LEN('QSO DB'!F118))&IF(ISBLANK('QSO DB'!G118),REPT(\"X\",3),'QSO DB'!G118&REPT(\" \",3-LEN('QSO DB'!G118)))&\" \"&IF(ISBLANK('QSO DB'!H118),REPT(\"X\",4),'QSO DB'!H118)))","v":""}]
[{"$f":"IF(OR(LEFT(A133,3)=\"END\",A133=\"\"),\"\",IF(ISBLANK('QSO DB'!D119),\"END-OF-LOG:\",\"QSO:\"&'QSO DB'!D119&REPT(\" \",6-LEN('QSO DB'!D119))&\" \"&IF(ISBLANK('QSO DB'!E119),\"xx\",\"\")&UPPER('QSO DB'!E119)&\" \"&IF(ISBLANK('QSO DB'!I119),REPT(\"X\",10),YEAR('QSO DB'!I119)&\"-\"&IF(MONTH('QSO DB'!I119)<10,\"0\",\"\")&MONTH('QSO DB'!I119)&\"-\"&IF(DAY('QSO DB'!I119)<10,\"0\",\"\")&DAY('QSO DB'!I119))&\" \"&IF(ISBLANK('QSO DB'!J119),\"XXXX\",LEFT('QSO DB'!J119,4))&\" \"&UPPER('QSO DB'!K119)&REPT(\" \",14-LEN('QSO DB'!K119))&IF(ISBLANK('QSO DB'!L119),REPT(\"X\",3),'QSO DB'!L119&REPT(\" \",3-LEN('QSO DB'!L119)))&\" \"&IF(ISBLANK('QSO DB'!M119),REPT(\"X\",4),'QSO DB'!M119)&\"   \"&UPPER('QSO DB'!F119)&REPT(\" \",14-LEN('QSO DB'!F119))&IF(ISBLANK('QSO DB'!G119),REPT(\"X\",3),'QSO DB'!G119&REPT(\" \",3-LEN('QSO DB'!G119)))&\" \"&IF(ISBLANK('QSO DB'!H119),REPT(\"X\",4),'QSO DB'!H119)))","v":""}]
[{"$f":"IF(OR(LEFT(A134,3)=\"END\",A134=\"\"),\"\",IF(ISBLANK('QSO DB'!D120),\"END-OF-LOG:\",\"QSO:\"&'QSO DB'!D120&REPT(\" \",6-LEN('QSO DB'!D120))&\" \"&IF(ISBLANK('QSO DB'!E120),\"xx\",\"\")&UPPER('QSO DB'!E120)&\" \"&IF(ISBLANK('QSO DB'!I120),REPT(\"X\",10),YEAR('QSO DB'!I120)&\"-\"&IF(MONTH('QSO DB'!I120)<10,\"0\",\"\")&MONTH('QSO DB'!I120)&\"-\"&IF(DAY('QSO DB'!I120)<10,\"0\",\"\")&DAY('QSO DB'!I120))&\" \"&IF(ISBLANK('QSO DB'!J120),\"XXXX\",LEFT('QSO DB'!J120,4))&\" \"&UPPER('QSO DB'!K120)&REPT(\" \",14-LEN('QSO DB'!K120))&IF(ISBLANK('QSO DB'!L120),REPT(\"X\",3),'QSO DB'!L120&REPT(\" \",3-LEN('QSO DB'!L120)))&\" \"&IF(ISBLANK('QSO DB'!M120),REPT(\"X\",4),'QSO DB'!M120)&\"   \"&UPPER('QSO DB'!F120)&REPT(\" \",14-LEN('QSO DB'!F120))&IF(ISBLANK('QSO DB'!G120),REPT(\"X\",3),'QSO DB'!G120&REPT(\" \",3-LEN('QSO DB'!G120)))&\" \"&IF(ISBLANK('QSO DB'!H120),REPT(\"X\",4),'QSO DB'!H120)))","v":""}]
[{"$f":"IF(OR(LEFT(A135,3)=\"END\",A135=\"\"),\"\",IF(ISBLANK('QSO DB'!D121),\"END-OF-LOG:\",\"QSO:\"&'QSO DB'!D121&REPT(\" \",6-LEN('QSO DB'!D121))&\" \"&IF(ISBLANK('QSO DB'!E121),\"xx\",\"\")&UPPER('QSO DB'!E121)&\" \"&IF(ISBLANK('QSO DB'!I121),REPT(\"X\",10),YEAR('QSO DB'!I121)&\"-\"&IF(MONTH('QSO DB'!I121)<10,\"0\",\"\")&MONTH('QSO DB'!I121)&\"-\"&IF(DAY('QSO DB'!I121)<10,\"0\",\"\")&DAY('QSO DB'!I121))&\" \"&IF(ISBLANK('QSO DB'!J121),\"XXXX\",LEFT('QSO DB'!J121,4))&\" \"&UPPER('QSO DB'!K121)&REPT(\" \",14-LEN('QSO DB'!K121))&IF(ISBLANK('QSO DB'!L121),REPT(\"X\",3),'QSO DB'!L121&REPT(\" \",3-LEN('QSO DB'!L121)))&\" \"&IF(ISBLANK('QSO DB'!M121),REPT(\"X\",4),'QSO DB'!M121)&\"   \"&UPPER('QSO DB'!F121)&REPT(\" \",14-LEN('QSO DB'!F121))&IF(ISBLANK('QSO DB'!G121),REPT(\"X\",3),'QSO DB'!G121&REPT(\" \",3-LEN('QSO DB'!G121)))&\" \"&IF(ISBLANK('QSO DB'!H121),REPT(\"X\",4),'QSO DB'!H121)))","v":""}]
[{"$f":"IF(OR(LEFT(A136,3)=\"END\",A136=\"\"),\"\",IF(ISBLANK('QSO DB'!D122),\"END-OF-LOG:\",\"QSO:\"&'QSO DB'!D122&REPT(\" \",6-LEN('QSO DB'!D122))&\" \"&IF(ISBLANK('QSO DB'!E122),\"xx\",\"\")&UPPER('QSO DB'!E122)&\" \"&IF(ISBLANK('QSO DB'!I122),REPT(\"X\",10),YEAR('QSO DB'!I122)&\"-\"&IF(MONTH('QSO DB'!I122)<10,\"0\",\"\")&MONTH('QSO DB'!I122)&\"-\"&IF(DAY('QSO DB'!I122)<10,\"0\",\"\")&DAY('QSO DB'!I122))&\" \"&IF(ISBLANK('QSO DB'!J122),\"XXXX\",LEFT('QSO DB'!J122,4))&\" \"&UPPER('QSO DB'!K122)&REPT(\" \",14-LEN('QSO DB'!K122))&IF(ISBLANK('QSO DB'!L122),REPT(\"X\",3),'QSO DB'!L122&REPT(\" \",3-LEN('QSO DB'!L122)))&\" \"&IF(ISBLANK('QSO DB'!M122),REPT(\"X\",4),'QSO DB'!M122)&\"   \"&UPPER('QSO DB'!F122)&REPT(\" \",14-LEN('QSO DB'!F122))&IF(ISBLANK('QSO DB'!G122),REPT(\"X\",3),'QSO DB'!G122&REPT(\" \",3-LEN('QSO DB'!G122)))&\" \"&IF(ISBLANK('QSO DB'!H122),REPT(\"X\",4),'QSO DB'!H122)))","v":""}]
[{"$f":"IF(OR(LEFT(A137,3)=\"END\",A137=\"\"),\"\",IF(ISBLANK('QSO DB'!D123),\"END-OF-LOG:\",\"QSO:\"&'QSO DB'!D123&REPT(\" \",6-LEN('QSO DB'!D123))&\" \"&IF(ISBLANK('QSO DB'!E123),\"xx\",\"\")&UPPER('QSO DB'!E123)&\" \"&IF(ISBLANK('QSO DB'!I123),REPT(\"X\",10),YEAR('QSO DB'!I123)&\"-\"&IF(MONTH('QSO DB'!I123)<10,\"0\",\"\")&MONTH('QSO DB'!I123)&\"-\"&IF(DAY('QSO DB'!I123)<10,\"0\",\"\")&DAY('QSO DB'!I123))&\" \"&IF(ISBLANK('QSO DB'!J123),\"XXXX\",LEFT('QSO DB'!J123,4))&\" \"&UPPER('QSO DB'!K123)&REPT(\" \",14-LEN('QSO DB'!K123))&IF(ISBLANK('QSO DB'!L123),REPT(\"X\",3),'QSO DB'!L123&REPT(\" \",3-LEN('QSO DB'!L123)))&\" \"&IF(ISBLANK('QSO DB'!M123),REPT(\"X\",4),'QSO DB'!M123)&\"   \"&UPPER('QSO DB'!F123)&REPT(\" \",14-LEN('QSO DB'!F123))&IF(ISBLANK('QSO DB'!G123),REPT(\"X\",3),'QSO DB'!G123&REPT(\" \",3-LEN('QSO DB'!G123)))&\" \"&IF(ISBLANK('QSO DB'!H123),REPT(\"X\",4),'QSO DB'!H123)))","v":""}]
[{"$f":"IF(OR(LEFT(A138,3)=\"END\",A138=\"\"),\"\",IF(ISBLANK('QSO DB'!D124),\"END-OF-LOG:\",\"QSO:\"&'QSO DB'!D124&REPT(\" \",6-LEN('QSO DB'!D124))&\" \"&IF(ISBLANK('QSO DB'!E124),\"xx\",\"\")&UPPER('QSO DB'!E124)&\" \"&IF(ISBLANK('QSO DB'!I124),REPT(\"X\",10),YEAR('QSO DB'!I124)&\"-\"&IF(MONTH('QSO DB'!I124)<10,\"0\",\"\")&MONTH('QSO DB'!I124)&\"-\"&IF(DAY('QSO DB'!I124)<10,\"0\",\"\")&DAY('QSO DB'!I124))&\" \"&IF(ISBLANK('QSO DB'!J124),\"XXXX\",LEFT('QSO DB'!J124,4))&\" \"&UPPER('QSO DB'!K124)&REPT(\" \",14-LEN('QSO DB'!K124))&IF(ISBLANK('QSO DB'!L124),REPT(\"X\",3),'QSO DB'!L124&REPT(\" \",3-LEN('QSO DB'!L124)))&\" \"&IF(ISBLANK('QSO DB'!M124),REPT(\"X\",4),'QSO DB'!M124)&\"   \"&UPPER('QSO DB'!F124)&REPT(\" \",14-LEN('QSO DB'!F124))&IF(ISBLANK('QSO DB'!G124),REPT(\"X\",3),'QSO DB'!G124&REPT(\" \",3-LEN('QSO DB'!G124)))&\" \"&IF(ISBLANK('QSO DB'!H124),REPT(\"X\",4),'QSO DB'!H124)))","v":""}]
[{"$f":"IF(OR(LEFT(A139,3)=\"END\",A139=\"\"),\"\",IF(ISBLANK('QSO DB'!D125),\"END-OF-LOG:\",\"QSO:\"&'QSO DB'!D125&REPT(\" \",6-LEN('QSO DB'!D125))&\" \"&IF(ISBLANK('QSO DB'!E125),\"xx\",\"\")&UPPER('QSO DB'!E125)&\" \"&IF(ISBLANK('QSO DB'!I125),REPT(\"X\",10),YEAR('QSO DB'!I125)&\"-\"&IF(MONTH('QSO DB'!I125)<10,\"0\",\"\")&MONTH('QSO DB'!I125)&\"-\"&IF(DAY('QSO DB'!I125)<10,\"0\",\"\")&DAY('QSO DB'!I125))&\" \"&IF(ISBLANK('QSO DB'!J125),\"XXXX\",LEFT('QSO DB'!J125,4))&\" \"&UPPER('QSO DB'!K125)&REPT(\" \",14-LEN('QSO DB'!K125))&IF(ISBLANK('QSO DB'!L125),REPT(\"X\",3),'QSO DB'!L125&REPT(\" \",3-LEN('QSO DB'!L125)))&\" \"&IF(ISBLANK('QSO DB'!M125),REPT(\"X\",4),'QSO DB'!M125)&\"   \"&UPPER('QSO DB'!F125)&REPT(\" \",14-LEN('QSO DB'!F125))&IF(ISBLANK('QSO DB'!G125),REPT(\"X\",3),'QSO DB'!G125&REPT(\" \",3-LEN('QSO DB'!G125)))&\" \"&IF(ISBLANK('QSO DB'!H125),REPT(\"X\",4),'QSO DB'!H125)))","v":""}]
[{"$f":"IF(OR(LEFT(A140,3)=\"END\",A140=\"\"),\"\",IF(ISBLANK('QSO DB'!D126),\"END-OF-LOG:\",\"QSO:\"&'QSO DB'!D126&REPT(\" \",6-LEN('QSO DB'!D126))&\" \"&IF(ISBLANK('QSO DB'!E126),\"xx\",\"\")&UPPER('QSO DB'!E126)&\" \"&IF(ISBLANK('QSO DB'!I126),REPT(\"X\",10),YEAR('QSO DB'!I126)&\"-\"&IF(MONTH('QSO DB'!I126)<10,\"0\",\"\")&MONTH('QSO DB'!I126)&\"-\"&IF(DAY('QSO DB'!I126)<10,\"0\",\"\")&DAY('QSO DB'!I126))&\" \"&IF(ISBLANK('QSO DB'!J126),\"XXXX\",LEFT('QSO DB'!J126,4))&\" \"&UPPER('QSO DB'!K126)&REPT(\" \",14-LEN('QSO DB'!K126))&IF(ISBLANK('QSO DB'!L126),REPT(\"X\",3),'QSO DB'!L126&REPT(\" \",3-LEN('QSO DB'!L126)))&\" \"&IF(ISBLANK('QSO DB'!M126),REPT(\"X\",4),'QSO DB'!M126)&\"   \"&UPPER('QSO DB'!F126)&REPT(\" \",14-LEN('QSO DB'!F126))&IF(ISBLANK('QSO DB'!G126),REPT(\"X\",3),'QSO DB'!G126&REPT(\" \",3-LEN('QSO DB'!G126)))&\" \"&IF(ISBLANK('QSO DB'!H126),REPT(\"X\",4),'QSO DB'!H126)))","v":""}]
[{"$f":"IF(OR(LEFT(A141,3)=\"END\",A141=\"\"),\"\",IF(ISBLANK('QSO DB'!D127),\"END-OF-LOG:\",\"QSO:\"&'QSO DB'!D127&REPT(\" \",6-LEN('QSO DB'!D127))&\" \"&IF(ISBLANK('QSO DB'!E127),\"xx\",\"\")&UPPER('QSO DB'!E127)&\" \"&IF(ISBLANK('QSO DB'!I127),REPT(\"X\",10),YEAR('QSO DB'!I127)&\"-\"&IF(MONTH('QSO DB'!I127)<10,\"0\",\"\")&MONTH('QSO DB'!I127)&\"-\"&IF(DAY('QSO DB'!I127)<10,\"0\",\"\")&DAY('QSO DB'!I127))&\" \"&IF(ISBLANK('QSO DB'!J127),\"XXXX\",LEFT('QSO DB'!J127,4))&\" \"&UPPER('QSO DB'!K127)&REPT(\" \",14-LEN('QSO DB'!K127))&IF(ISBLANK('QSO DB'!L127),REPT(\"X\",3),'QSO DB'!L127&REPT(\" \",3-LEN('QSO DB'!L127)))&\" \"&IF(ISBLANK('QSO DB'!M127),REPT(\"X\",4),'QSO DB'!M127)&\"   \"&UPPER('QSO DB'!F127)&REPT(\" \",14-LEN('QSO DB'!F127))&IF(ISBLANK('QSO DB'!G127),REPT(\"X\",3),'QSO DB'!G127&REPT(\" \",3-LEN('QSO DB'!G127)))&\" \"&IF(ISBLANK('QSO DB'!H127),REPT(\"X\",4),'QSO DB'!H127)))","v":""}]
[{"$f":"IF(OR(LEFT(A142,3)=\"END\",A142=\"\"),\"\",IF(ISBLANK('QSO DB'!D128),\"END-OF-LOG:\",\"QSO:\"&'QSO DB'!D128&REPT(\" \",6-LEN('QSO DB'!D128))&\" \"&IF(ISBLANK('QSO DB'!E128),\"xx\",\"\")&UPPER('QSO DB'!E128)&\" \"&IF(ISBLANK('QSO DB'!I128),REPT(\"X\",10),YEAR('QSO DB'!I128)&\"-\"&IF(MONTH('QSO DB'!I128)<10,\"0\",\"\")&MONTH('QSO DB'!I128)&\"-\"&IF(DAY('QSO DB'!I128)<10,\"0\",\"\")&DAY('QSO DB'!I128))&\" \"&IF(ISBLANK('QSO DB'!J128),\"XXXX\",LEFT('QSO DB'!J128,4))&\" \"&UPPER('QSO DB'!K128)&REPT(\" \",14-LEN('QSO DB'!K128))&IF(ISBLANK('QSO DB'!L128),REPT(\"X\",3),'QSO DB'!L128&REPT(\" \",3-LEN('QSO DB'!L128)))&\" \"&IF(ISBLANK('QSO DB'!M128),REPT(\"X\",4),'QSO DB'!M128)&\"   \"&UPPER('QSO DB'!F128)&REPT(\" \",14-LEN('QSO DB'!F128))&IF(ISBLANK('QSO DB'!G128),REPT(\"X\",3),'QSO DB'!G128&REPT(\" \",3-LEN('QSO DB'!G128)))&\" \"&IF(ISBLANK('QSO DB'!H128),REPT(\"X\",4),'QSO DB'!H128)))","v":""}]
[{"$f":"IF(OR(LEFT(A143,3)=\"END\",A143=\"\"),\"\",IF(ISBLANK('QSO DB'!D129),\"END-OF-LOG:\",\"QSO:\"&'QSO DB'!D129&REPT(\" \",6-LEN('QSO DB'!D129))&\" \"&IF(ISBLANK('QSO DB'!E129),\"xx\",\"\")&UPPER('QSO DB'!E129)&\" \"&IF(ISBLANK('QSO DB'!I129),REPT(\"X\",10),YEAR('QSO DB'!I129)&\"-\"&IF(MONTH('QSO DB'!I129)<10,\"0\",\"\")&MONTH('QSO DB'!I129)&\"-\"&IF(DAY('QSO DB'!I129)<10,\"0\",\"\")&DAY('QSO DB'!I129))&\" \"&IF(ISBLANK('QSO DB'!J129),\"XXXX\",LEFT('QSO DB'!J129,4))&\" \"&UPPER('QSO DB'!K129)&REPT(\" \",14-LEN('QSO DB'!K129))&IF(ISBLANK('QSO DB'!L129),REPT(\"X\",3),'QSO DB'!L129&REPT(\" \",3-LEN('QSO DB'!L129)))&\" \"&IF(ISBLANK('QSO DB'!M129),REPT(\"X\",4),'QSO DB'!M129)&\"   \"&UPPER('QSO DB'!F129)&REPT(\" \",14-LEN('QSO DB'!F129))&IF(ISBLANK('QSO DB'!G129),REPT(\"X\",3),'QSO DB'!G129&REPT(\" \",3-LEN('QSO DB'!G129)))&\" \"&IF(ISBLANK('QSO DB'!H129),REPT(\"X\",4),'QSO DB'!H129)))","v":""}]
[{"$f":"IF(OR(LEFT(A144,3)=\"END\",A144=\"\"),\"\",IF(ISBLANK('QSO DB'!D130),\"END-OF-LOG:\",\"QSO:\"&'QSO DB'!D130&REPT(\" \",6-LEN('QSO DB'!D130))&\" \"&IF(ISBLANK('QSO DB'!E130),\"xx\",\"\")&UPPER('QSO DB'!E130)&\" \"&IF(ISBLANK('QSO DB'!I130),REPT(\"X\",10),YEAR('QSO DB'!I130)&\"-\"&IF(MONTH('QSO DB'!I130)<10,\"0\",\"\")&MONTH('QSO DB'!I130)&\"-\"&IF(DAY('QSO DB'!I130)<10,\"0\",\"\")&DAY('QSO DB'!I130))&\" \"&IF(ISBLANK('QSO DB'!J130),\"XXXX\",LEFT('QSO DB'!J130,4))&\" \"&UPPER('QSO DB'!K130)&REPT(\" \",14-LEN('QSO DB'!K130))&IF(ISBLANK('QSO DB'!L130),REPT(\"X\",3),'QSO DB'!L130&REPT(\" \",3-LEN('QSO DB'!L130)))&\" \"&IF(ISBLANK('QSO DB'!M130),REPT(\"X\",4),'QSO DB'!M130)&\"   \"&UPPER('QSO DB'!F130)&REPT(\" \",14-LEN('QSO DB'!F130))&IF(ISBLANK('QSO DB'!G130),REPT(\"X\",3),'QSO DB'!G130&REPT(\" \",3-LEN('QSO DB'!G130)))&\" \"&IF(ISBLANK('QSO DB'!H130),REPT(\"X\",4),'QSO DB'!H130)))","v":""}]
[{"$f":"IF(OR(LEFT(A145,3)=\"END\",A145=\"\"),\"\",IF(ISBLANK('QSO DB'!D131),\"END-OF-LOG:\",\"QSO:\"&'QSO DB'!D131&REPT(\" \",6-LEN('QSO DB'!D131))&\" \"&IF(ISBLANK('QSO DB'!E131),\"xx\",\"\")&UPPER('QSO DB'!E131)&\" \"&IF(ISBLANK('QSO DB'!I131),REPT(\"X\",10),YEAR('QSO DB'!I131)&\"-\"&IF(MONTH('QSO DB'!I131)<10,\"0\",\"\")&MONTH('QSO DB'!I131)&\"-\"&IF(DAY('QSO DB'!I131)<10,\"0\",\"\")&DAY('QSO DB'!I131))&\" \"&IF(ISBLANK('QSO DB'!J131),\"XXXX\",LEFT('QSO DB'!J131,4))&\" \"&UPPER('QSO DB'!K131)&REPT(\" \",14-LEN('QSO DB'!K131))&IF(ISBLANK('QSO DB'!L131),REPT(\"X\",3),'QSO DB'!L131&REPT(\" \",3-LEN('QSO DB'!L131)))&\" \"&IF(ISBLANK('QSO DB'!M131),REPT(\"X\",4),'QSO DB'!M131)&\"   \"&UPPER('QSO DB'!F131)&REPT(\" \",14-LEN('QSO DB'!F131))&IF(ISBLANK('QSO DB'!G131),REPT(\"X\",3),'QSO DB'!G131&REPT(\" \",3-LEN('QSO DB'!G131)))&\" \"&IF(ISBLANK('QSO DB'!H131),REPT(\"X\",4),'QSO DB'!H131)))","v":""}]
[{"$f":"IF(OR(LEFT(A146,3)=\"END\",A146=\"\"),\"\",IF(ISBLANK('QSO DB'!D132),\"END-OF-LOG:\",\"QSO:\"&'QSO DB'!D132&REPT(\" \",6-LEN('QSO DB'!D132))&\" \"&IF(ISBLANK('QSO DB'!E132),\"xx\",\"\")&UPPER('QSO DB'!E132)&\" \"&IF(ISBLANK('QSO DB'!I132),REPT(\"X\",10),YEAR('QSO DB'!I132)&\"-\"&IF(MONTH('QSO DB'!I132)<10,\"0\",\"\")&MONTH('QSO DB'!I132)&\"-\"&IF(DAY('QSO DB'!I132)<10,\"0\",\"\")&DAY('QSO DB'!I132))&\" \"&IF(ISBLANK('QSO DB'!J132),\"XXXX\",LEFT('QSO DB'!J132,4))&\" \"&UPPER('QSO DB'!K132)&REPT(\" \",14-LEN('QSO DB'!K132))&IF(ISBLANK('QSO DB'!L132),REPT(\"X\",3),'QSO DB'!L132&REPT(\" \",3-LEN('QSO DB'!L132)))&\" \"&IF(ISBLANK('QSO DB'!M132),REPT(\"X\",4),'QSO DB'!M132)&\"   \"&UPPER('QSO DB'!F132)&REPT(\" \",14-LEN('QSO DB'!F132))&IF(ISBLANK('QSO DB'!G132),REPT(\"X\",3),'QSO DB'!G132&REPT(\" \",3-LEN('QSO DB'!G132)))&\" \"&IF(ISBLANK('QSO DB'!H132),REPT(\"X\",4),'QSO DB'!H132)))","v":""}]
[{"$f":"IF(OR(LEFT(A147,3)=\"END\",A147=\"\"),\"\",IF(ISBLANK('QSO DB'!D133),\"END-OF-LOG:\",\"QSO:\"&'QSO DB'!D133&REPT(\" \",6-LEN('QSO DB'!D133))&\" \"&IF(ISBLANK('QSO DB'!E133),\"xx\",\"\")&UPPER('QSO DB'!E133)&\" \"&IF(ISBLANK('QSO DB'!I133),REPT(\"X\",10),YEAR('QSO DB'!I133)&\"-\"&IF(MONTH('QSO DB'!I133)<10,\"0\",\"\")&MONTH('QSO DB'!I133)&\"-\"&IF(DAY('QSO DB'!I133)<10,\"0\",\"\")&DAY('QSO DB'!I133))&\" \"&IF(ISBLANK('QSO DB'!J133),\"XXXX\",LEFT('QSO DB'!J133,4))&\" \"&UPPER('QSO DB'!K133)&REPT(\" \",14-LEN('QSO DB'!K133))&IF(ISBLANK('QSO DB'!L133),REPT(\"X\",3),'QSO DB'!L133&REPT(\" \",3-LEN('QSO DB'!L133)))&\" \"&IF(ISBLANK('QSO DB'!M133),REPT(\"X\",4),'QSO DB'!M133)&\"   \"&UPPER('QSO DB'!F133)&REPT(\" \",14-LEN('QSO DB'!F133))&IF(ISBLANK('QSO DB'!G133),REPT(\"X\",3),'QSO DB'!G133&REPT(\" \",3-LEN('QSO DB'!G133)))&\" \"&IF(ISBLANK('QSO DB'!H133),REPT(\"X\",4),'QSO DB'!H133)))","v":""}]
[{"$f":"IF(OR(LEFT(A148,3)=\"END\",A148=\"\"),\"\",IF(ISBLANK('QSO DB'!D134),\"END-OF-LOG:\",\"QSO:\"&'QSO DB'!D134&REPT(\" \",6-LEN('QSO DB'!D134))&\" \"&IF(ISBLANK('QSO DB'!E134),\"xx\",\"\")&UPPER('QSO DB'!E134)&\" \"&IF(ISBLANK('QSO DB'!I134),REPT(\"X\",10),YEAR('QSO DB'!I134)&\"-\"&IF(MONTH('QSO DB'!I134)<10,\"0\",\"\")&MONTH('QSO DB'!I134)&\"-\"&IF(DAY('QSO DB'!I134)<10,\"0\",\"\")&DAY('QSO DB'!I134))&\" \"&IF(ISBLANK('QSO DB'!J134),\"XXXX\",LEFT('QSO DB'!J134,4))&\" \"&UPPER('QSO DB'!K134)&REPT(\" \",14-LEN('QSO DB'!K134))&IF(ISBLANK('QSO DB'!L134),REPT(\"X\",3),'QSO DB'!L134&REPT(\" \",3-LEN('QSO DB'!L134)))&\" \"&IF(ISBLANK('QSO DB'!M134),REPT(\"X\",4),'QSO DB'!M134)&\"   \"&UPPER('QSO DB'!F134)&REPT(\" \",14-LEN('QSO DB'!F134))&IF(ISBLANK('QSO DB'!G134),REPT(\"X\",3),'QSO DB'!G134&REPT(\" \",3-LEN('QSO DB'!G134)))&\" \"&IF(ISBLANK('QSO DB'!H134),REPT(\"X\",4),'QSO DB'!H134)))","v":""}]
[{"$f":"IF(OR(LEFT(A149,3)=\"END\",A149=\"\"),\"\",IF(ISBLANK('QSO DB'!D135),\"END-OF-LOG:\",\"QSO:\"&'QSO DB'!D135&REPT(\" \",6-LEN('QSO DB'!D135))&\" \"&IF(ISBLANK('QSO DB'!E135),\"xx\",\"\")&UPPER('QSO DB'!E135)&\" \"&IF(ISBLANK('QSO DB'!I135),REPT(\"X\",10),YEAR('QSO DB'!I135)&\"-\"&IF(MONTH('QSO DB'!I135)<10,\"0\",\"\")&MONTH('QSO DB'!I135)&\"-\"&IF(DAY('QSO DB'!I135)<10,\"0\",\"\")&DAY('QSO DB'!I135))&\" \"&IF(ISBLANK('QSO DB'!J135),\"XXXX\",LEFT('QSO DB'!J135,4))&\" \"&UPPER('QSO DB'!K135)&REPT(\" \",14-LEN('QSO DB'!K135))&IF(ISBLANK('QSO DB'!L135),REPT(\"X\",3),'QSO DB'!L135&REPT(\" \",3-LEN('QSO DB'!L135)))&\" \"&IF(ISBLANK('QSO DB'!M135),REPT(\"X\",4),'QSO DB'!M135)&\"   \"&UPPER('QSO DB'!F135)&REPT(\" \",14-LEN('QSO DB'!F135))&IF(ISBLANK('QSO DB'!G135),REPT(\"X\",3),'QSO DB'!G135&REPT(\" \",3-LEN('QSO DB'!G135)))&\" \"&IF(ISBLANK('QSO DB'!H135),REPT(\"X\",4),'QSO DB'!H135)))","v":""}]
[{"$f":"IF(OR(LEFT(A150,3)=\"END\",A150=\"\"),\"\",IF(ISBLANK('QSO DB'!D136),\"END-OF-LOG:\",\"QSO:\"&'QSO DB'!D136&REPT(\" \",6-LEN('QSO DB'!D136))&\" \"&IF(ISBLANK('QSO DB'!E136),\"xx\",\"\")&UPPER('QSO DB'!E136)&\" \"&IF(ISBLANK('QSO DB'!I136),REPT(\"X\",10),YEAR('QSO DB'!I136)&\"-\"&IF(MONTH('QSO DB'!I136)<10,\"0\",\"\")&MONTH('QSO DB'!I136)&\"-\"&IF(DAY('QSO DB'!I136)<10,\"0\",\"\")&DAY('QSO DB'!I136))&\" \"&IF(ISBLANK('QSO DB'!J136),\"XXXX\",LEFT('QSO DB'!J136,4))&\" \"&UPPER('QSO DB'!K136)&REPT(\" \",14-LEN('QSO DB'!K136))&IF(ISBLANK('QSO DB'!L136),REPT(\"X\",3),'QSO DB'!L136&REPT(\" \",3-LEN('QSO DB'!L136)))&\" \"&IF(ISBLANK('QSO DB'!M136),REPT(\"X\",4),'QSO DB'!M136)&\"   \"&UPPER('QSO DB'!F136)&REPT(\" \",14-LEN('QSO DB'!F136))&IF(ISBLANK('QSO DB'!G136),REPT(\"X\",3),'QSO DB'!G136&REPT(\" \",3-LEN('QSO DB'!G136)))&\" \"&IF(ISBLANK('QSO DB'!H136),REPT(\"X\",4),'QSO DB'!H136)))","v":""}]
[{"$f":"IF(OR(LEFT(A151,3)=\"END\",A151=\"\"),\"\",IF(ISBLANK('QSO DB'!D137),\"END-OF-LOG:\",\"QSO:\"&'QSO DB'!D137&REPT(\" \",6-LEN('QSO DB'!D137))&\" \"&IF(ISBLANK('QSO DB'!E137),\"xx\",\"\")&UPPER('QSO DB'!E137)&\" \"&IF(ISBLANK('QSO DB'!I137),REPT(\"X\",10),YEAR('QSO DB'!I137)&\"-\"&IF(MONTH('QSO DB'!I137)<10,\"0\",\"\")&MONTH('QSO DB'!I137)&\"-\"&IF(DAY('QSO DB'!I137)<10,\"0\",\"\")&DAY('QSO DB'!I137))&\" \"&IF(ISBLANK('QSO DB'!J137),\"XXXX\",LEFT('QSO DB'!J137,4))&\" \"&UPPER('QSO DB'!K137)&REPT(\" \",14-LEN('QSO DB'!K137))&IF(ISBLANK('QSO DB'!L137),REPT(\"X\",3),'QSO DB'!L137&REPT(\" \",3-LEN('QSO DB'!L137)))&\" \"&IF(ISBLANK('QSO DB'!M137),REPT(\"X\",4),'QSO DB'!M137)&\"   \"&UPPER('QSO DB'!F137)&REPT(\" \",14-LEN('QSO DB'!F137))&IF(ISBLANK('QSO DB'!G137),REPT(\"X\",3),'QSO DB'!G137&REPT(\" \",3-LEN('QSO DB'!G137)))&\" \"&IF(ISBLANK('QSO DB'!H137),REPT(\"X\",4),'QSO DB'!H137)))","v":""}]
[{"$f":"IF(OR(LEFT(A152,3)=\"END\",A152=\"\"),\"\",IF(ISBLANK('QSO DB'!D138),\"END-OF-LOG:\",\"QSO:\"&'QSO DB'!D138&REPT(\" \",6-LEN('QSO DB'!D138))&\" \"&IF(ISBLANK('QSO DB'!E138),\"xx\",\"\")&UPPER('QSO DB'!E138)&\" \"&IF(ISBLANK('QSO DB'!I138),REPT(\"X\",10),YEAR('QSO DB'!I138)&\"-\"&IF(MONTH('QSO DB'!I138)<10,\"0\",\"\")&MONTH('QSO DB'!I138)&\"-\"&IF(DAY('QSO DB'!I138)<10,\"0\",\"\")&DAY('QSO DB'!I138))&\" \"&IF(ISBLANK('QSO DB'!J138),\"XXXX\",LEFT('QSO DB'!J138,4))&\" \"&UPPER('QSO DB'!K138)&REPT(\" \",14-LEN('QSO DB'!K138))&IF(ISBLANK('QSO DB'!L138),REPT(\"X\",3),'QSO DB'!L138&REPT(\" \",3-LEN('QSO DB'!L138)))&\" \"&IF(ISBLANK('QSO DB'!M138),REPT(\"X\",4),'QSO DB'!M138)&\"   \"&UPPER('QSO DB'!F138)&REPT(\" \",14-LEN('QSO DB'!F138))&IF(ISBLANK('QSO DB'!G138),REPT(\"X\",3),'QSO DB'!G138&REPT(\" \",3-LEN('QSO DB'!G138)))&\" \"&IF(ISBLANK('QSO DB'!H138),REPT(\"X\",4),'QSO DB'!H138)))","v":""}]
[{"$f":"IF(OR(LEFT(A153,3)=\"END\",A153=\"\"),\"\",IF(ISBLANK('QSO DB'!D139),\"END-OF-LOG:\",\"QSO:\"&'QSO DB'!D139&REPT(\" \",6-LEN('QSO DB'!D139))&\" \"&IF(ISBLANK('QSO DB'!E139),\"xx\",\"\")&UPPER('QSO DB'!E139)&\" \"&IF(ISBLANK('QSO DB'!I139),REPT(\"X\",10),YEAR('QSO DB'!I139)&\"-\"&IF(MONTH('QSO DB'!I139)<10,\"0\",\"\")&MONTH('QSO DB'!I139)&\"-\"&IF(DAY('QSO DB'!I139)<10,\"0\",\"\")&DAY('QSO DB'!I139))&\" \"&IF(ISBLANK('QSO DB'!J139),\"XXXX\",LEFT('QSO DB'!J139,4))&\" \"&UPPER('QSO DB'!K139)&REPT(\" \",14-LEN('QSO DB'!K139))&IF(ISBLANK('QSO DB'!L139),REPT(\"X\",3),'QSO DB'!L139&REPT(\" \",3-LEN('QSO DB'!L139)))&\" \"&IF(ISBLANK('QSO DB'!M139),REPT(\"X\",4),'QSO DB'!M139)&\"   \"&UPPER('QSO DB'!F139)&REPT(\" \",14-LEN('QSO DB'!F139))&IF(ISBLANK('QSO DB'!G139),REPT(\"X\",3),'QSO DB'!G139&REPT(\" \",3-LEN('QSO DB'!G139)))&\" \"&IF(ISBLANK('QSO DB'!H139),REPT(\"X\",4),'QSO DB'!H139)))","v":""}]
[{"$f":"IF(OR(LEFT(A154,3)=\"END\",A154=\"\"),\"\",IF(ISBLANK('QSO DB'!D140),\"END-OF-LOG:\",\"QSO:\"&'QSO DB'!D140&REPT(\" \",6-LEN('QSO DB'!D140))&\" \"&IF(ISBLANK('QSO DB'!E140),\"xx\",\"\")&UPPER('QSO DB'!E140)&\" \"&IF(ISBLANK('QSO DB'!I140),REPT(\"X\",10),YEAR('QSO DB'!I140)&\"-\"&IF(MONTH('QSO DB'!I140)<10,\"0\",\"\")&MONTH('QSO DB'!I140)&\"-\"&IF(DAY('QSO DB'!I140)<10,\"0\",\"\")&DAY('QSO DB'!I140))&\" \"&IF(ISBLANK('QSO DB'!J140),\"XXXX\",LEFT('QSO DB'!J140,4))&\" \"&UPPER('QSO DB'!K140)&REPT(\" \",14-LEN('QSO DB'!K140))&IF(ISBLANK('QSO DB'!L140),REPT(\"X\",3),'QSO DB'!L140&REPT(\" \",3-LEN('QSO DB'!L140)))&\" \"&IF(ISBLANK('QSO DB'!M140),REPT(\"X\",4),'QSO DB'!M140)&\"   \"&UPPER('QSO DB'!F140)&REPT(\" \",14-LEN('QSO DB'!F140))&IF(ISBLANK('QSO DB'!G140),REPT(\"X\",3),'QSO DB'!G140&REPT(\" \",3-LEN('QSO DB'!G140)))&\" \"&IF(ISBLANK('QSO DB'!H140),REPT(\"X\",4),'QSO DB'!H140)))","v":""}]
[{"$f":"IF(OR(LEFT(A155,3)=\"END\",A155=\"\"),\"\",IF(ISBLANK('QSO DB'!D141),\"END-OF-LOG:\",\"QSO:\"&'QSO DB'!D141&REPT(\" \",6-LEN('QSO DB'!D141))&\" \"&IF(ISBLANK('QSO DB'!E141),\"xx\",\"\")&UPPER('QSO DB'!E141)&\" \"&IF(ISBLANK('QSO DB'!I141),REPT(\"X\",10),YEAR('QSO DB'!I141)&\"-\"&IF(MONTH('QSO DB'!I141)<10,\"0\",\"\")&MONTH('QSO DB'!I141)&\"-\"&IF(DAY('QSO DB'!I141)<10,\"0\",\"\")&DAY('QSO DB'!I141))&\" \"&IF(ISBLANK('QSO DB'!J141),\"XXXX\",LEFT('QSO DB'!J141,4))&\" \"&UPPER('QSO DB'!K141)&REPT(\" \",14-LEN('QSO DB'!K141))&IF(ISBLANK('QSO DB'!L141),REPT(\"X\",3),'QSO DB'!L141&REPT(\" \",3-LEN('QSO DB'!L141)))&\" \"&IF(ISBLANK('QSO DB'!M141),REPT(\"X\",4),'QSO DB'!M141)&\"   \"&UPPER('QSO DB'!F141)&REPT(\" \",14-LEN('QSO DB'!F141))&IF(ISBLANK('QSO DB'!G141),REPT(\"X\",3),'QSO DB'!G141&REPT(\" \",3-LEN('QSO DB'!G141)))&\" \"&IF(ISBLANK('QSO DB'!H141),REPT(\"X\",4),'QSO DB'!H141)))","v":""}]
[{"$f":"IF(OR(LEFT(A156,3)=\"END\",A156=\"\"),\"\",IF(ISBLANK('QSO DB'!D142),\"END-OF-LOG:\",\"QSO:\"&'QSO DB'!D142&REPT(\" \",6-LEN('QSO DB'!D142))&\" \"&IF(ISBLANK('QSO DB'!E142),\"xx\",\"\")&UPPER('QSO DB'!E142)&\" \"&IF(ISBLANK('QSO DB'!I142),REPT(\"X\",10),YEAR('QSO DB'!I142)&\"-\"&IF(MONTH('QSO DB'!I142)<10,\"0\",\"\")&MONTH('QSO DB'!I142)&\"-\"&IF(DAY('QSO DB'!I142)<10,\"0\",\"\")&DAY('QSO DB'!I142))&\" \"&IF(ISBLANK('QSO DB'!J142),\"XXXX\",LEFT('QSO DB'!J142,4))&\" \"&UPPER('QSO DB'!K142)&REPT(\" \",14-LEN('QSO DB'!K142))&IF(ISBLANK('QSO DB'!L142),REPT(\"X\",3),'QSO DB'!L142&REPT(\" \",3-LEN('QSO DB'!L142)))&\" \"&IF(ISBLANK('QSO DB'!M142),REPT(\"X\",4),'QSO DB'!M142)&\"   \"&UPPER('QSO DB'!F142)&REPT(\" \",14-LEN('QSO DB'!F142))&IF(ISBLANK('QSO DB'!G142),REPT(\"X\",3),'QSO DB'!G142&REPT(\" \",3-LEN('QSO DB'!G142)))&\" \"&IF(ISBLANK('QSO DB'!H142),REPT(\"X\",4),'QSO DB'!H142)))","v":""}]
[{"$f":"IF(OR(LEFT(A157,3)=\"END\",A157=\"\"),\"\",IF(ISBLANK('QSO DB'!D143),\"END-OF-LOG:\",\"QSO:\"&'QSO DB'!D143&REPT(\" \",6-LEN('QSO DB'!D143))&\" \"&IF(ISBLANK('QSO DB'!E143),\"xx\",\"\")&UPPER('QSO DB'!E143)&\" \"&IF(ISBLANK('QSO DB'!I143),REPT(\"X\",10),YEAR('QSO DB'!I143)&\"-\"&IF(MONTH('QSO DB'!I143)<10,\"0\",\"\")&MONTH('QSO DB'!I143)&\"-\"&IF(DAY('QSO DB'!I143)<10,\"0\",\"\")&DAY('QSO DB'!I143))&\" \"&IF(ISBLANK('QSO DB'!J143),\"XXXX\",LEFT('QSO DB'!J143,4))&\" \"&UPPER('QSO DB'!K143)&REPT(\" \",14-LEN('QSO DB'!K143))&IF(ISBLANK('QSO DB'!L143),REPT(\"X\",3),'QSO DB'!L143&REPT(\" \",3-LEN('QSO DB'!L143)))&\" \"&IF(ISBLANK('QSO DB'!M143),REPT(\"X\",4),'QSO DB'!M143)&\"   \"&UPPER('QSO DB'!F143)&REPT(\" \",14-LEN('QSO DB'!F143))&IF(ISBLANK('QSO DB'!G143),REPT(\"X\",3),'QSO DB'!G143&REPT(\" \",3-LEN('QSO DB'!G143)))&\" \"&IF(ISBLANK('QSO DB'!H143),REPT(\"X\",4),'QSO DB'!H143)))","v":""}]
[{"$f":"IF(OR(LEFT(A158,3)=\"END\",A158=\"\"),\"\",IF(ISBLANK('QSO DB'!D144),\"END-OF-LOG:\",\"QSO:\"&'QSO DB'!D144&REPT(\" \",6-LEN('QSO DB'!D144))&\" \"&IF(ISBLANK('QSO DB'!E144),\"xx\",\"\")&UPPER('QSO DB'!E144)&\" \"&IF(ISBLANK('QSO DB'!I144),REPT(\"X\",10),YEAR('QSO DB'!I144)&\"-\"&IF(MONTH('QSO DB'!I144)<10,\"0\",\"\")&MONTH('QSO DB'!I144)&\"-\"&IF(DAY('QSO DB'!I144)<10,\"0\",\"\")&DAY('QSO DB'!I144))&\" \"&IF(ISBLANK('QSO DB'!J144),\"XXXX\",LEFT('QSO DB'!J144,4))&\" \"&UPPER('QSO DB'!K144)&REPT(\" \",14-LEN('QSO DB'!K144))&IF(ISBLANK('QSO DB'!L144),REPT(\"X\",3),'QSO DB'!L144&REPT(\" \",3-LEN('QSO DB'!L144)))&\" \"&IF(ISBLANK('QSO DB'!M144),REPT(\"X\",4),'QSO DB'!M144)&\"   \"&UPPER('QSO DB'!F144)&REPT(\" \",14-LEN('QSO DB'!F144))&IF(ISBLANK('QSO DB'!G144),REPT(\"X\",3),'QSO DB'!G144&REPT(\" \",3-LEN('QSO DB'!G144)))&\" \"&IF(ISBLANK('QSO DB'!H144),REPT(\"X\",4),'QSO DB'!H144)))","v":""}]
[{"$f":"IF(OR(LEFT(A159,3)=\"END\",A159=\"\"),\"\",IF(ISBLANK('QSO DB'!D145),\"END-OF-LOG:\",\"QSO:\"&'QSO DB'!D145&REPT(\" \",6-LEN('QSO DB'!D145))&\" \"&IF(ISBLANK('QSO DB'!E145),\"xx\",\"\")&UPPER('QSO DB'!E145)&\" \"&IF(ISBLANK('QSO DB'!I145),REPT(\"X\",10),YEAR('QSO DB'!I145)&\"-\"&IF(MONTH('QSO DB'!I145)<10,\"0\",\"\")&MONTH('QSO DB'!I145)&\"-\"&IF(DAY('QSO DB'!I145)<10,\"0\",\"\")&DAY('QSO DB'!I145))&\" \"&IF(ISBLANK('QSO DB'!J145),\"XXXX\",LEFT('QSO DB'!J145,4))&\" \"&UPPER('QSO DB'!K145)&REPT(\" \",14-LEN('QSO DB'!K145))&IF(ISBLANK('QSO DB'!L145),REPT(\"X\",3),'QSO DB'!L145&REPT(\" \",3-LEN('QSO DB'!L145)))&\" \"&IF(ISBLANK('QSO DB'!M145),REPT(\"X\",4),'QSO DB'!M145)&\"   \"&UPPER('QSO DB'!F145)&REPT(\" \",14-LEN('QSO DB'!F145))&IF(ISBLANK('QSO DB'!G145),REPT(\"X\",3),'QSO DB'!G145&REPT(\" \",3-LEN('QSO DB'!G145)))&\" \"&IF(ISBLANK('QSO DB'!H145),REPT(\"X\",4),'QSO DB'!H145)))","v":""}]
[{"$f":"IF(OR(LEFT(A160,3)=\"END\",A160=\"\"),\"\",IF(ISBLANK('QSO DB'!D146),\"END-OF-LOG:\",\"QSO:\"&'QSO DB'!D146&REPT(\" \",6-LEN('QSO DB'!D146))&\" \"&IF(ISBLANK('QSO DB'!E146),\"xx\",\"\")&UPPER('QSO DB'!E146)&\" \"&IF(ISBLANK('QSO DB'!I146),REPT(\"X\",10),YEAR('QSO DB'!I146)&\"-\"&IF(MONTH('QSO DB'!I146)<10,\"0\",\"\")&MONTH('QSO DB'!I146)&\"-\"&IF(DAY('QSO DB'!I146)<10,\"0\",\"\")&DAY('QSO DB'!I146))&\" \"&IF(ISBLANK('QSO DB'!J146),\"XXXX\",LEFT('QSO DB'!J146,4))&\" \"&UPPER('QSO DB'!K146)&REPT(\" \",14-LEN('QSO DB'!K146))&IF(ISBLANK('QSO DB'!L146),REPT(\"X\",3),'QSO DB'!L146&REPT(\" \",3-LEN('QSO DB'!L146)))&\" \"&IF(ISBLANK('QSO DB'!M146),REPT(\"X\",4),'QSO DB'!M146)&\"   \"&UPPER('QSO DB'!F146)&REPT(\" \",14-LEN('QSO DB'!F146))&IF(ISBLANK('QSO DB'!G146),REPT(\"X\",3),'QSO DB'!G146&REPT(\" \",3-LEN('QSO DB'!G146)))&\" \"&IF(ISBLANK('QSO DB'!H146),REPT(\"X\",4),'QSO DB'!H146)))","v":""}]
[{"$f":"IF(OR(LEFT(A161,3)=\"END\",A161=\"\"),\"\",IF(ISBLANK('QSO DB'!D147),\"END-OF-LOG:\",\"QSO:\"&'QSO DB'!D147&REPT(\" \",6-LEN('QSO DB'!D147))&\" \"&IF(ISBLANK('QSO DB'!E147),\"xx\",\"\")&UPPER('QSO DB'!E147)&\" \"&IF(ISBLANK('QSO DB'!I147),REPT(\"X\",10),YEAR('QSO DB'!I147)&\"-\"&IF(MONTH('QSO DB'!I147)<10,\"0\",\"\")&MONTH('QSO DB'!I147)&\"-\"&IF(DAY('QSO DB'!I147)<10,\"0\",\"\")&DAY('QSO DB'!I147))&\" \"&IF(ISBLANK('QSO DB'!J147),\"XXXX\",LEFT('QSO DB'!J147,4))&\" \"&UPPER('QSO DB'!K147)&REPT(\" \",14-LEN('QSO DB'!K147))&IF(ISBLANK('QSO DB'!L147),REPT(\"X\",3),'QSO DB'!L147&REPT(\" \",3-LEN('QSO DB'!L147)))&\" \"&IF(ISBLANK('QSO DB'!M147),REPT(\"X\",4),'QSO DB'!M147)&\"   \"&UPPER('QSO DB'!F147)&REPT(\" \",14-LEN('QSO DB'!F147))&IF(ISBLANK('QSO DB'!G147),REPT(\"X\",3),'QSO DB'!G147&REPT(\" \",3-LEN('QSO DB'!G147)))&\" \"&IF(ISBLANK('QSO DB'!H147),REPT(\"X\",4),'QSO DB'!H147)))","v":""}]
[{"$f":"IF(OR(LEFT(A162,3)=\"END\",A162=\"\"),\"\",IF(ISBLANK('QSO DB'!D148),\"END-OF-LOG:\",\"QSO:\"&'QSO DB'!D148&REPT(\" \",6-LEN('QSO DB'!D148))&\" \"&IF(ISBLANK('QSO DB'!E148),\"xx\",\"\")&UPPER('QSO DB'!E148)&\" \"&IF(ISBLANK('QSO DB'!I148),REPT(\"X\",10),YEAR('QSO DB'!I148)&\"-\"&IF(MONTH('QSO DB'!I148)<10,\"0\",\"\")&MONTH('QSO DB'!I148)&\"-\"&IF(DAY('QSO DB'!I148)<10,\"0\",\"\")&DAY('QSO DB'!I148))&\" \"&IF(ISBLANK('QSO DB'!J148),\"XXXX\",LEFT('QSO DB'!J148,4))&\" \"&UPPER('QSO DB'!K148)&REPT(\" \",14-LEN('QSO DB'!K148))&IF(ISBLANK('QSO DB'!L148),REPT(\"X\",3),'QSO DB'!L148&REPT(\" \",3-LEN('QSO DB'!L148)))&\" \"&IF(ISBLANK('QSO DB'!M148),REPT(\"X\",4),'QSO DB'!M148)&\"   \"&UPPER('QSO DB'!F148)&REPT(\" \",14-LEN('QSO DB'!F148))&IF(ISBLANK('QSO DB'!G148),REPT(\"X\",3),'QSO DB'!G148&REPT(\" \",3-LEN('QSO DB'!G148)))&\" \"&IF(ISBLANK('QSO DB'!H148),REPT(\"X\",4),'QSO DB'!H148)))","v":""}]
[{"$f":"IF(OR(LEFT(A163,3)=\"END\",A163=\"\"),\"\",IF(ISBLANK('QSO DB'!D149),\"END-OF-LOG:\",\"QSO:\"&'QSO DB'!D149&REPT(\" \",6-LEN('QSO DB'!D149))&\" \"&IF(ISBLANK('QSO DB'!E149),\"xx\",\"\")&UPPER('QSO DB'!E149)&\" \"&IF(ISBLANK('QSO DB'!I149),REPT(\"X\",10),YEAR('QSO DB'!I149)&\"-\"&IF(MONTH('QSO DB'!I149)<10,\"0\",\"\")&MONTH('QSO DB'!I149)&\"-\"&IF(DAY('QSO DB'!I149)<10,\"0\",\"\")&DAY('QSO DB'!I149))&\" \"&IF(ISBLANK('QSO DB'!J149),\"XXXX\",LEFT('QSO DB'!J149,4))&\" \"&UPPER('QSO DB'!K149)&REPT(\" \",14-LEN('QSO DB'!K149))&IF(ISBLANK('QSO DB'!L149),REPT(\"X\",3),'QSO DB'!L149&REPT(\" \",3-LEN('QSO DB'!L149)))&\" \"&IF(ISBLANK('QSO DB'!M149),REPT(\"X\",4),'QSO DB'!M149)&\"   \"&UPPER('QSO DB'!F149)&REPT(\" \",14-LEN('QSO DB'!F149))&IF(ISBLANK('QSO DB'!G149),REPT(\"X\",3),'QSO DB'!G149&REPT(\" \",3-LEN('QSO DB'!G149)))&\" \"&IF(ISBLANK('QSO DB'!H149),REPT(\"X\",4),'QSO DB'!H149)))","v":""}]
[{"$f":"IF(OR(LEFT(A164,3)=\"END\",A164=\"\"),\"\",IF(ISBLANK('QSO DB'!D150),\"END-OF-LOG:\",\"QSO:\"&'QSO DB'!D150&REPT(\" \",6-LEN('QSO DB'!D150))&\" \"&IF(ISBLANK('QSO DB'!E150),\"xx\",\"\")&UPPER('QSO DB'!E150)&\" \"&IF(ISBLANK('QSO DB'!I150),REPT(\"X\",10),YEAR('QSO DB'!I150)&\"-\"&IF(MONTH('QSO DB'!I150)<10,\"0\",\"\")&MONTH('QSO DB'!I150)&\"-\"&IF(DAY('QSO DB'!I150)<10,\"0\",\"\")&DAY('QSO DB'!I150))&\" \"&IF(ISBLANK('QSO DB'!J150),\"XXXX\",LEFT('QSO DB'!J150,4))&\" \"&UPPER('QSO DB'!K150)&REPT(\" \",14-LEN('QSO DB'!K150))&IF(ISBLANK('QSO DB'!L150),REPT(\"X\",3),'QSO DB'!L150&REPT(\" \",3-LEN('QSO DB'!L150)))&\" \"&IF(ISBLANK('QSO DB'!M150),REPT(\"X\",4),'QSO DB'!M150)&\"   \"&UPPER('QSO DB'!F150)&REPT(\" \",14-LEN('QSO DB'!F150))&IF(ISBLANK('QSO DB'!G150),REPT(\"X\",3),'QSO DB'!G150&REPT(\" \",3-LEN('QSO DB'!G150)))&\" \"&IF(ISBLANK('QSO DB'!H150),REPT(\"X\",4),'QSO DB'!H150)))","v":""}]
[{"$f":"IF(OR(LEFT(A165,3)=\"END\",A165=\"\"),\"\",IF(ISBLANK('QSO DB'!D151),\"END-OF-LOG:\",\"QSO:\"&'QSO DB'!D151&REPT(\" \",6-LEN('QSO DB'!D151))&\" \"&IF(ISBLANK('QSO DB'!E151),\"xx\",\"\")&UPPER('QSO DB'!E151)&\" \"&IF(ISBLANK('QSO DB'!I151),REPT(\"X\",10),YEAR('QSO DB'!I151)&\"-\"&IF(MONTH('QSO DB'!I151)<10,\"0\",\"\")&MONTH('QSO DB'!I151)&\"-\"&IF(DAY('QSO DB'!I151)<10,\"0\",\"\")&DAY('QSO DB'!I151))&\" \"&IF(ISBLANK('QSO DB'!J151),\"XXXX\",LEFT('QSO DB'!J151,4))&\" \"&UPPER('QSO DB'!K151)&REPT(\" \",14-LEN('QSO DB'!K151))&IF(ISBLANK('QSO DB'!L151),REPT(\"X\",3),'QSO DB'!L151&REPT(\" \",3-LEN('QSO DB'!L151)))&\" \"&IF(ISBLANK('QSO DB'!M151),REPT(\"X\",4),'QSO DB'!M151)&\"   \"&UPPER('QSO DB'!F151)&REPT(\" \",14-LEN('QSO DB'!F151))&IF(ISBLANK('QSO DB'!G151),REPT(\"X\",3),'QSO DB'!G151&REPT(\" \",3-LEN('QSO DB'!G151)))&\" \"&IF(ISBLANK('QSO DB'!H151),REPT(\"X\",4),'QSO DB'!H151)))","v":""}]
[{"$f":"IF(OR(LEFT(A166,3)=\"END\",A166=\"\"),\"\",IF(ISBLANK('QSO DB'!D152),\"END-OF-LOG:\",\"QSO:\"&'QSO DB'!D152&REPT(\" \",6-LEN('QSO DB'!D152))&\" \"&IF(ISBLANK('QSO DB'!E152),\"xx\",\"\")&UPPER('QSO DB'!E152)&\" \"&IF(ISBLANK('QSO DB'!I152),REPT(\"X\",10),YEAR('QSO DB'!I152)&\"-\"&IF(MONTH('QSO DB'!I152)<10,\"0\",\"\")&MONTH('QSO DB'!I152)&\"-\"&IF(DAY('QSO DB'!I152)<10,\"0\",\"\")&DAY('QSO DB'!I152))&\" \"&IF(ISBLANK('QSO DB'!J152),\"XXXX\",LEFT('QSO DB'!J152,4))&\" \"&UPPER('QSO DB'!K152)&REPT(\" \",14-LEN('QSO DB'!K152))&IF(ISBLANK('QSO DB'!L152),REPT(\"X\",3),'QSO DB'!L152&REPT(\" \",3-LEN('QSO DB'!L152)))&\" \"&IF(ISBLANK('QSO DB'!M152),REPT(\"X\",4),'QSO DB'!M152)&\"   \"&UPPER('QSO DB'!F152)&REPT(\" \",14-LEN('QSO DB'!F152))&IF(ISBLANK('QSO DB'!G152),REPT(\"X\",3),'QSO DB'!G152&REPT(\" \",3-LEN('QSO DB'!G152)))&\" \"&IF(ISBLANK('QSO DB'!H152),REPT(\"X\",4),'QSO DB'!H152)))","v":""}]
[{"$f":"IF(OR(LEFT(A167,3)=\"END\",A167=\"\"),\"\",IF(ISBLANK('QSO DB'!D153),\"END-OF-LOG:\",\"QSO:\"&'QSO DB'!D153&REPT(\" \",6-LEN('QSO DB'!D153))&\" \"&IF(ISBLANK('QSO DB'!E153),\"xx\",\"\")&UPPER('QSO DB'!E153)&\" \"&IF(ISBLANK('QSO DB'!I153),REPT(\"X\",10),YEAR('QSO DB'!I153)&\"-\"&IF(MONTH('QSO DB'!I153)<10,\"0\",\"\")&MONTH('QSO DB'!I153)&\"-\"&IF(DAY('QSO DB'!I153)<10,\"0\",\"\")&DAY('QSO DB'!I153))&\" \"&IF(ISBLANK('QSO DB'!J153),\"XXXX\",LEFT('QSO DB'!J153,4))&\" \"&UPPER('QSO DB'!K153)&REPT(\" \",14-LEN('QSO DB'!K153))&IF(ISBLANK('QSO DB'!L153),REPT(\"X\",3),'QSO DB'!L153&REPT(\" \",3-LEN('QSO DB'!L153)))&\" \"&IF(ISBLANK('QSO DB'!M153),REPT(\"X\",4),'QSO DB'!M153)&\"   \"&UPPER('QSO DB'!F153)&REPT(\" \",14-LEN('QSO DB'!F153))&IF(ISBLANK('QSO DB'!G153),REPT(\"X\",3),'QSO DB'!G153&REPT(\" \",3-LEN('QSO DB'!G153)))&\" \"&IF(ISBLANK('QSO DB'!H153),REPT(\"X\",4),'QSO DB'!H153)))","v":""}]
[{"$f":"IF(OR(LEFT(A168,3)=\"END\",A168=\"\"),\"\",IF(ISBLANK('QSO DB'!D154),\"END-OF-LOG:\",\"QSO:\"&'QSO DB'!D154&REPT(\" \",6-LEN('QSO DB'!D154))&\" \"&IF(ISBLANK('QSO DB'!E154),\"xx\",\"\")&UPPER('QSO DB'!E154)&\" \"&IF(ISBLANK('QSO DB'!I154),REPT(\"X\",10),YEAR('QSO DB'!I154)&\"-\"&IF(MONTH('QSO DB'!I154)<10,\"0\",\"\")&MONTH('QSO DB'!I154)&\"-\"&IF(DAY('QSO DB'!I154)<10,\"0\",\"\")&DAY('QSO DB'!I154))&\" \"&IF(ISBLANK('QSO DB'!J154),\"XXXX\",LEFT('QSO DB'!J154,4))&\" \"&UPPER('QSO DB'!K154)&REPT(\" \",14-LEN('QSO DB'!K154))&IF(ISBLANK('QSO DB'!L154),REPT(\"X\",3),'QSO DB'!L154&REPT(\" \",3-LEN('QSO DB'!L154)))&\" \"&IF(ISBLANK('QSO DB'!M154),REPT(\"X\",4),'QSO DB'!M154)&\"   \"&UPPER('QSO DB'!F154)&REPT(\" \",14-LEN('QSO DB'!F154))&IF(ISBLANK('QSO DB'!G154),REPT(\"X\",3),'QSO DB'!G154&REPT(\" \",3-LEN('QSO DB'!G154)))&\" \"&IF(ISBLANK('QSO DB'!H154),REPT(\"X\",4),'QSO DB'!H154)))","v":""}]
[{"$f":"IF(OR(LEFT(A169,3)=\"END\",A169=\"\"),\"\",IF(ISBLANK('QSO DB'!D155),\"END-OF-LOG:\",\"QSO:\"&'QSO DB'!D155&REPT(\" \",6-LEN('QSO DB'!D155))&\" \"&IF(ISBLANK('QSO DB'!E155),\"xx\",\"\")&UPPER('QSO DB'!E155)&\" \"&IF(ISBLANK('QSO DB'!I155),REPT(\"X\",10),YEAR('QSO DB'!I155)&\"-\"&IF(MONTH('QSO DB'!I155)<10,\"0\",\"\")&MONTH('QSO DB'!I155)&\"-\"&IF(DAY('QSO DB'!I155)<10,\"0\",\"\")&DAY('QSO DB'!I155))&\" \"&IF(ISBLANK('QSO DB'!J155),\"XXXX\",LEFT('QSO DB'!J155,4))&\" \"&UPPER('QSO DB'!K155)&REPT(\" \",14-LEN('QSO DB'!K155))&IF(ISBLANK('QSO DB'!L155),REPT(\"X\",3),'QSO DB'!L155&REPT(\" \",3-LEN('QSO DB'!L155)))&\" \"&IF(ISBLANK('QSO DB'!M155),REPT(\"X\",4),'QSO DB'!M155)&\"   \"&UPPER('QSO DB'!F155)&REPT(\" \",14-LEN('QSO DB'!F155))&IF(ISBLANK('QSO DB'!G155),REPT(\"X\",3),'QSO DB'!G155&REPT(\" \",3-LEN('QSO DB'!G155)))&\" \"&IF(ISBLANK('QSO DB'!H155),REPT(\"X\",4),'QSO DB'!H155)))","v":""}]
[{"$f":"IF(OR(LEFT(A170,3)=\"END\",A170=\"\"),\"\",IF(ISBLANK('QSO DB'!D156),\"END-OF-LOG:\",\"QSO:\"&'QSO DB'!D156&REPT(\" \",6-LEN('QSO DB'!D156))&\" \"&IF(ISBLANK('QSO DB'!E156),\"xx\",\"\")&UPPER('QSO DB'!E156)&\" \"&IF(ISBLANK('QSO DB'!I156),REPT(\"X\",10),YEAR('QSO DB'!I156)&\"-\"&IF(MONTH('QSO DB'!I156)<10,\"0\",\"\")&MONTH('QSO DB'!I156)&\"-\"&IF(DAY('QSO DB'!I156)<10,\"0\",\"\")&DAY('QSO DB'!I156))&\" \"&IF(ISBLANK('QSO DB'!J156),\"XXXX\",LEFT('QSO DB'!J156,4))&\" \"&UPPER('QSO DB'!K156)&REPT(\" \",14-LEN('QSO DB'!K156))&IF(ISBLANK('QSO DB'!L156),REPT(\"X\",3),'QSO DB'!L156&REPT(\" \",3-LEN('QSO DB'!L156)))&\" \"&IF(ISBLANK('QSO DB'!M156),REPT(\"X\",4),'QSO DB'!M156)&\"   \"&UPPER('QSO DB'!F156)&REPT(\" \",14-LEN('QSO DB'!F156))&IF(ISBLANK('QSO DB'!G156),REPT(\"X\",3),'QSO DB'!G156&REPT(\" \",3-LEN('QSO DB'!G156)))&\" \"&IF(ISBLANK('QSO DB'!H156),REPT(\"X\",4),'QSO DB'!H156)))","v":""}]
[{"$f":"IF(OR(LEFT(A171,3)=\"END\",A171=\"\"),\"\",IF(ISBLANK('QSO DB'!D157),\"END-OF-LOG:\",\"QSO:\"&'QSO DB'!D157&REPT(\" \",6-LEN('QSO DB'!D157))&\" \"&IF(ISBLANK('QSO DB'!E157),\"xx\",\"\")&UPPER('QSO DB'!E157)&\" \"&IF(ISBLANK('QSO DB'!I157),REPT(\"X\",10),YEAR('QSO DB'!I157)&\"-\"&IF(MONTH('QSO DB'!I157)<10,\"0\",\"\")&MONTH('QSO DB'!I157)&\"-\"&IF(DAY('QSO DB'!I157)<10,\"0\",\"\")&DAY('QSO DB'!I157))&\" \"&IF(ISBLANK('QSO DB'!J157),\"XXXX\",LEFT('QSO DB'!J157,4))&\" \"&UPPER('QSO DB'!K157)&REPT(\" \",14-LEN('QSO DB'!K157))&IF(ISBLANK('QSO DB'!L157),REPT(\"X\",3),'QSO DB'!L157&REPT(\" \",3-LEN('QSO DB'!L157)))&\" \"&IF(ISBLANK('QSO DB'!M157),REPT(\"X\",4),'QSO DB'!M157)&\"   \"&UPPER('QSO DB'!F157)&REPT(\" \",14-LEN('QSO DB'!F157))&IF(ISBLANK('QSO DB'!G157),REPT(\"X\",3),'QSO DB'!G157&REPT(\" \",3-LEN('QSO DB'!G157)))&\" \"&IF(ISBLANK('QSO DB'!H157),REPT(\"X\",4),'QSO DB'!H157)))","v":""}]
[{"$f":"IF(OR(LEFT(A172,3)=\"END\",A172=\"\"),\"\",IF(ISBLANK('QSO DB'!D158),\"END-OF-LOG:\",\"QSO:\"&'QSO DB'!D158&REPT(\" \",6-LEN('QSO DB'!D158))&\" \"&IF(ISBLANK('QSO DB'!E158),\"xx\",\"\")&UPPER('QSO DB'!E158)&\" \"&IF(ISBLANK('QSO DB'!I158),REPT(\"X\",10),YEAR('QSO DB'!I158)&\"-\"&IF(MONTH('QSO DB'!I158)<10,\"0\",\"\")&MONTH('QSO DB'!I158)&\"-\"&IF(DAY('QSO DB'!I158)<10,\"0\",\"\")&DAY('QSO DB'!I158))&\" \"&IF(ISBLANK('QSO DB'!J158),\"XXXX\",LEFT('QSO DB'!J158,4))&\" \"&UPPER('QSO DB'!K158)&REPT(\" \",14-LEN('QSO DB'!K158))&IF(ISBLANK('QSO DB'!L158),REPT(\"X\",3),'QSO DB'!L158&REPT(\" \",3-LEN('QSO DB'!L158)))&\" \"&IF(ISBLANK('QSO DB'!M158),REPT(\"X\",4),'QSO DB'!M158)&\"   \"&UPPER('QSO DB'!F158)&REPT(\" \",14-LEN('QSO DB'!F158))&IF(ISBLANK('QSO DB'!G158),REPT(\"X\",3),'QSO DB'!G158&REPT(\" \",3-LEN('QSO DB'!G158)))&\" \"&IF(ISBLANK('QSO DB'!H158),REPT(\"X\",4),'QSO DB'!H158)))","v":""}]
[{"$f":"IF(OR(LEFT(A173,3)=\"END\",A173=\"\"),\"\",IF(ISBLANK('QSO DB'!D159),\"END-OF-LOG:\",\"QSO:\"&'QSO DB'!D159&REPT(\" \",6-LEN('QSO DB'!D159))&\" \"&IF(ISBLANK('QSO DB'!E159),\"xx\",\"\")&UPPER('QSO DB'!E159)&\" \"&IF(ISBLANK('QSO DB'!I159),REPT(\"X\",10),YEAR('QSO DB'!I159)&\"-\"&IF(MONTH('QSO DB'!I159)<10,\"0\",\"\")&MONTH('QSO DB'!I159)&\"-\"&IF(DAY('QSO DB'!I159)<10,\"0\",\"\")&DAY('QSO DB'!I159))&\" \"&IF(ISBLANK('QSO DB'!J159),\"XXXX\",LEFT('QSO DB'!J159,4))&\" \"&UPPER('QSO DB'!K159)&REPT(\" \",14-LEN('QSO DB'!K159))&IF(ISBLANK('QSO DB'!L159),REPT(\"X\",3),'QSO DB'!L159&REPT(\" \",3-LEN('QSO DB'!L159)))&\" \"&IF(ISBLANK('QSO DB'!M159),REPT(\"X\",4),'QSO DB'!M159)&\"   \"&UPPER('QSO DB'!F159)&REPT(\" \",14-LEN('QSO DB'!F159))&IF(ISBLANK('QSO DB'!G159),REPT(\"X\",3),'QSO DB'!G159&REPT(\" \",3-LEN('QSO DB'!G159)))&\" \"&IF(ISBLANK('QSO DB'!H159),REPT(\"X\",4),'QSO DB'!H159)))","v":""}]
[{"$f":"IF(OR(LEFT(A174,3)=\"END\",A174=\"\"),\"\",IF(ISBLANK('QSO DB'!D160),\"END-OF-LOG:\",\"QSO:\"&'QSO DB'!D160&REPT(\" \",6-LEN('QSO DB'!D160))&\" \"&IF(ISBLANK('QSO DB'!E160),\"xx\",\"\")&UPPER('QSO DB'!E160)&\" \"&IF(ISBLANK('QSO DB'!I160),REPT(\"X\",10),YEAR('QSO DB'!I160)&\"-\"&IF(MONTH('QSO DB'!I160)<10,\"0\",\"\")&MONTH('QSO DB'!I160)&\"-\"&IF(DAY('QSO DB'!I160)<10,\"0\",\"\")&DAY('QSO DB'!I160))&\" \"&IF(ISBLANK('QSO DB'!J160),\"XXXX\",LEFT('QSO DB'!J160,4))&\" \"&UPPER('QSO DB'!K160)&REPT(\" \",14-LEN('QSO DB'!K160))&IF(ISBLANK('QSO DB'!L160),REPT(\"X\",3),'QSO DB'!L160&REPT(\" \",3-LEN('QSO DB'!L160)))&\" \"&IF(ISBLANK('QSO DB'!M160),REPT(\"X\",4),'QSO DB'!M160)&\"   \"&UPPER('QSO DB'!F160)&REPT(\" \",14-LEN('QSO DB'!F160))&IF(ISBLANK('QSO DB'!G160),REPT(\"X\",3),'QSO DB'!G160&REPT(\" \",3-LEN('QSO DB'!G160)))&\" \"&IF(ISBLANK('QSO DB'!H160),REPT(\"X\",4),'QSO DB'!H160)))","v":""}]
[{"$f":"IF(OR(LEFT(A175,3)=\"END\",A175=\"\"),\"\",IF(ISBLANK('QSO DB'!D161),\"END-OF-LOG:\",\"QSO:\"&'QSO DB'!D161&REPT(\" \",6-LEN('QSO DB'!D161))&\" \"&IF(ISBLANK('QSO DB'!E161),\"xx\",\"\")&UPPER('QSO DB'!E161)&\" \"&IF(ISBLANK('QSO DB'!I161),REPT(\"X\",10),YEAR('QSO DB'!I161)&\"-\"&IF(MONTH('QSO DB'!I161)<10,\"0\",\"\")&MONTH('QSO DB'!I161)&\"-\"&IF(DAY('QSO DB'!I161)<10,\"0\",\"\")&DAY('QSO DB'!I161))&\" \"&IF(ISBLANK('QSO DB'!J161),\"XXXX\",LEFT('QSO DB'!J161,4))&\" \"&UPPER('QSO DB'!K161)&REPT(\" \",14-LEN('QSO DB'!K161))&IF(ISBLANK('QSO DB'!L161),REPT(\"X\",3),'QSO DB'!L161&REPT(\" \",3-LEN('QSO DB'!L161)))&\" \"&IF(ISBLANK('QSO DB'!M161),REPT(\"X\",4),'QSO DB'!M161)&\"   \"&UPPER('QSO DB'!F161)&REPT(\" \",14-LEN('QSO DB'!F161))&IF(ISBLANK('QSO DB'!G161),REPT(\"X\",3),'QSO DB'!G161&REPT(\" \",3-LEN('QSO DB'!G161)))&\" \"&IF(ISBLANK('QSO DB'!H161),REPT(\"X\",4),'QSO DB'!H161)))","v":""}]
[{"$f":"IF(OR(LEFT(A176,3)=\"END\",A176=\"\"),\"\",IF(ISBLANK('QSO DB'!D162),\"END-OF-LOG:\",\"QSO:\"&'QSO DB'!D162&REPT(\" \",6-LEN('QSO DB'!D162))&\" \"&IF(ISBLANK('QSO DB'!E162),\"xx\",\"\")&UPPER('QSO DB'!E162)&\" \"&IF(ISBLANK('QSO DB'!I162),REPT(\"X\",10),YEAR('QSO DB'!I162)&\"-\"&IF(MONTH('QSO DB'!I162)<10,\"0\",\"\")&MONTH('QSO DB'!I162)&\"-\"&IF(DAY('QSO DB'!I162)<10,\"0\",\"\")&DAY('QSO DB'!I162))&\" \"&IF(ISBLANK('QSO DB'!J162),\"XXXX\",LEFT('QSO DB'!J162,4))&\" \"&UPPER('QSO DB'!K162)&REPT(\" \",14-LEN('QSO DB'!K162))&IF(ISBLANK('QSO DB'!L162),REPT(\"X\",3),'QSO DB'!L162&REPT(\" \",3-LEN('QSO DB'!L162)))&\" \"&IF(ISBLANK('QSO DB'!M162),REPT(\"X\",4),'QSO DB'!M162)&\"   \"&UPPER('QSO DB'!F162)&REPT(\" \",14-LEN('QSO DB'!F162))&IF(ISBLANK('QSO DB'!G162),REPT(\"X\",3),'QSO DB'!G162&REPT(\" \",3-LEN('QSO DB'!G162)))&\" \"&IF(ISBLANK('QSO DB'!H162),REPT(\"X\",4),'QSO DB'!H162)))","v":""}]
[{"$f":"IF(OR(LEFT(A177,3)=\"END\",A177=\"\"),\"\",IF(ISBLANK('QSO DB'!D163),\"END-OF-LOG:\",\"QSO:\"&'QSO DB'!D163&REPT(\" \",6-LEN('QSO DB'!D163))&\" \"&IF(ISBLANK('QSO DB'!E163),\"xx\",\"\")&UPPER('QSO DB'!E163)&\" \"&IF(ISBLANK('QSO DB'!I163),REPT(\"X\",10),YEAR('QSO DB'!I163)&\"-\"&IF(MONTH('QSO DB'!I163)<10,\"0\",\"\")&MONTH('QSO DB'!I163)&\"-\"&IF(DAY('QSO DB'!I163)<10,\"0\",\"\")&DAY('QSO DB'!I163))&\" \"&IF(ISBLANK('QSO DB'!J163),\"XXXX\",LEFT('QSO DB'!J163,4))&\" \"&UPPER('QSO DB'!K163)&REPT(\" \",14-LEN('QSO DB'!K163))&IF(ISBLANK('QSO DB'!L163),REPT(\"X\",3),'QSO DB'!L163&REPT(\" \",3-LEN('QSO DB'!L163)))&\" \"&IF(ISBLANK('QSO DB'!M163),REPT(\"X\",4),'QSO DB'!M163)&\"   \"&UPPER('QSO DB'!F163)&REPT(\" \",14-LEN('QSO DB'!F163))&IF(ISBLANK('QSO DB'!G163),REPT(\"X\",3),'QSO DB'!G163&REPT(\" \",3-LEN('QSO DB'!G163)))&\" \"&IF(ISBLANK('QSO DB'!H163),REPT(\"X\",4),'QSO DB'!H163)))","v":""}]
[{"$f":"IF(OR(LEFT(A178,3)=\"END\",A178=\"\"),\"\",IF(ISBLANK('QSO DB'!D164),\"END-OF-LOG:\",\"QSO:\"&'QSO DB'!D164&REPT(\" \",6-LEN('QSO DB'!D164))&\" \"&IF(ISBLANK('QSO DB'!E164),\"xx\",\"\")&UPPER('QSO DB'!E164)&\" \"&IF(ISBLANK('QSO DB'!I164),REPT(\"X\",10),YEAR('QSO DB'!I164)&\"-\"&IF(MONTH('QSO DB'!I164)<10,\"0\",\"\")&MONTH('QSO DB'!I164)&\"-\"&IF(DAY('QSO DB'!I164)<10,\"0\",\"\")&DAY('QSO DB'!I164))&\" \"&IF(ISBLANK('QSO DB'!J164),\"XXXX\",LEFT('QSO DB'!J164,4))&\" \"&UPPER('QSO DB'!K164)&REPT(\" \",14-LEN('QSO DB'!K164))&IF(ISBLANK('QSO DB'!L164),REPT(\"X\",3),'QSO DB'!L164&REPT(\" \",3-LEN('QSO DB'!L164)))&\" \"&IF(ISBLANK('QSO DB'!M164),REPT(\"X\",4),'QSO DB'!M164)&\"   \"&UPPER('QSO DB'!F164)&REPT(\" \",14-LEN('QSO DB'!F164))&IF(ISBLANK('QSO DB'!G164),REPT(\"X\",3),'QSO DB'!G164&REPT(\" \",3-LEN('QSO DB'!G164)))&\" \"&IF(ISBLANK('QSO DB'!H164),REPT(\"X\",4),'QSO DB'!H164)))","v":""}]
[{"$f":"IF(OR(LEFT(A179,3)=\"END\",A179=\"\"),\"\",IF(ISBLANK('QSO DB'!D165),\"END-OF-LOG:\",\"QSO:\"&'QSO DB'!D165&REPT(\" \",6-LEN('QSO DB'!D165))&\" \"&IF(ISBLANK('QSO DB'!E165),\"xx\",\"\")&UPPER('QSO DB'!E165)&\" \"&IF(ISBLANK('QSO DB'!I165),REPT(\"X\",10),YEAR('QSO DB'!I165)&\"-\"&IF(MONTH('QSO DB'!I165)<10,\"0\",\"\")&MONTH('QSO DB'!I165)&\"-\"&IF(DAY('QSO DB'!I165)<10,\"0\",\"\")&DAY('QSO DB'!I165))&\" \"&IF(ISBLANK('QSO DB'!J165),\"XXXX\",LEFT('QSO DB'!J165,4))&\" \"&UPPER('QSO DB'!K165)&REPT(\" \",14-LEN('QSO DB'!K165))&IF(ISBLANK('QSO DB'!L165),REPT(\"X\",3),'QSO DB'!L165&REPT(\" \",3-LEN('QSO DB'!L165)))&\" \"&IF(ISBLANK('QSO DB'!M165),REPT(\"X\",4),'QSO DB'!M165)&\"   \"&UPPER('QSO DB'!F165)&REPT(\" \",14-LEN('QSO DB'!F165))&IF(ISBLANK('QSO DB'!G165),REPT(\"X\",3),'QSO DB'!G165&REPT(\" \",3-LEN('QSO DB'!G165)))&\" \"&IF(ISBLANK('QSO DB'!H165),REPT(\"X\",4),'QSO DB'!H165)))","v":""}]
[{"$f":"IF(OR(LEFT(A180,3)=\"END\",A180=\"\"),\"\",IF(ISBLANK('QSO DB'!D166),\"END-OF-LOG:\",\"QSO:\"&'QSO DB'!D166&REPT(\" \",6-LEN('QSO DB'!D166))&\" \"&IF(ISBLANK('QSO DB'!E166),\"xx\",\"\")&UPPER('QSO DB'!E166)&\" \"&IF(ISBLANK('QSO DB'!I166),REPT(\"X\",10),YEAR('QSO DB'!I166)&\"-\"&IF(MONTH('QSO DB'!I166)<10,\"0\",\"\")&MONTH('QSO DB'!I166)&\"-\"&IF(DAY('QSO DB'!I166)<10,\"0\",\"\")&DAY('QSO DB'!I166))&\" \"&IF(ISBLANK('QSO DB'!J166),\"XXXX\",LEFT('QSO DB'!J166,4))&\" \"&UPPER('QSO DB'!K166)&REPT(\" \",14-LEN('QSO DB'!K166))&IF(ISBLANK('QSO DB'!L166),REPT(\"X\",3),'QSO DB'!L166&REPT(\" \",3-LEN('QSO DB'!L166)))&\" \"&IF(ISBLANK('QSO DB'!M166),REPT(\"X\",4),'QSO DB'!M166)&\"   \"&UPPER('QSO DB'!F166)&REPT(\" \",14-LEN('QSO DB'!F166))&IF(ISBLANK('QSO DB'!G166),REPT(\"X\",3),'QSO DB'!G166&REPT(\" \",3-LEN('QSO DB'!G166)))&\" \"&IF(ISBLANK('QSO DB'!H166),REPT(\"X\",4),'QSO DB'!H166)))","v":""}]
[{"$f":"IF(OR(LEFT(A181,3)=\"END\",A181=\"\"),\"\",IF(ISBLANK('QSO DB'!D167),\"END-OF-LOG:\",\"QSO:\"&'QSO DB'!D167&REPT(\" \",6-LEN('QSO DB'!D167))&\" \"&IF(ISBLANK('QSO DB'!E167),\"xx\",\"\")&UPPER('QSO DB'!E167)&\" \"&IF(ISBLANK('QSO DB'!I167),REPT(\"X\",10),YEAR('QSO DB'!I167)&\"-\"&IF(MONTH('QSO DB'!I167)<10,\"0\",\"\")&MONTH('QSO DB'!I167)&\"-\"&IF(DAY('QSO DB'!I167)<10,\"0\",\"\")&DAY('QSO DB'!I167))&\" \"&IF(ISBLANK('QSO DB'!J167),\"XXXX\",LEFT('QSO DB'!J167,4))&\" \"&UPPER('QSO DB'!K167)&REPT(\" \",14-LEN('QSO DB'!K167))&IF(ISBLANK('QSO DB'!L167),REPT(\"X\",3),'QSO DB'!L167&REPT(\" \",3-LEN('QSO DB'!L167)))&\" \"&IF(ISBLANK('QSO DB'!M167),REPT(\"X\",4),'QSO DB'!M167)&\"   \"&UPPER('QSO DB'!F167)&REPT(\" \",14-LEN('QSO DB'!F167))&IF(ISBLANK('QSO DB'!G167),REPT(\"X\",3),'QSO DB'!G167&REPT(\" \",3-LEN('QSO DB'!G167)))&\" \"&IF(ISBLANK('QSO DB'!H167),REPT(\"X\",4),'QSO DB'!H167)))","v":""}]
[{"$f":"IF(OR(LEFT(A182,3)=\"END\",A182=\"\"),\"\",IF(ISBLANK('QSO DB'!D168),\"END-OF-LOG:\",\"QSO:\"&'QSO DB'!D168&REPT(\" \",6-LEN('QSO DB'!D168))&\" \"&IF(ISBLANK('QSO DB'!E168),\"xx\",\"\")&UPPER('QSO DB'!E168)&\" \"&IF(ISBLANK('QSO DB'!I168),REPT(\"X\",10),YEAR('QSO DB'!I168)&\"-\"&IF(MONTH('QSO DB'!I168)<10,\"0\",\"\")&MONTH('QSO DB'!I168)&\"-\"&IF(DAY('QSO DB'!I168)<10,\"0\",\"\")&DAY('QSO DB'!I168))&\" \"&IF(ISBLANK('QSO DB'!J168),\"XXXX\",LEFT('QSO DB'!J168,4))&\" \"&UPPER('QSO DB'!K168)&REPT(\" \",14-LEN('QSO DB'!K168))&IF(ISBLANK('QSO DB'!L168),REPT(\"X\",3),'QSO DB'!L168&REPT(\" \",3-LEN('QSO DB'!L168)))&\" \"&IF(ISBLANK('QSO DB'!M168),REPT(\"X\",4),'QSO DB'!M168)&\"   \"&UPPER('QSO DB'!F168)&REPT(\" \",14-LEN('QSO DB'!F168))&IF(ISBLANK('QSO DB'!G168),REPT(\"X\",3),'QSO DB'!G168&REPT(\" \",3-LEN('QSO DB'!G168)))&\" \"&IF(ISBLANK('QSO DB'!H168),REPT(\"X\",4),'QSO DB'!H168)))","v":""}]
[{"$f":"IF(OR(LEFT(A183,3)=\"END\",A183=\"\"),\"\",IF(ISBLANK('QSO DB'!D169),\"END-OF-LOG:\",\"QSO:\"&'QSO DB'!D169&REPT(\" \",6-LEN('QSO DB'!D169))&\" \"&IF(ISBLANK('QSO DB'!E169),\"xx\",\"\")&UPPER('QSO DB'!E169)&\" \"&IF(ISBLANK('QSO DB'!I169),REPT(\"X\",10),YEAR('QSO DB'!I169)&\"-\"&IF(MONTH('QSO DB'!I169)<10,\"0\",\"\")&MONTH('QSO DB'!I169)&\"-\"&IF(DAY('QSO DB'!I169)<10,\"0\",\"\")&DAY('QSO DB'!I169))&\" \"&IF(ISBLANK('QSO DB'!J169),\"XXXX\",LEFT('QSO DB'!J169,4))&\" \"&UPPER('QSO DB'!K169)&REPT(\" \",14-LEN('QSO DB'!K169))&IF(ISBLANK('QSO DB'!L169),REPT(\"X\",3),'QSO DB'!L169&REPT(\" \",3-LEN('QSO DB'!L169)))&\" \"&IF(ISBLANK('QSO DB'!M169),REPT(\"X\",4),'QSO DB'!M169)&\"   \"&UPPER('QSO DB'!F169)&REPT(\" \",14-LEN('QSO DB'!F169))&IF(ISBLANK('QSO DB'!G169),REPT(\"X\",3),'QSO DB'!G169&REPT(\" \",3-LEN('QSO DB'!G169)))&\" \"&IF(ISBLANK('QSO DB'!H169),REPT(\"X\",4),'QSO DB'!H169)))","v":""}]
[{"$f":"IF(OR(LEFT(A184,3)=\"END\",A184=\"\"),\"\",IF(ISBLANK('QSO DB'!D170),\"END-OF-LOG:\",\"QSO:\"&'QSO DB'!D170&REPT(\" \",6-LEN('QSO DB'!D170))&\" \"&IF(ISBLANK('QSO DB'!E170),\"xx\",\"\")&UPPER('QSO DB'!E170)&\" \"&IF(ISBLANK('QSO DB'!I170),REPT(\"X\",10),YEAR('QSO DB'!I170)&\"-\"&IF(MONTH('QSO DB'!I170)<10,\"0\",\"\")&MONTH('QSO DB'!I170)&\"-\"&IF(DAY('QSO DB'!I170)<10,\"0\",\"\")&DAY('QSO DB'!I170))&\" \"&IF(ISBLANK('QSO DB'!J170),\"XXXX\",LEFT('QSO DB'!J170,4))&\" \"&UPPER('QSO DB'!K170)&REPT(\" \",14-LEN('QSO DB'!K170))&IF(ISBLANK('QSO DB'!L170),REPT(\"X\",3),'QSO DB'!L170&REPT(\" \",3-LEN('QSO DB'!L170)))&\" \"&IF(ISBLANK('QSO DB'!M170),REPT(\"X\",4),'QSO DB'!M170)&\"   \"&UPPER('QSO DB'!F170)&REPT(\" \",14-LEN('QSO DB'!F170))&IF(ISBLANK('QSO DB'!G170),REPT(\"X\",3),'QSO DB'!G170&REPT(\" \",3-LEN('QSO DB'!G170)))&\" \"&IF(ISBLANK('QSO DB'!H170),REPT(\"X\",4),'QSO DB'!H170)))","v":""}]
[{"$f":"IF(OR(LEFT(A185,3)=\"END\",A185=\"\"),\"\",IF(ISBLANK('QSO DB'!D171),\"END-OF-LOG:\",\"QSO:\"&'QSO DB'!D171&REPT(\" \",6-LEN('QSO DB'!D171))&\" \"&IF(ISBLANK('QSO DB'!E171),\"xx\",\"\")&UPPER('QSO DB'!E171)&\" \"&IF(ISBLANK('QSO DB'!I171),REPT(\"X\",10),YEAR('QSO DB'!I171)&\"-\"&IF(MONTH('QSO DB'!I171)<10,\"0\",\"\")&MONTH('QSO DB'!I171)&\"-\"&IF(DAY('QSO DB'!I171)<10,\"0\",\"\")&DAY('QSO DB'!I171))&\" \"&IF(ISBLANK('QSO DB'!J171),\"XXXX\",LEFT('QSO DB'!J171,4))&\" \"&UPPER('QSO DB'!K171)&REPT(\" \",14-LEN('QSO DB'!K171))&IF(ISBLANK('QSO DB'!L171),REPT(\"X\",3),'QSO DB'!L171&REPT(\" \",3-LEN('QSO DB'!L171)))&\" \"&IF(ISBLANK('QSO DB'!M171),REPT(\"X\",4),'QSO DB'!M171)&\"   \"&UPPER('QSO DB'!F171)&REPT(\" \",14-LEN('QSO DB'!F171))&IF(ISBLANK('QSO DB'!G171),REPT(\"X\",3),'QSO DB'!G171&REPT(\" \",3-LEN('QSO DB'!G171)))&\" \"&IF(ISBLANK('QSO DB'!H171),REPT(\"X\",4),'QSO DB'!H171)))","v":""}]
[{"$f":"IF(OR(LEFT(A186,3)=\"END\",A186=\"\"),\"\",IF(ISBLANK('QSO DB'!D172),\"END-OF-LOG:\",\"QSO:\"&'QSO DB'!D172&REPT(\" \",6-LEN('QSO DB'!D172))&\" \"&IF(ISBLANK('QSO DB'!E172),\"xx\",\"\")&UPPER('QSO DB'!E172)&\" \"&IF(ISBLANK('QSO DB'!I172),REPT(\"X\",10),YEAR('QSO DB'!I172)&\"-\"&IF(MONTH('QSO DB'!I172)<10,\"0\",\"\")&MONTH('QSO DB'!I172)&\"-\"&IF(DAY('QSO DB'!I172)<10,\"0\",\"\")&DAY('QSO DB'!I172))&\" \"&IF(ISBLANK('QSO DB'!J172),\"XXXX\",LEFT('QSO DB'!J172,4))&\" \"&UPPER('QSO DB'!K172)&REPT(\" \",14-LEN('QSO DB'!K172))&IF(ISBLANK('QSO DB'!L172),REPT(\"X\",3),'QSO DB'!L172&REPT(\" \",3-LEN('QSO DB'!L172)))&\" \"&IF(ISBLANK('QSO DB'!M172),REPT(\"X\",4),'QSO DB'!M172)&\"   \"&UPPER('QSO DB'!F172)&REPT(\" \",14-LEN('QSO DB'!F172))&IF(ISBLANK('QSO DB'!G172),REPT(\"X\",3),'QSO DB'!G172&REPT(\" \",3-LEN('QSO DB'!G172)))&\" \"&IF(ISBLANK('QSO DB'!H172),REPT(\"X\",4),'QSO DB'!H172)))","v":""}]
[{"$f":"IF(OR(LEFT(A187,3)=\"END\",A187=\"\"),\"\",IF(ISBLANK('QSO DB'!D173),\"END-OF-LOG:\",\"QSO:\"&'QSO DB'!D173&REPT(\" \",6-LEN('QSO DB'!D173))&\" \"&IF(ISBLANK('QSO DB'!E173),\"xx\",\"\")&UPPER('QSO DB'!E173)&\" \"&IF(ISBLANK('QSO DB'!I173),REPT(\"X\",10),YEAR('QSO DB'!I173)&\"-\"&IF(MONTH('QSO DB'!I173)<10,\"0\",\"\")&MONTH('QSO DB'!I173)&\"-\"&IF(DAY('QSO DB'!I173)<10,\"0\",\"\")&DAY('QSO DB'!I173))&\" \"&IF(ISBLANK('QSO DB'!J173),\"XXXX\",LEFT('QSO DB'!J173,4))&\" \"&UPPER('QSO DB'!K173)&REPT(\" \",14-LEN('QSO DB'!K173))&IF(ISBLANK('QSO DB'!L173),REPT(\"X\",3),'QSO DB'!L173&REPT(\" \",3-LEN('QSO DB'!L173)))&\" \"&IF(ISBLANK('QSO DB'!M173),REPT(\"X\",4),'QSO DB'!M173)&\"   \"&UPPER('QSO DB'!F173)&REPT(\" \",14-LEN('QSO DB'!F173))&IF(ISBLANK('QSO DB'!G173),REPT(\"X\",3),'QSO DB'!G173&REPT(\" \",3-LEN('QSO DB'!G173)))&\" \"&IF(ISBLANK('QSO DB'!H173),REPT(\"X\",4),'QSO DB'!H173)))","v":""}]
[{"$f":"IF(OR(LEFT(A188,3)=\"END\",A188=\"\"),\"\",IF(ISBLANK('QSO DB'!D174),\"END-OF-LOG:\",\"QSO:\"&'QSO DB'!D174&REPT(\" \",6-LEN('QSO DB'!D174))&\" \"&IF(ISBLANK('QSO DB'!E174),\"xx\",\"\")&UPPER('QSO DB'!E174)&\" \"&IF(ISBLANK('QSO DB'!I174),REPT(\"X\",10),YEAR('QSO DB'!I174)&\"-\"&IF(MONTH('QSO DB'!I174)<10,\"0\",\"\")&MONTH('QSO DB'!I174)&\"-\"&IF(DAY('QSO DB'!I174)<10,\"0\",\"\")&DAY('QSO DB'!I174))&\" \"&IF(ISBLANK('QSO DB'!J174),\"XXXX\",LEFT('QSO DB'!J174,4))&\" \"&UPPER('QSO DB'!K174)&REPT(\" \",14-LEN('QSO DB'!K174))&IF(ISBLANK('QSO DB'!L174),REPT(\"X\",3),'QSO DB'!L174&REPT(\" \",3-LEN('QSO DB'!L174)))&\" \"&IF(ISBLANK('QSO DB'!M174),REPT(\"X\",4),'QSO DB'!M174)&\"   \"&UPPER('QSO DB'!F174)&REPT(\" \",14-LEN('QSO DB'!F174))&IF(ISBLANK('QSO DB'!G174),REPT(\"X\",3),'QSO DB'!G174&REPT(\" \",3-LEN('QSO DB'!G174)))&\" \"&IF(ISBLANK('QSO DB'!H174),REPT(\"X\",4),'QSO DB'!H174)))","v":""}]
[{"$f":"IF(OR(LEFT(A189,3)=\"END\",A189=\"\"),\"\",IF(ISBLANK('QSO DB'!D175),\"END-OF-LOG:\",\"QSO:\"&'QSO DB'!D175&REPT(\" \",6-LEN('QSO DB'!D175))&\" \"&IF(ISBLANK('QSO DB'!E175),\"xx\",\"\")&UPPER('QSO DB'!E175)&\" \"&IF(ISBLANK('QSO DB'!I175),REPT(\"X\",10),YEAR('QSO DB'!I175)&\"-\"&IF(MONTH('QSO DB'!I175)<10,\"0\",\"\")&MONTH('QSO DB'!I175)&\"-\"&IF(DAY('QSO DB'!I175)<10,\"0\",\"\")&DAY('QSO DB'!I175))&\" \"&IF(ISBLANK('QSO DB'!J175),\"XXXX\",LEFT('QSO DB'!J175,4))&\" \"&UPPER('QSO DB'!K175)&REPT(\" \",14-LEN('QSO DB'!K175))&IF(ISBLANK('QSO DB'!L175),REPT(\"X\",3),'QSO DB'!L175&REPT(\" \",3-LEN('QSO DB'!L175)))&\" \"&IF(ISBLANK('QSO DB'!M175),REPT(\"X\",4),'QSO DB'!M175)&\"   \"&UPPER('QSO DB'!F175)&REPT(\" \",14-LEN('QSO DB'!F175))&IF(ISBLANK('QSO DB'!G175),REPT(\"X\",3),'QSO DB'!G175&REPT(\" \",3-LEN('QSO DB'!G175)))&\" \"&IF(ISBLANK('QSO DB'!H175),REPT(\"X\",4),'QSO DB'!H175)))","v":""}]
[{"$f":"IF(OR(LEFT(A190,3)=\"END\",A190=\"\"),\"\",IF(ISBLANK('QSO DB'!D176),\"END-OF-LOG:\",\"QSO:\"&'QSO DB'!D176&REPT(\" \",6-LEN('QSO DB'!D176))&\" \"&IF(ISBLANK('QSO DB'!E176),\"xx\",\"\")&UPPER('QSO DB'!E176)&\" \"&IF(ISBLANK('QSO DB'!I176),REPT(\"X\",10),YEAR('QSO DB'!I176)&\"-\"&IF(MONTH('QSO DB'!I176)<10,\"0\",\"\")&MONTH('QSO DB'!I176)&\"-\"&IF(DAY('QSO DB'!I176)<10,\"0\",\"\")&DAY('QSO DB'!I176))&\" \"&IF(ISBLANK('QSO DB'!J176),\"XXXX\",LEFT('QSO DB'!J176,4))&\" \"&UPPER('QSO DB'!K176)&REPT(\" \",14-LEN('QSO DB'!K176))&IF(ISBLANK('QSO DB'!L176),REPT(\"X\",3),'QSO DB'!L176&REPT(\" \",3-LEN('QSO DB'!L176)))&\" \"&IF(ISBLANK('QSO DB'!M176),REPT(\"X\",4),'QSO DB'!M176)&\"   \"&UPPER('QSO DB'!F176)&REPT(\" \",14-LEN('QSO DB'!F176))&IF(ISBLANK('QSO DB'!G176),REPT(\"X\",3),'QSO DB'!G176&REPT(\" \",3-LEN('QSO DB'!G176)))&\" \"&IF(ISBLANK('QSO DB'!H176),REPT(\"X\",4),'QSO DB'!H176)))","v":""}]
[{"$f":"IF(OR(LEFT(A191,3)=\"END\",A191=\"\"),\"\",IF(ISBLANK('QSO DB'!D177),\"END-OF-LOG:\",\"QSO:\"&'QSO DB'!D177&REPT(\" \",6-LEN('QSO DB'!D177))&\" \"&IF(ISBLANK('QSO DB'!E177),\"xx\",\"\")&UPPER('QSO DB'!E177)&\" \"&IF(ISBLANK('QSO DB'!I177),REPT(\"X\",10),YEAR('QSO DB'!I177)&\"-\"&IF(MONTH('QSO DB'!I177)<10,\"0\",\"\")&MONTH('QSO DB'!I177)&\"-\"&IF(DAY('QSO DB'!I177)<10,\"0\",\"\")&DAY('QSO DB'!I177))&\" \"&IF(ISBLANK('QSO DB'!J177),\"XXXX\",LEFT('QSO DB'!J177,4))&\" \"&UPPER('QSO DB'!K177)&REPT(\" \",14-LEN('QSO DB'!K177))&IF(ISBLANK('QSO DB'!L177),REPT(\"X\",3),'QSO DB'!L177&REPT(\" \",3-LEN('QSO DB'!L177)))&\" \"&IF(ISBLANK('QSO DB'!M177),REPT(\"X\",4),'QSO DB'!M177)&\"   \"&UPPER('QSO DB'!F177)&REPT(\" \",14-LEN('QSO DB'!F177))&IF(ISBLANK('QSO DB'!G177),REPT(\"X\",3),'QSO DB'!G177&REPT(\" \",3-LEN('QSO DB'!G177)))&\" \"&IF(ISBLANK('QSO DB'!H177),REPT(\"X\",4),'QSO DB'!H177)))","v":""}]
[{"$f":"IF(OR(LEFT(A192,3)=\"END\",A192=\"\"),\"\",IF(ISBLANK('QSO DB'!D178),\"END-OF-LOG:\",\"QSO:\"&'QSO DB'!D178&REPT(\" \",6-LEN('QSO DB'!D178))&\" \"&IF(ISBLANK('QSO DB'!E178),\"xx\",\"\")&UPPER('QSO DB'!E178)&\" \"&IF(ISBLANK('QSO DB'!I178),REPT(\"X\",10),YEAR('QSO DB'!I178)&\"-\"&IF(MONTH('QSO DB'!I178)<10,\"0\",\"\")&MONTH('QSO DB'!I178)&\"-\"&IF(DAY('QSO DB'!I178)<10,\"0\",\"\")&DAY('QSO DB'!I178))&\" \"&IF(ISBLANK('QSO DB'!J178),\"XXXX\",LEFT('QSO DB'!J178,4))&\" \"&UPPER('QSO DB'!K178)&REPT(\" \",14-LEN('QSO DB'!K178))&IF(ISBLANK('QSO DB'!L178),REPT(\"X\",3),'QSO DB'!L178&REPT(\" \",3-LEN('QSO DB'!L178)))&\" \"&IF(ISBLANK('QSO DB'!M178),REPT(\"X\",4),'QSO DB'!M178)&\"   \"&UPPER('QSO DB'!F178)&REPT(\" \",14-LEN('QSO DB'!F178))&IF(ISBLANK('QSO DB'!G178),REPT(\"X\",3),'QSO DB'!G178&REPT(\" \",3-LEN('QSO DB'!G178)))&\" \"&IF(ISBLANK('QSO DB'!H178),REPT(\"X\",4),'QSO DB'!H178)))","v":""}]
[{"$f":"IF(OR(LEFT(A193,3)=\"END\",A193=\"\"),\"\",IF(ISBLANK('QSO DB'!D179),\"END-OF-LOG:\",\"QSO:\"&'QSO DB'!D179&REPT(\" \",6-LEN('QSO DB'!D179))&\" \"&IF(ISBLANK('QSO DB'!E179),\"xx\",\"\")&UPPER('QSO DB'!E179)&\" \"&IF(ISBLANK('QSO DB'!I179),REPT(\"X\",10),YEAR('QSO DB'!I179)&\"-\"&IF(MONTH('QSO DB'!I179)<10,\"0\",\"\")&MONTH('QSO DB'!I179)&\"-\"&IF(DAY('QSO DB'!I179)<10,\"0\",\"\")&DAY('QSO DB'!I179))&\" \"&IF(ISBLANK('QSO DB'!J179),\"XXXX\",LEFT('QSO DB'!J179,4))&\" \"&UPPER('QSO DB'!K179)&REPT(\" \",14-LEN('QSO DB'!K179))&IF(ISBLANK('QSO DB'!L179),REPT(\"X\",3),'QSO DB'!L179&REPT(\" \",3-LEN('QSO DB'!L179)))&\" \"&IF(ISBLANK('QSO DB'!M179),REPT(\"X\",4),'QSO DB'!M179)&\"   \"&UPPER('QSO DB'!F179)&REPT(\" \",14-LEN('QSO DB'!F179))&IF(ISBLANK('QSO DB'!G179),REPT(\"X\",3),'QSO DB'!G179&REPT(\" \",3-LEN('QSO DB'!G179)))&\" \"&IF(ISBLANK('QSO DB'!H179),REPT(\"X\",4),'QSO DB'!H179)))","v":""}]
[{"$f":"IF(OR(LEFT(A194,3)=\"END\",A194=\"\"),\"\",IF(ISBLANK('QSO DB'!D180),\"END-OF-LOG:\",\"QSO:\"&'QSO DB'!D180&REPT(\" \",6-LEN('QSO DB'!D180))&\" \"&IF(ISBLANK('QSO DB'!E180),\"xx\",\"\")&UPPER('QSO DB'!E180)&\" \"&IF(ISBLANK('QSO DB'!I180),REPT(\"X\",10),YEAR('QSO DB'!I180)&\"-\"&IF(MONTH('QSO DB'!I180)<10,\"0\",\"\")&MONTH('QSO DB'!I180)&\"-\"&IF(DAY('QSO DB'!I180)<10,\"0\",\"\")&DAY('QSO DB'!I180))&\" \"&IF(ISBLANK('QSO DB'!J180),\"XXXX\",LEFT('QSO DB'!J180,4))&\" \"&UPPER('QSO DB'!K180)&REPT(\" \",14-LEN('QSO DB'!K180))&IF(ISBLANK('QSO DB'!L180),REPT(\"X\",3),'QSO DB'!L180&REPT(\" \",3-LEN('QSO DB'!L180)))&\" \"&IF(ISBLANK('QSO DB'!M180),REPT(\"X\",4),'QSO DB'!M180)&\"   \"&UPPER('QSO DB'!F180)&REPT(\" \",14-LEN('QSO DB'!F180))&IF(ISBLANK('QSO DB'!G180),REPT(\"X\",3),'QSO DB'!G180&REPT(\" \",3-LEN('QSO DB'!G180)))&\" \"&IF(ISBLANK('QSO DB'!H180),REPT(\"X\",4),'QSO DB'!H180)))","v":""}]
[{"$f":"IF(OR(LEFT(A195,3)=\"END\",A195=\"\"),\"\",IF(ISBLANK('QSO DB'!D181),\"END-OF-LOG:\",\"QSO:\"&'QSO DB'!D181&REPT(\" \",6-LEN('QSO DB'!D181))&\" \"&IF(ISBLANK('QSO DB'!E181),\"xx\",\"\")&UPPER('QSO DB'!E181)&\" \"&IF(ISBLANK('QSO DB'!I181),REPT(\"X\",10),YEAR('QSO DB'!I181)&\"-\"&IF(MONTH('QSO DB'!I181)<10,\"0\",\"\")&MONTH('QSO DB'!I181)&\"-\"&IF(DAY('QSO DB'!I181)<10,\"0\",\"\")&DAY('QSO DB'!I181))&\" \"&IF(ISBLANK('QSO DB'!J181),\"XXXX\",LEFT('QSO DB'!J181,4))&\" \"&UPPER('QSO DB'!K181)&REPT(\" \",14-LEN('QSO DB'!K181))&IF(ISBLANK('QSO DB'!L181),REPT(\"X\",3),'QSO DB'!L181&REPT(\" \",3-LEN('QSO DB'!L181)))&\" \"&IF(ISBLANK('QSO DB'!M181),REPT(\"X\",4),'QSO DB'!M181)&\"   \"&UPPER('QSO DB'!F181)&REPT(\" \",14-LEN('QSO DB'!F181))&IF(ISBLANK('QSO DB'!G181),REPT(\"X\",3),'QSO DB'!G181&REPT(\" \",3-LEN('QSO DB'!G181)))&\" \"&IF(ISBLANK('QSO DB'!H181),REPT(\"X\",4),'QSO DB'!H181)))","v":""}]
[{"$f":"IF(OR(LEFT(A196,3)=\"END\",A196=\"\"),\"\",IF(ISBLANK('QSO DB'!D182),\"END-OF-LOG:\",\"QSO:\"&'QSO DB'!D182&REPT(\" \",6-LEN('QSO DB'!D182))&\" \"&IF(ISBLANK('QSO DB'!E182),\"xx\",\"\")&UPPER('QSO DB'!E182)&\" \"&IF(ISBLANK('QSO DB'!I182),REPT(\"X\",10),YEAR('QSO DB'!I182)&\"-\"&IF(MONTH('QSO DB'!I182)<10,\"0\",\"\")&MONTH('QSO DB'!I182)&\"-\"&IF(DAY('QSO DB'!I182)<10,\"0\",\"\")&DAY('QSO DB'!I182))&\" \"&IF(ISBLANK('QSO DB'!J182),\"XXXX\",LEFT('QSO DB'!J182,4))&\" \"&UPPER('QSO DB'!K182)&REPT(\" \",14-LEN('QSO DB'!K182))&IF(ISBLANK('QSO DB'!L182),REPT(\"X\",3),'QSO DB'!L182&REPT(\" \",3-LEN('QSO DB'!L182)))&\" \"&IF(ISBLANK('QSO DB'!M182),REPT(\"X\",4),'QSO DB'!M182)&\"   \"&UPPER('QSO DB'!F182)&REPT(\" \",14-LEN('QSO DB'!F182))&IF(ISBLANK('QSO DB'!G182),REPT(\"X\",3),'QSO DB'!G182&REPT(\" \",3-LEN('QSO DB'!G182)))&\" \"&IF(ISBLANK('QSO DB'!H182),REPT(\"X\",4),'QSO DB'!H182)))","v":""}]
[{"$f":"IF(OR(LEFT(A197,3)=\"END\",A197=\"\"),\"\",IF(ISBLANK('QSO DB'!D183),\"END-OF-LOG:\",\"QSO:\"&'QSO DB'!D183&REPT(\" \",6-LEN('QSO DB'!D183))&\" \"&IF(ISBLANK('QSO DB'!E183),\"xx\",\"\")&UPPER('QSO DB'!E183)&\" \"&IF(ISBLANK('QSO DB'!I183),REPT(\"X\",10),YEAR('QSO DB'!I183)&\"-\"&IF(MONTH('QSO DB'!I183)<10,\"0\",\"\")&MONTH('QSO DB'!I183)&\"-\"&IF(DAY('QSO DB'!I183)<10,\"0\",\"\")&DAY('QSO DB'!I183))&\" \"&IF(ISBLANK('QSO DB'!J183),\"XXXX\",LEFT('QSO DB'!J183,4))&\" \"&UPPER('QSO DB'!K183)&REPT(\" \",14-LEN('QSO DB'!K183))&IF(ISBLANK('QSO DB'!L183),REPT(\"X\",3),'QSO DB'!L183&REPT(\" \",3-LEN('QSO DB'!L183)))&\" \"&IF(ISBLANK('QSO DB'!M183),REPT(\"X\",4),'QSO DB'!M183)&\"   \"&UPPER('QSO DB'!F183)&REPT(\" \",14-LEN('QSO DB'!F183))&IF(ISBLANK('QSO DB'!G183),REPT(\"X\",3),'QSO DB'!G183&REPT(\" \",3-LEN('QSO DB'!G183)))&\" \"&IF(ISBLANK('QSO DB'!H183),REPT(\"X\",4),'QSO DB'!H183)))","v":""}]
[{"$f":"IF(OR(LEFT(A198,3)=\"END\",A198=\"\"),\"\",IF(ISBLANK('QSO DB'!D184),\"END-OF-LOG:\",\"QSO:\"&'QSO DB'!D184&REPT(\" \",6-LEN('QSO DB'!D184))&\" \"&IF(ISBLANK('QSO DB'!E184),\"xx\",\"\")&UPPER('QSO DB'!E184)&\" \"&IF(ISBLANK('QSO DB'!I184),REPT(\"X\",10),YEAR('QSO DB'!I184)&\"-\"&IF(MONTH('QSO DB'!I184)<10,\"0\",\"\")&MONTH('QSO DB'!I184)&\"-\"&IF(DAY('QSO DB'!I184)<10,\"0\",\"\")&DAY('QSO DB'!I184))&\" \"&IF(ISBLANK('QSO DB'!J184),\"XXXX\",LEFT('QSO DB'!J184,4))&\" \"&UPPER('QSO DB'!K184)&REPT(\" \",14-LEN('QSO DB'!K184))&IF(ISBLANK('QSO DB'!L184),REPT(\"X\",3),'QSO DB'!L184&REPT(\" \",3-LEN('QSO DB'!L184)))&\" \"&IF(ISBLANK('QSO DB'!M184),REPT(\"X\",4),'QSO DB'!M184)&\"   \"&UPPER('QSO DB'!F184)&REPT(\" \",14-LEN('QSO DB'!F184))&IF(ISBLANK('QSO DB'!G184),REPT(\"X\",3),'QSO DB'!G184&REPT(\" \",3-LEN('QSO DB'!G184)))&\" \"&IF(ISBLANK('QSO DB'!H184),REPT(\"X\",4),'QSO DB'!H184)))","v":""}]
[{"$f":"IF(OR(LEFT(A199,3)=\"END\",A199=\"\"),\"\",IF(ISBLANK('QSO DB'!D185),\"END-OF-LOG:\",\"QSO:\"&'QSO DB'!D185&REPT(\" \",6-LEN('QSO DB'!D185))&\" \"&IF(ISBLANK('QSO DB'!E185),\"xx\",\"\")&UPPER('QSO DB'!E185)&\" \"&IF(ISBLANK('QSO DB'!I185),REPT(\"X\",10),YEAR('QSO DB'!I185)&\"-\"&IF(MONTH('QSO DB'!I185)<10,\"0\",\"\")&MONTH('QSO DB'!I185)&\"-\"&IF(DAY('QSO DB'!I185)<10,\"0\",\"\")&DAY('QSO DB'!I185))&\" \"&IF(ISBLANK('QSO DB'!J185),\"XXXX\",LEFT('QSO DB'!J185,4))&\" \"&UPPER('QSO DB'!K185)&REPT(\" \",14-LEN('QSO DB'!K185))&IF(ISBLANK('QSO DB'!L185),REPT(\"X\",3),'QSO DB'!L185&REPT(\" \",3-LEN('QSO DB'!L185)))&\" \"&IF(ISBLANK('QSO DB'!M185),REPT(\"X\",4),'QSO DB'!M185)&\"   \"&UPPER('QSO DB'!F185)&REPT(\" \",14-LEN('QSO DB'!F185))&IF(ISBLANK('QSO DB'!G185),REPT(\"X\",3),'QSO DB'!G185&REPT(\" \",3-LEN('QSO DB'!G185)))&\" \"&IF(ISBLANK('QSO DB'!H185),REPT(\"X\",4),'QSO DB'!H185)))","v":""}]
[{"$f":"IF(OR(LEFT(A200,3)=\"END\",A200=\"\"),\"\",IF(ISBLANK('QSO DB'!D186),\"END-OF-LOG:\",\"QSO:\"&'QSO DB'!D186&REPT(\" \",6-LEN('QSO DB'!D186))&\" \"&IF(ISBLANK('QSO DB'!E186),\"xx\",\"\")&UPPER('QSO DB'!E186)&\" \"&IF(ISBLANK('QSO DB'!I186),REPT(\"X\",10),YEAR('QSO DB'!I186)&\"-\"&IF(MONTH('QSO DB'!I186)<10,\"0\",\"\")&MONTH('QSO DB'!I186)&\"-\"&IF(DAY('QSO DB'!I186)<10,\"0\",\"\")&DAY('QSO DB'!I186))&\" \"&IF(ISBLANK('QSO DB'!J186),\"XXXX\",LEFT('QSO DB'!J186,4))&\" \"&UPPER('QSO DB'!K186)&REPT(\" \",14-LEN('QSO DB'!K186))&IF(ISBLANK('QSO DB'!L186),REPT(\"X\",3),'QSO DB'!L186&REPT(\" \",3-LEN('QSO DB'!L186)))&\" \"&IF(ISBLANK('QSO DB'!M186),REPT(\"X\",4),'QSO DB'!M186)&\"   \"&UPPER('QSO DB'!F186)&REPT(\" \",14-LEN('QSO DB'!F186))&IF(ISBLANK('QSO DB'!G186),REPT(\"X\",3),'QSO DB'!G186&REPT(\" \",3-LEN('QSO DB'!G186)))&\" \"&IF(ISBLANK('QSO DB'!H186),REPT(\"X\",4),'QSO DB'!H186)))","v":""}]
[{"$f":"IF(OR(LEFT(A201,3)=\"END\",A201=\"\"),\"\",IF(ISBLANK('QSO DB'!D187),\"END-OF-LOG:\",\"QSO:\"&'QSO DB'!D187&REPT(\" \",6-LEN('QSO DB'!D187))&\" \"&IF(ISBLANK('QSO DB'!E187),\"xx\",\"\")&UPPER('QSO DB'!E187)&\" \"&IF(ISBLANK('QSO DB'!I187),REPT(\"X\",10),YEAR('QSO DB'!I187)&\"-\"&IF(MONTH('QSO DB'!I187)<10,\"0\",\"\")&MONTH('QSO DB'!I187)&\"-\"&IF(DAY('QSO DB'!I187)<10,\"0\",\"\")&DAY('QSO DB'!I187))&\" \"&IF(ISBLANK('QSO DB'!J187),\"XXXX\",LEFT('QSO DB'!J187,4))&\" \"&UPPER('QSO DB'!K187)&REPT(\" \",14-LEN('QSO DB'!K187))&IF(ISBLANK('QSO DB'!L187),REPT(\"X\",3),'QSO DB'!L187&REPT(\" \",3-LEN('QSO DB'!L187)))&\" \"&IF(ISBLANK('QSO DB'!M187),REPT(\"X\",4),'QSO DB'!M187)&\"   \"&UPPER('QSO DB'!F187)&REPT(\" \",14-LEN('QSO DB'!F187))&IF(ISBLANK('QSO DB'!G187),REPT(\"X\",3),'QSO DB'!G187&REPT(\" \",3-LEN('QSO DB'!G187)))&\" \"&IF(ISBLANK('QSO DB'!H187),REPT(\"X\",4),'QSO DB'!H187)))","v":""}]
[{"$f":"IF(OR(LEFT(A202,3)=\"END\",A202=\"\"),\"\",IF(ISBLANK('QSO DB'!D188),\"END-OF-LOG:\",\"QSO:\"&'QSO DB'!D188&REPT(\" \",6-LEN('QSO DB'!D188))&\" \"&IF(ISBLANK('QSO DB'!E188),\"xx\",\"\")&UPPER('QSO DB'!E188)&\" \"&IF(ISBLANK('QSO DB'!I188),REPT(\"X\",10),YEAR('QSO DB'!I188)&\"-\"&IF(MONTH('QSO DB'!I188)<10,\"0\",\"\")&MONTH('QSO DB'!I188)&\"-\"&IF(DAY('QSO DB'!I188)<10,\"0\",\"\")&DAY('QSO DB'!I188))&\" \"&IF(ISBLANK('QSO DB'!J188),\"XXXX\",LEFT('QSO DB'!J188,4))&\" \"&UPPER('QSO DB'!K188)&REPT(\" \",14-LEN('QSO DB'!K188))&IF(ISBLANK('QSO DB'!L188),REPT(\"X\",3),'QSO DB'!L188&REPT(\" \",3-LEN('QSO DB'!L188)))&\" \"&IF(ISBLANK('QSO DB'!M188),REPT(\"X\",4),'QSO DB'!M188)&\"   \"&UPPER('QSO DB'!F188)&REPT(\" \",14-LEN('QSO DB'!F188))&IF(ISBLANK('QSO DB'!G188),REPT(\"X\",3),'QSO DB'!G188&REPT(\" \",3-LEN('QSO DB'!G188)))&\" \"&IF(ISBLANK('QSO DB'!H188),REPT(\"X\",4),'QSO DB'!H188)))","v":""}]
[{"$f":"IF(OR(LEFT(A203,3)=\"END\",A203=\"\"),\"\",IF(ISBLANK('QSO DB'!D189),\"END-OF-LOG:\",\"QSO:\"&'QSO DB'!D189&REPT(\" \",6-LEN('QSO DB'!D189))&\" \"&IF(ISBLANK('QSO DB'!E189),\"xx\",\"\")&UPPER('QSO DB'!E189)&\" \"&IF(ISBLANK('QSO DB'!I189),REPT(\"X\",10),YEAR('QSO DB'!I189)&\"-\"&IF(MONTH('QSO DB'!I189)<10,\"0\",\"\")&MONTH('QSO DB'!I189)&\"-\"&IF(DAY('QSO DB'!I189)<10,\"0\",\"\")&DAY('QSO DB'!I189))&\" \"&IF(ISBLANK('QSO DB'!J189),\"XXXX\",LEFT('QSO DB'!J189,4))&\" \"&UPPER('QSO DB'!K189)&REPT(\" \",14-LEN('QSO DB'!K189))&IF(ISBLANK('QSO DB'!L189),REPT(\"X\",3),'QSO DB'!L189&REPT(\" \",3-LEN('QSO DB'!L189)))&\" \"&IF(ISBLANK('QSO DB'!M189),REPT(\"X\",4),'QSO DB'!M189)&\"   \"&UPPER('QSO DB'!F189)&REPT(\" \",14-LEN('QSO DB'!F189))&IF(ISBLANK('QSO DB'!G189),REPT(\"X\",3),'QSO DB'!G189&REPT(\" \",3-LEN('QSO DB'!G189)))&\" \"&IF(ISBLANK('QSO DB'!H189),REPT(\"X\",4),'QSO DB'!H189)))","v":""}]
[{"$f":"IF(OR(LEFT(A204,3)=\"END\",A204=\"\"),\"\",IF(ISBLANK('QSO DB'!D190),\"END-OF-LOG:\",\"QSO:\"&'QSO DB'!D190&REPT(\" \",6-LEN('QSO DB'!D190))&\" \"&IF(ISBLANK('QSO DB'!E190),\"xx\",\"\")&UPPER('QSO DB'!E190)&\" \"&IF(ISBLANK('QSO DB'!I190),REPT(\"X\",10),YEAR('QSO DB'!I190)&\"-\"&IF(MONTH('QSO DB'!I190)<10,\"0\",\"\")&MONTH('QSO DB'!I190)&\"-\"&IF(DAY('QSO DB'!I190)<10,\"0\",\"\")&DAY('QSO DB'!I190))&\" \"&IF(ISBLANK('QSO DB'!J190),\"XXXX\",LEFT('QSO DB'!J190,4))&\" \"&UPPER('QSO DB'!K190)&REPT(\" \",14-LEN('QSO DB'!K190))&IF(ISBLANK('QSO DB'!L190),REPT(\"X\",3),'QSO DB'!L190&REPT(\" \",3-LEN('QSO DB'!L190)))&\" \"&IF(ISBLANK('QSO DB'!M190),REPT(\"X\",4),'QSO DB'!M190)&\"   \"&UPPER('QSO DB'!F190)&REPT(\" \",14-LEN('QSO DB'!F190))&IF(ISBLANK('QSO DB'!G190),REPT(\"X\",3),'QSO DB'!G190&REPT(\" \",3-LEN('QSO DB'!G190)))&\" \"&IF(ISBLANK('QSO DB'!H190),REPT(\"X\",4),'QSO DB'!H190)))","v":""}]
[{"$f":"IF(OR(LEFT(A205,3)=\"END\",A205=\"\"),\"\",IF(ISBLANK('QSO DB'!D191),\"END-OF-LOG:\",\"QSO:\"&'QSO DB'!D191&REPT(\" \",6-LEN('QSO DB'!D191))&\" \"&IF(ISBLANK('QSO DB'!E191),\"xx\",\"\")&UPPER('QSO DB'!E191)&\" \"&IF(ISBLANK('QSO DB'!I191),REPT(\"X\",10),YEAR('QSO DB'!I191)&\"-\"&IF(MONTH('QSO DB'!I191)<10,\"0\",\"\")&MONTH('QSO DB'!I191)&\"-\"&IF(DAY('QSO DB'!I191)<10,\"0\",\"\")&DAY('QSO DB'!I191))&\" \"&IF(ISBLANK('QSO DB'!J191),\"XXXX\",LEFT('QSO DB'!J191,4))&\" \"&UPPER('QSO DB'!K191)&REPT(\" \",14-LEN('QSO DB'!K191))&IF(ISBLANK('QSO DB'!L191),REPT(\"X\",3),'QSO DB'!L191&REPT(\" \",3-LEN('QSO DB'!L191)))&\" \"&IF(ISBLANK('QSO DB'!M191),REPT(\"X\",4),'QSO DB'!M191)&\"   \"&UPPER('QSO DB'!F191)&REPT(\" \",14-LEN('QSO DB'!F191))&IF(ISBLANK('QSO DB'!G191),REPT(\"X\",3),'QSO DB'!G191&REPT(\" \",3-LEN('QSO DB'!G191)))&\" \"&IF(ISBLANK('QSO DB'!H191),REPT(\"X\",4),'QSO DB'!H191)))","v":""}]
[{"$f":"IF(OR(LEFT(A206,3)=\"END\",A206=\"\"),\"\",IF(ISBLANK('QSO DB'!D192),\"END-OF-LOG:\",\"QSO:\"&'QSO DB'!D192&REPT(\" \",6-LEN('QSO DB'!D192))&\" \"&IF(ISBLANK('QSO DB'!E192),\"xx\",\"\")&UPPER('QSO DB'!E192)&\" \"&IF(ISBLANK('QSO DB'!I192),REPT(\"X\",10),YEAR('QSO DB'!I192)&\"-\"&IF(MONTH('QSO DB'!I192)<10,\"0\",\"\")&MONTH('QSO DB'!I192)&\"-\"&IF(DAY('QSO DB'!I192)<10,\"0\",\"\")&DAY('QSO DB'!I192))&\" \"&IF(ISBLANK('QSO DB'!J192),\"XXXX\",LEFT('QSO DB'!J192,4))&\" \"&UPPER('QSO DB'!K192)&REPT(\" \",14-LEN('QSO DB'!K192))&IF(ISBLANK('QSO DB'!L192),REPT(\"X\",3),'QSO DB'!L192&REPT(\" \",3-LEN('QSO DB'!L192)))&\" \"&IF(ISBLANK('QSO DB'!M192),REPT(\"X\",4),'QSO DB'!M192)&\"   \"&UPPER('QSO DB'!F192)&REPT(\" \",14-LEN('QSO DB'!F192))&IF(ISBLANK('QSO DB'!G192),REPT(\"X\",3),'QSO DB'!G192&REPT(\" \",3-LEN('QSO DB'!G192)))&\" \"&IF(ISBLANK('QSO DB'!H192),REPT(\"X\",4),'QSO DB'!H192)))","v":""}]
[{"$f":"IF(OR(LEFT(A207,3)=\"END\",A207=\"\"),\"\",IF(ISBLANK('QSO DB'!D193),\"END-OF-LOG:\",\"QSO:\"&'QSO DB'!D193&REPT(\" \",6-LEN('QSO DB'!D193))&\" \"&IF(ISBLANK('QSO DB'!E193),\"xx\",\"\")&UPPER('QSO DB'!E193)&\" \"&IF(ISBLANK('QSO DB'!I193),REPT(\"X\",10),YEAR('QSO DB'!I193)&\"-\"&IF(MONTH('QSO DB'!I193)<10,\"0\",\"\")&MONTH('QSO DB'!I193)&\"-\"&IF(DAY('QSO DB'!I193)<10,\"0\",\"\")&DAY('QSO DB'!I193))&\" \"&IF(ISBLANK('QSO DB'!J193),\"XXXX\",LEFT('QSO DB'!J193,4))&\" \"&UPPER('QSO DB'!K193)&REPT(\" \",14-LEN('QSO DB'!K193))&IF(ISBLANK('QSO DB'!L193),REPT(\"X\",3),'QSO DB'!L193&REPT(\" \",3-LEN('QSO DB'!L193)))&\" \"&IF(ISBLANK('QSO DB'!M193),REPT(\"X\",4),'QSO DB'!M193)&\"   \"&UPPER('QSO DB'!F193)&REPT(\" \",14-LEN('QSO DB'!F193))&IF(ISBLANK('QSO DB'!G193),REPT(\"X\",3),'QSO DB'!G193&REPT(\" \",3-LEN('QSO DB'!G193)))&\" \"&IF(ISBLANK('QSO DB'!H193),REPT(\"X\",4),'QSO DB'!H193)))","v":""}]
[{"$f":"IF(OR(LEFT(A208,3)=\"END\",A208=\"\"),\"\",IF(ISBLANK('QSO DB'!D194),\"END-OF-LOG:\",\"QSO:\"&'QSO DB'!D194&REPT(\" \",6-LEN('QSO DB'!D194))&\" \"&IF(ISBLANK('QSO DB'!E194),\"xx\",\"\")&UPPER('QSO DB'!E194)&\" \"&IF(ISBLANK('QSO DB'!I194),REPT(\"X\",10),YEAR('QSO DB'!I194)&\"-\"&IF(MONTH('QSO DB'!I194)<10,\"0\",\"\")&MONTH('QSO DB'!I194)&\"-\"&IF(DAY('QSO DB'!I194)<10,\"0\",\"\")&DAY('QSO DB'!I194))&\" \"&IF(ISBLANK('QSO DB'!J194),\"XXXX\",LEFT('QSO DB'!J194,4))&\" \"&UPPER('QSO DB'!K194)&REPT(\" \",14-LEN('QSO DB'!K194))&IF(ISBLANK('QSO DB'!L194),REPT(\"X\",3),'QSO DB'!L194&REPT(\" \",3-LEN('QSO DB'!L194)))&\" \"&IF(ISBLANK('QSO DB'!M194),REPT(\"X\",4),'QSO DB'!M194)&\"   \"&UPPER('QSO DB'!F194)&REPT(\" \",14-LEN('QSO DB'!F194))&IF(ISBLANK('QSO DB'!G194),REPT(\"X\",3),'QSO DB'!G194&REPT(\" \",3-LEN('QSO DB'!G194)))&\" \"&IF(ISBLANK('QSO DB'!H194),REPT(\"X\",4),'QSO DB'!H194)))","v":""}]
[{"$f":"IF(OR(LEFT(A209,3)=\"END\",A209=\"\"),\"\",IF(ISBLANK('QSO DB'!D195),\"END-OF-LOG:\",\"QSO:\"&'QSO DB'!D195&REPT(\" \",6-LEN('QSO DB'!D195))&\" \"&IF(ISBLANK('QSO DB'!E195),\"xx\",\"\")&UPPER('QSO DB'!E195)&\" \"&IF(ISBLANK('QSO DB'!I195),REPT(\"X\",10),YEAR('QSO DB'!I195)&\"-\"&IF(MONTH('QSO DB'!I195)<10,\"0\",\"\")&MONTH('QSO DB'!I195)&\"-\"&IF(DAY('QSO DB'!I195)<10,\"0\",\"\")&DAY('QSO DB'!I195))&\" \"&IF(ISBLANK('QSO DB'!J195),\"XXXX\",LEFT('QSO DB'!J195,4))&\" \"&UPPER('QSO DB'!K195)&REPT(\" \",14-LEN('QSO DB'!K195))&IF(ISBLANK('QSO DB'!L195),REPT(\"X\",3),'QSO DB'!L195&REPT(\" \",3-LEN('QSO DB'!L195)))&\" \"&IF(ISBLANK('QSO DB'!M195),REPT(\"X\",4),'QSO DB'!M195)&\"   \"&UPPER('QSO DB'!F195)&REPT(\" \",14-LEN('QSO DB'!F195))&IF(ISBLANK('QSO DB'!G195),REPT(\"X\",3),'QSO DB'!G195&REPT(\" \",3-LEN('QSO DB'!G195)))&\" \"&IF(ISBLANK('QSO DB'!H195),REPT(\"X\",4),'QSO DB'!H195)))","v":""}]
[{"$f":"IF(OR(LEFT(A210,3)=\"END\",A210=\"\"),\"\",IF(ISBLANK('QSO DB'!D196),\"END-OF-LOG:\",\"QSO:\"&'QSO DB'!D196&REPT(\" \",6-LEN('QSO DB'!D196))&\" \"&IF(ISBLANK('QSO DB'!E196),\"xx\",\"\")&UPPER('QSO DB'!E196)&\" \"&IF(ISBLANK('QSO DB'!I196),REPT(\"X\",10),YEAR('QSO DB'!I196)&\"-\"&IF(MONTH('QSO DB'!I196)<10,\"0\",\"\")&MONTH('QSO DB'!I196)&\"-\"&IF(DAY('QSO DB'!I196)<10,\"0\",\"\")&DAY('QSO DB'!I196))&\" \"&IF(ISBLANK('QSO DB'!J196),\"XXXX\",LEFT('QSO DB'!J196,4))&\" \"&UPPER('QSO DB'!K196)&REPT(\" \",14-LEN('QSO DB'!K196))&IF(ISBLANK('QSO DB'!L196),REPT(\"X\",3),'QSO DB'!L196&REPT(\" \",3-LEN('QSO DB'!L196)))&\" \"&IF(ISBLANK('QSO DB'!M196),REPT(\"X\",4),'QSO DB'!M196)&\"   \"&UPPER('QSO DB'!F196)&REPT(\" \",14-LEN('QSO DB'!F196))&IF(ISBLANK('QSO DB'!G196),REPT(\"X\",3),'QSO DB'!G196&REPT(\" \",3-LEN('QSO DB'!G196)))&\" \"&IF(ISBLANK('QSO DB'!H196),REPT(\"X\",4),'QSO DB'!H196)))","v":""}]
[{"$f":"IF(OR(LEFT(A211,3)=\"END\",A211=\"\"),\"\",IF(ISBLANK('QSO DB'!D197),\"END-OF-LOG:\",\"QSO:\"&'QSO DB'!D197&REPT(\" \",6-LEN('QSO DB'!D197))&\" \"&IF(ISBLANK('QSO DB'!E197),\"xx\",\"\")&UPPER('QSO DB'!E197)&\" \"&IF(ISBLANK('QSO DB'!I197),REPT(\"X\",10),YEAR('QSO DB'!I197)&\"-\"&IF(MONTH('QSO DB'!I197)<10,\"0\",\"\")&MONTH('QSO DB'!I197)&\"-\"&IF(DAY('QSO DB'!I197)<10,\"0\",\"\")&DAY('QSO DB'!I197))&\" \"&IF(ISBLANK('QSO DB'!J197),\"XXXX\",LEFT('QSO DB'!J197,4))&\" \"&UPPER('QSO DB'!K197)&REPT(\" \",14-LEN('QSO DB'!K197))&IF(ISBLANK('QSO DB'!L197),REPT(\"X\",3),'QSO DB'!L197&REPT(\" \",3-LEN('QSO DB'!L197)))&\" \"&IF(ISBLANK('QSO DB'!M197),REPT(\"X\",4),'QSO DB'!M197)&\"   \"&UPPER('QSO DB'!F197)&REPT(\" \",14-LEN('QSO DB'!F197))&IF(ISBLANK('QSO DB'!G197),REPT(\"X\",3),'QSO DB'!G197&REPT(\" \",3-LEN('QSO DB'!G197)))&\" \"&IF(ISBLANK('QSO DB'!H197),REPT(\"X\",4),'QSO DB'!H197)))","v":""}]
[{"$f":"IF(OR(LEFT(A212,3)=\"END\",A212=\"\"),\"\",IF(ISBLANK('QSO DB'!D198),\"END-OF-LOG:\",\"QSO:\"&'QSO DB'!D198&REPT(\" \",6-LEN('QSO DB'!D198))&\" \"&IF(ISBLANK('QSO DB'!E198),\"xx\",\"\")&UPPER('QSO DB'!E198)&\" \"&IF(ISBLANK('QSO DB'!I198),REPT(\"X\",10),YEAR('QSO DB'!I198)&\"-\"&IF(MONTH('QSO DB'!I198)<10,\"0\",\"\")&MONTH('QSO DB'!I198)&\"-\"&IF(DAY('QSO DB'!I198)<10,\"0\",\"\")&DAY('QSO DB'!I198))&\" \"&IF(ISBLANK('QSO DB'!J198),\"XXXX\",LEFT('QSO DB'!J198,4))&\" \"&UPPER('QSO DB'!K198)&REPT(\" \",14-LEN('QSO DB'!K198))&IF(ISBLANK('QSO DB'!L198),REPT(\"X\",3),'QSO DB'!L198&REPT(\" \",3-LEN('QSO DB'!L198)))&\" \"&IF(ISBLANK('QSO DB'!M198),REPT(\"X\",4),'QSO DB'!M198)&\"   \"&UPPER('QSO DB'!F198)&REPT(\" \",14-LEN('QSO DB'!F198))&IF(ISBLANK('QSO DB'!G198),REPT(\"X\",3),'QSO DB'!G198&REPT(\" \",3-LEN('QSO DB'!G198)))&\" \"&IF(ISBLANK('QSO DB'!H198),REPT(\"X\",4),'QSO DB'!H198)))","v":""}]
[{"$f":"IF(OR(LEFT(A213,3)=\"END\",A213=\"\"),\"\",IF(ISBLANK('QSO DB'!D199),\"END-OF-LOG:\",\"QSO:\"&'QSO DB'!D199&REPT(\" \",6-LEN('QSO DB'!D199))&\" \"&IF(ISBLANK('QSO DB'!E199),\"xx\",\"\")&UPPER('QSO DB'!E199)&\" \"&IF(ISBLANK('QSO DB'!I199),REPT(\"X\",10),YEAR('QSO DB'!I199)&\"-\"&IF(MONTH('QSO DB'!I199)<10,\"0\",\"\")&MONTH('QSO DB'!I199)&\"-\"&IF(DAY('QSO DB'!I199)<10,\"0\",\"\")&DAY('QSO DB'!I199))&\" \"&IF(ISBLANK('QSO DB'!J199),\"XXXX\",LEFT('QSO DB'!J199,4))&\" \"&UPPER('QSO DB'!K199)&REPT(\" \",14-LEN('QSO DB'!K199))&IF(ISBLANK('QSO DB'!L199),REPT(\"X\",3),'QSO DB'!L199&REPT(\" \",3-LEN('QSO DB'!L199)))&\" \"&IF(ISBLANK('QSO DB'!M199),REPT(\"X\",4),'QSO DB'!M199)&\"   \"&UPPER('QSO DB'!F199)&REPT(\" \",14-LEN('QSO DB'!F199))&IF(ISBLANK('QSO DB'!G199),REPT(\"X\",3),'QSO DB'!G199&REPT(\" \",3-LEN('QSO DB'!G199)))&\" \"&IF(ISBLANK('QSO DB'!H199),REPT(\"X\",4),'QSO DB'!H199)))","v":""}]
[{"$f":"IF(OR(LEFT(A214,3)=\"END\",A214=\"\"),\"\",IF(ISBLANK('QSO DB'!D200),\"END-OF-LOG:\",\"QSO:\"&'QSO DB'!D200&REPT(\" \",6-LEN('QSO DB'!D200))&\" \"&IF(ISBLANK('QSO DB'!E200),\"xx\",\"\")&UPPER('QSO DB'!E200)&\" \"&IF(ISBLANK('QSO DB'!I200),REPT(\"X\",10),YEAR('QSO DB'!I200)&\"-\"&IF(MONTH('QSO DB'!I200)<10,\"0\",\"\")&MONTH('QSO DB'!I200)&\"-\"&IF(DAY('QSO DB'!I200)<10,\"0\",\"\")&DAY('QSO DB'!I200))&\" \"&IF(ISBLANK('QSO DB'!J200),\"XXXX\",LEFT('QSO DB'!J200,4))&\" \"&UPPER('QSO DB'!K200)&REPT(\" \",14-LEN('QSO DB'!K200))&IF(ISBLANK('QSO DB'!L200),REPT(\"X\",3),'QSO DB'!L200&REPT(\" \",3-LEN('QSO DB'!L200)))&\" \"&IF(ISBLANK('QSO DB'!M200),REPT(\"X\",4),'QSO DB'!M200)&\"   \"&UPPER('QSO DB'!F200)&REPT(\" \",14-LEN('QSO DB'!F200))&IF(ISBLANK('QSO DB'!G200),REPT(\"X\",3),'QSO DB'!G200&REPT(\" \",3-LEN('QSO DB'!G200)))&\" \"&IF(ISBLANK('QSO DB'!H200),REPT(\"X\",4),'QSO DB'!H200)))","v":""}]
[{"$f":"IF(OR(LEFT(A215,3)=\"END\",A215=\"\"),\"\",IF(ISBLANK('QSO DB'!D201),\"END-OF-LOG:\",\"QSO:\"&'QSO DB'!D201&REPT(\" \",6-LEN('QSO DB'!D201))&\" \"&IF(ISBLANK('QSO DB'!E201),\"xx\",\"\")&UPPER('QSO DB'!E201)&\" \"&IF(ISBLANK('QSO DB'!I201),REPT(\"X\",10),YEAR('QSO DB'!I201)&\"-\"&IF(MONTH('QSO DB'!I201)<10,\"0\",\"\")&MONTH('QSO DB'!I201)&\"-\"&IF(DAY('QSO DB'!I201)<10,\"0\",\"\")&DAY('QSO DB'!I201))&\" \"&IF(ISBLANK('QSO DB'!J201),\"XXXX\",LEFT('QSO DB'!J201,4))&\" \"&UPPER('QSO DB'!K201)&REPT(\" \",14-LEN('QSO DB'!K201))&IF(ISBLANK('QSO DB'!L201),REPT(\"X\",3),'QSO DB'!L201&REPT(\" \",3-LEN('QSO DB'!L201)))&\" \"&IF(ISBLANK('QSO DB'!M201),REPT(\"X\",4),'QSO DB'!M201)&\"   \"&UPPER('QSO DB'!F201)&REPT(\" \",14-LEN('QSO DB'!F201))&IF(ISBLANK('QSO DB'!G201),REPT(\"X\",3),'QSO DB'!G201&REPT(\" \",3-LEN('QSO DB'!G201)))&\" \"&IF(ISBLANK('QSO DB'!H201),REPT(\"X\",4),'QSO DB'!H201)))","v":""}]
[{"$f":"IF(OR(LEFT(A216,3)=\"END\",A216=\"\"),\"\",IF(ISBLANK('QSO DB'!D202),\"END-OF-LOG:\",\"QSO:\"&'QSO DB'!D202&REPT(\" \",6-LEN('QSO DB'!D202))&\" \"&IF(ISBLANK('QSO DB'!E202),\"xx\",\"\")&UPPER('QSO DB'!E202)&\" \"&IF(ISBLANK('QSO DB'!I202),REPT(\"X\",10),YEAR('QSO DB'!I202)&\"-\"&IF(MONTH('QSO DB'!I202)<10,\"0\",\"\")&MONTH('QSO DB'!I202)&\"-\"&IF(DAY('QSO DB'!I202)<10,\"0\",\"\")&DAY('QSO DB'!I202))&\" \"&IF(ISBLANK('QSO DB'!J202),\"XXXX\",LEFT('QSO DB'!J202,4))&\" \"&UPPER('QSO DB'!K202)&REPT(\" \",14-LEN('QSO DB'!K202))&IF(ISBLANK('QSO DB'!L202),REPT(\"X\",3),'QSO DB'!L202&REPT(\" \",3-LEN('QSO DB'!L202)))&\" \"&IF(ISBLANK('QSO DB'!M202),REPT(\"X\",4),'QSO DB'!M202)&\"   \"&UPPER('QSO DB'!F202)&REPT(\" \",14-LEN('QSO DB'!F202))&IF(ISBLANK('QSO DB'!G202),REPT(\"X\",3),'QSO DB'!G202&REPT(\" \",3-LEN('QSO DB'!G202)))&\" \"&IF(ISBLANK('QSO DB'!H202),REPT(\"X\",4),'QSO DB'!H202)))","v":""}]
[{"$f":"IF(OR(LEFT(A217,3)=\"END\",A217=\"\"),\"\",IF(ISBLANK('QSO DB'!D203),\"END-OF-LOG:\",\"QSO:\"&'QSO DB'!D203&REPT(\" \",6-LEN('QSO DB'!D203))&\" \"&IF(ISBLANK('QSO DB'!E203),\"xx\",\"\")&UPPER('QSO DB'!E203)&\" \"&IF(ISBLANK('QSO DB'!I203),REPT(\"X\",10),YEAR('QSO DB'!I203)&\"-\"&IF(MONTH('QSO DB'!I203)<10,\"0\",\"\")&MONTH('QSO DB'!I203)&\"-\"&IF(DAY('QSO DB'!I203)<10,\"0\",\"\")&DAY('QSO DB'!I203))&\" \"&IF(ISBLANK('QSO DB'!J203),\"XXXX\",LEFT('QSO DB'!J203,4))&\" \"&UPPER('QSO DB'!K203)&REPT(\" \",14-LEN('QSO DB'!K203))&IF(ISBLANK('QSO DB'!L203),REPT(\"X\",3),'QSO DB'!L203&REPT(\" \",3-LEN('QSO DB'!L203)))&\" \"&IF(ISBLANK('QSO DB'!M203),REPT(\"X\",4),'QSO DB'!M203)&\"   \"&UPPER('QSO DB'!F203)&REPT(\" \",14-LEN('QSO DB'!F203))&IF(ISBLANK('QSO DB'!G203),REPT(\"X\",3),'QSO DB'!G203&REPT(\" \",3-LEN('QSO DB'!G203)))&\" \"&IF(ISBLANK('QSO DB'!H203),REPT(\"X\",4),'QSO DB'!H203)))","v":""}]
[{"$f":"IF(OR(LEFT(A218,3)=\"END\",A218=\"\"),\"\",IF(ISBLANK('QSO DB'!D204),\"END-OF-LOG:\",\"QSO:\"&'QSO DB'!D204&REPT(\" \",6-LEN('QSO DB'!D204))&\" \"&IF(ISBLANK('QSO DB'!E204),\"xx\",\"\")&UPPER('QSO DB'!E204)&\" \"&IF(ISBLANK('QSO DB'!I204),REPT(\"X\",10),YEAR('QSO DB'!I204)&\"-\"&IF(MONTH('QSO DB'!I204)<10,\"0\",\"\")&MONTH('QSO DB'!I204)&\"-\"&IF(DAY('QSO DB'!I204)<10,\"0\",\"\")&DAY('QSO DB'!I204))&\" \"&IF(ISBLANK('QSO DB'!J204),\"XXXX\",LEFT('QSO DB'!J204,4))&\" \"&UPPER('QSO DB'!K204)&REPT(\" \",14-LEN('QSO DB'!K204))&IF(ISBLANK('QSO DB'!L204),REPT(\"X\",3),'QSO DB'!L204&REPT(\" \",3-LEN('QSO DB'!L204)))&\" \"&IF(ISBLANK('QSO DB'!M204),REPT(\"X\",4),'QSO DB'!M204)&\"   \"&UPPER('QSO DB'!F204)&REPT(\" \",14-LEN('QSO DB'!F204))&IF(ISBLANK('QSO DB'!G204),REPT(\"X\",3),'QSO DB'!G204&REPT(\" \",3-LEN('QSO DB'!G204)))&\" \"&IF(ISBLANK('QSO DB'!H204),REPT(\"X\",4),'QSO DB'!H204)))","v":""}]

{"sheet":"Feature Notes","index":4,"n_rows":91,"n_cols":13,"rows_kept":91,"cut":false,"hidden":true,"merged":[]}
[null,null,14.854166666666668,120.79166666666667,14.8125,120.875,{"$f":"2*6371*ASIN(SQRT( SIN(RADIANS((E1-C1)/2))^2 + COS(RADIANS(C1))*COS(RADIANS(E1))* SIN(RADIANS((F1-D1)/2))^2))","v":10.084720810575741}]
[null,null,null,"=2*6371*ASIN(SQRT(",{"$f":"D2&D3&D4&D5&D6","v":"=2*6371*ASIN(SQRT( SIN(RADIANS((E1-C1)/2))^2 + COS(RADIANS(C1))*COS(RADIANS(E1))* SIN(RADIANS((F1-D1)/2))^2))"}]
[null,null,null," SIN(RADIANS((E1-C1)/2))^2 +"]
[null,"PENDING ENHANCEMENTS:",null," COS(RADIANS(C1))*COS(RADIANS(E1))*"]
["done","check/review N1MM+ Edit function",null," SIN(RADIANS((F1-D1)/2))^2",null,null,null,null,"MAIN MENU"]
[null,"create INIT menu to initialize clock sync… invoke DOS command?",null,"))",null,null,null,null,"INITIALIZE","Synchronize computer clock and set <Formula><Iteration> ON."]
[null,"update absolute value of UTC time cell after keying EXCH data.",null,null,null,null,null,null,"HEADER"]
[null,"create separate interface for data entry (for flexible function interface) and QSO DB",null,null,null,null,null,null,null,"CATEGORY INFO"]
["done","check and make range names and list for hidden cells used as calculation references",null,null,null,null,null,null,null,"UPLOAD","LICENSE"]
[null,null,"grouped, to be hidden from column N onwards",null,null,null,null,null,null,null,"OTHER REQMTS"]
[null,"create temporary button for <Protect/Unprotect> for all worksheets in-progress mode"]
[null,"create common/main menu tab to navigate from one operational worksheet to another",null,null,null,null,null,null,"LIVE ENTRY"]
[null,"create QSO_DB post-contest entry interface. Also must work as Edit interface for Live-contest entry?",null,null,null,null,null,null,null,"FREQ"]
[null,null,"QSO form can be used as post-contest by abling UTC Date-Time entry. Add Search, Add, Delete buttons",null,null,null,null,null,null,"MODE"]
["done",null,"create table for valid UTC dates",null,null,null,null,null,null,"EDIT"]
["done",null,"create array or table for valid UTC time, 4-digit, 24-hr military format","to validate","if date=2026-05-31",null,"time = 0500-2359",null,"POST ENTRY"]
[null,null,null,null,"if date=2026-06-01",null,"time = 0000-0459"]
[null,"=AND(LEN(U14)=4, ISNUMBER(--U14), VALUE(RIGHT(U14,2))<=59, IF(T14=DATE(2026,5,31), AND(VALUE(LEFT(U14,2))>=5, VALUE(LEFT(U14,2))<=23), IF(T14=DATE(2026,6,1), AND(VALUE(LEFT(U14,2))>=0, VALUE(LEFT(U14,2))<=4), FALSE)))"]
[]
[null,"In QSO Form window",null,null,null,null,null,null,null,null,null,"<--- Operation mode, not yet functional."]
["done",1,"Editing Freq/mode. Constrain cell movement to Freq and Mode only. Change cell color to white on desired field"]
["done",2,"Editing CALL2/Exch2. Constrain cell movement to CALL2 and Exch2 only. Change cell color to white on desired field",null,null,null,null,null,"4. Suggested Frequencies "]
["done",3,"create Frequency table",null,null,null,null,null,"• 6 meters ",null,null,null,"• 70 centimeters "]
["done",4,"create Mode list, with depency on Frequency list. See 4. Suggest Frequencies/Modes",null,null,null,null,null,"o CW (U14A): 50.000 – 50.110 MHz ",null,null,null,"o CW (U14A): 432.020 – 432.980 MHz "]
["done",5,"create message line to trap data entry errors: ",null,null,null,null,null,"o SSB (J3E): 50.111 – 50.250 MHz ",null,null,null,"o SSB (J3E): 433.020 – 433.980 MHz "]
["done",null,"blank Freq, blank Mode, Dupe, blank CALL2, blank Exch2. To enable <Add QSO> button, all error_messages must be blank.",null,null,null,null,null,"• 2 meters ",null,null,null,"o FM (F3E): 434.020 – 434.800 MHz, 438.020 – 439.980 MHz"]
["done",6,"There are some Operational Notes after line 15. with <Hide/Display> button.",null,null,null,null,null,"o CW (U14A): 144.030 – 144.099 MHz ",null,null,null,"• 23 centimeters "]
["done",7,"Exch2- must be, 3-digit with leading zeroes","to validate","=AND(LEN(Exch2)=3, ISNUMBER(--Exch2))",null,null,null,"o SSB (J3E): 144.100 – 144.199 MHz ",null,null,null,"o FM (F3E): 1240.020 – 1258.000 MHz, 1270.020 – 1299.000 MHz"]
["done",8,"display/hide Philippine date/time? During clock time synchronization?",null,null,null,null,null,"o FM (F3E): 144.200 – 144.980 MHz, 145.020 – 145.780 MHz "]
["done",9,"macro button for Post-Contest QSO entry:"]
["done",null,"enable Dupe check routine when <Add/Update> button is clicked",null,null,null,null,null,"Rules:"]
["done",null,"Unprotect",null,null,null,null,null,1,"see for Rule 4, if mode SSB can be changed to PH."]
["done",null,"Hide <Edit Freq/Mode> and <Edit CALL2/Exch2> buttons",null,null,null,null,null,2,"for submission, naming convention for submitted files… for cabrillo, license copy and/or option to submit Excel file?"]
["done",null,"copy post-contest Date-Time input range to Date-Time ",null,null,null,null,null,3,"how to treat contacts that do not submit logs?"]
["done",null,"Add <Search>, <Delete> macro buttons"]
["done",null,"Display <Search>, <Update>, <Delete>, with \"Post-Contest QSO Update\" as interface header",null,null,null,null,null,"=AND("]
[null,null,"For <Search> button, enable multiple line display and provide selection procedure to identify exact line [QSO#].",null,null,null,null,null,"  LEN(U14)=4,"]
[null,null,"create macro for <Search>, <Delete>,<Update>",null,null,null,null,null,"  ISNUMBER(--U14),"]
[null,10,"to define Exchange description, e.g. Serial, Zip, Age, Zone, etc.",null,null,null,null,null,"  VALUE(RIGHT(U14,2))<=59,"]
[null,11,"upload/create/edit table of call/handle/QTH/GPS/ZIP?",null,null,null,null,null,"  IF("]
[null,12,"devise validation procedure for CALL2- for local, check NTC format. For foreign, no idea yet.",null,null,null,null,null,"    T14=DATE(2026,5,31),"]
[null,null,null,null,null,null,null,null,"    AND(VALUE(LEFT(U14,2))>=5, VALUE(LEFT(U14,2))<=24),"]
[null,null,null,null,null,null,null,null,"    IF("]
[null,"In Header Info window:",null,null,null,null,null,null,"      T14=DATE(2026,6,1),"]
["done",1,"line for GPS entry",null,null,null,null,null,"      AND(VALUE(LEFT(U14,2))>=0, VALUE(LEFT(U14,2))<=4),"]
["done",2,"embed/insert button for License copy",null,null,null,null,null,"      FALSE"]
["done",3,"change cell color to white when editing cell for data entry focus",null,null,null,null,null,"    )"]
["done",4,"disable entry in Operators if Cat-Op is not Multi-Op",null,null,null,null,null,"  )"]
["done",5,"enable to edit contest name",null,null,null,null,null,")"]
[null,6,"create table for local and international district/country code"]
[]
["GRID LOCATOR TO GPS AND DISTANCE IN KM between 2 GPS."]
[]
[null,"LAT","LONG","LAT","LONG","km","CALL","STREET","Bgy. 1","CITY","PROVINCE","ZIP"]
["PK04JU",{"$f":"((CODE(MID(UPPER(A55),2,1))-65)*10-90 +VALUE(MID(A55,4,1))*1 +(CODE(MID(A55,6,1))-65)*(2.5/60) +(1.25/60))","v":14.854166666666668},{"$f":"((CODE(MID(UPPER(A55),1,1))-65)*20-180 +VALUE(MID(A55,3,1))*2 +(CODE(MID(A55,5,1))-65)*(5/60) +(2.5/60))","v":120.79166666666667},14.8125,120.875,{"$f":"2*6371*ASIN(SQRT( SIN(RADIANS((D55-B55)/2))^2 + COS(RADIANS(B55))*COS(RADIANS(D55))* SIN(RADIANS((E55-C55)/2))^2))","v":10.084720810575741},"4F3PH","58 Enriquez St","Caingin","Malolos","Bulacan",3000]
["PK04MS",{"$f":"((CODE(MID(UPPER(A56),2,1))-65)*10-90 +VALUE(MID(A56,4,1))*1 +(CODE(MID(A56,6,1))-65)*(2.5/60) +(1.25/60))","v":14.770833333333334},{"$f":"((CODE(MID(UPPER(A56),1,1))-65)*20-180 +VALUE(MID(A56,3,1))*2 +(CODE(MID(A56,5,1))-65)*(5/60) +(2.5/60))","v":121.04166666666667},null,null,null,"DU1BA","B18 L34 Shelterville Subd","Bagumbong","North Caloocan","MM",1421]
["PK04LS",14.770833333333334,120.95833333333334,null,null,null,"4F3REY","#42 Melchor St","Lias","Marilao","Bulacan",3019]
["PK04LQ",14.6875,120.95833333333334,null,null,null,"DV2RCQ","Fr. Umel St.","Bgy. 1","San Fernando City","La Union",2500]
["PK04LT",14.8125,120.95833333333334,null,null,null,"DW3RDR","803 Ibayo","San Gabriel","Sta. Maria","Bulacan","2 coo"]
["PK04KT",14.8125,120.875,14.854166666666668,120.79166666666667,{"$f":"2*6371*ASIN(SQRT( SIN(RADIANS((D60-B60)/2))^2 + COS(RADIANS(B60))*COS(RADIANS(D60))* SIN(RADIANS((E60-C60)/2))^2))","v":10.084720810575741},"DW3HRO","396","Tuktukan","Guiginto","Bulacan",3015]
["PK04LR",14.729166666666668,120.95833333333334,null,null,null,"DY3UPZ","373 Cadena de Amor St.","Saluysoy","Meycauayan","Bulacan",3020]
["PK04LO",14.604166666666668,120.95833333333334]
[]
[null,"6-character (Subsquare) — e.g., PK04JU",null,"estimated difference from center:"]
[null,"Longitude: 5′ (minutes) ≈ ~9.3 km",null,{"$f":"2.5/60","v":4.1666666666666664E-2}]
[null,"Latitude: 2.5′ ≈ ~4.6 km",null,{"$f":"1.25/60","v":2.0833333333333332E-2}]
[null,"👉 Most commonly used in ham radio"]
[]
[null,"🟢 8-character (Extended) — e.g., PK04JU12"]
[null,"Longitude: 0.5′ ≈ ~0.93 km"]
[null,"Latitude: 0.25′ ≈ ~0.46 km"]
[null,"👉 Street / neighborhood level"]
[]
[]
[null,null,null,null,null,null,null,"<Search CALL2>, <Delete>, <Update> not yet functional in Post-Contest Logger"]
[]
[null,null,"In Live QSO Entry interface, default cursor position is in CALL2 field."]
[null,null,"Most of the time, only CALL2 and Exch2 are required."]
[null,null,"FREQ or MODE are based on initial or previous input."]
[null,null,"To edit, use <Arrow> or <Enter> key to go to the desired field."]
[null,null,"Active cell is highlighted with white background color."]
[null,null,"To add current QSO line, click <Add QSO> button."]
[null,null,"1. RUN station will call CQ, announcing CALL1 sign 1-3x in phonetics, until an S&P breaks in. "]
[null,null,"2. S&P station will break-in, also announcing their call sign in phonetics."]
[null,null,"3. RUN station, enters CALL2 and responds by giving his CALL1 again in phonetics, with RS(T)1 and Exch1."]
[null,null,"4. S&P station will confirm CALL1, RS(T)1 and Exch1. Then, also gives his CALL2, RST(2) and Exch2."]
[null,null,"5. RUN station will confimr CALL2, RS(T)2 and Exch2. Clicks <Add QSO>  button. Then repeat step 1."]
[]
[null,null,"Othe Notes:"]
[null,null,"Exch data are 3-digit serial sequence of currently contacted stations, with leading zeroes. Where Exch1 is for CALL1, and Exch2 is for CALL2"]
[null,null,"RS(T) is Radio Signal(Tone)… system assigned. For CW QSOs, it is 599. Else, RS(T)=59."]

{"sheet":"Cabrillo instructions","index":5,"n_rows":602,"n_cols":8,"rows_kept":602,"cut":false,"hidden":true,"merged":[]}
["To convert Excel data to cabrillo format:"]
[1,"check all data for accuracy and completeness"]
[2,"click <Cabrillo> tabsheet"]
[3,"execute <File><Save as>, using same folder as this input file"]
[4,"type in your callsign as the File Name"]
[5,"in <Save as File type>, click the drop-down arrow, choose \"Text (tab delimited) *.txt\""]
[6,"click <Save>"]
[7,"if file is already existing, make sure you really want to replace it before clicking <Yes>."]
[8,"to save the active sheet only, click <OK>"]
[9,"confirm using Text (tab delimited) format by clicking <Yes>"]
[10,"close the current sheet without saving, to maintain its input format."]
[]
["11 in your preferred file management application, e.g. File Explorer, DOS prompt"]
[null,"rename the saved file by changing its extension, from .txt to .log"]
[null,".log is the standard extension for a cabrillo file name. "]
[]
[null,"excel macro to convert worksheet to a text file with *.log as extension with the following tasks:"]
[null,"use worksheet \"Cabrillo\""]
[null,"save as Text (Tab delimited)"]
[null,"path is same as this workbook"]
[null,"store path name to Range(\"PathName\")"]
[null,"filename is in Range(\"callsign\")"]
[null,"rename the file saved with *.log extension"]
[null,"close the workbook without saving"]
[]
[]
[]
[]
[null,"excel macro to convert worksheet to a text file with *.log as extension with the following tasks:"]
[null,"use worksheet \"Cabrillo\""]
[null,"save as Text (Tab delimited)"]
[null,"path is same as this workbook"]
[null,"store path name to Range(\"PathName\")"]
[null,"filename is in Range(\"callsign\")"]
[null,"rename the file saved with *.log extension"]
[null,"close the workbook without saving"]
[]
[null,"Here’s a clean, production-ready VBA macro that performs exactly what you described:"]
[]
[null,"? What it does:"]
[null,"Uses worksheet \"Cabrillo\""]
[]
[null,"Saves it as Tab-delimited text"]
[]
[null,"Saves in the same folder as the workbook"]
[]
[null,"Stores the full path in Range(\"PathName\")"]
[]
[null,"Uses filename from Range(\"callsign\")"]
[]
[null,"Renames output to .log"]
[]
[null,"Closes workbook without saving changes"]
[]
[null,"?? VBA Macro"]
[null,"Sub ExportCabrilloToLog()"]
[]
[null,"    Dim wb As Workbook"]
[null,"    Dim ws As Worksheet"]
[null,"    Dim filePath As String"]
[null,"    Dim fileName As String"]
[null,"    Dim tempTxt As String"]
[null,"    Dim finalLog As String"]
[]
[null,"    ' Reference workbook and sheet"]
[null,"    Set wb = ThisWorkbook"]
[null,"    Set ws = wb.Sheets(\"Cabrillo\")"]
[]
[null,"    ' Get path and filename"]
[null,"    filePath = wb.Path & \"\\\""]
[null,"    fileName = wb.Names(\"callsign\").RefersToRange.Value"]
[]
[null,"    ' Temporary .txt file and final .log file"]
[null,"    tempTxt = filePath & fileName & \".txt\""]
[null,"    finalLog = filePath & fileName & \".log\""]
[]
[null,"    ' Store full path in Range(\"PathName\")"]
[null,"    wb.Names(\"PathName\").RefersToRange.Value = finalLog"]
[]
[null,"    ' Copy sheet to new workbook (required for text export)"]
[null,"    ws.Copy"]
[null,"    With ActiveWorkbook"]
[]
[null,"        ' Save as tab-delimited text"]
[null,"        Application.DisplayAlerts = False"]
[null,"        .SaveAs Filename:=tempTxt, FileFormat:=xlText"]
[null,"        Application.DisplayAlerts = True"]
[]
[null,"        ' Close temp workbook"]
[null,"        .Close SaveChanges:=False"]
[null,"    End With"]
[]
[null,"    ' Rename .txt to .log"]
[null,"    If Dir(finalLog) <> \"\" Then Kill finalLog"]
[null,"    Name tempTxt As finalLog"]
[]
[null,"    ' Close original workbook WITHOUT saving"]
[null,"    wb.Close SaveChanges:=False"]
[]
[null,"End Sub"]
[null,"?? Notes & Tips"]
[null,"? ws.Copy creates a temporary workbook (required because Excel saves entire workbook, not single sheet, as text)."]
[]
[null,"? xlText ensures tab-delimited format."]
[]
[null,"? Name tempTxt As finalLog safely renames .txt ? .log."]
[]
[null,"? Application.DisplayAlerts = False avoids overwrite prompts."]
[]
[null,"?? Important"]
[null,"Make sure named ranges exist:"]
[]
[null,"callsign ? contains filename (e.g., DU1ABC)"]
[]
[null,"PathName ? destination cell for full file path"]
[]
[null,"The workbook must be saved first, otherwise wb.Path is empty."]
[]
[null,"?? Optional Enhancements (if you want next)"]
[null,"I can also help you extend this with:"]
[]
[null,"Auto-create folder (e.g., /Logs/)"]
[]
[null,"Validate callsign (no invalid filename characters)"]
[]
[null,"Add Cabrillo header formatting checks"]
[]
[null,"Button-triggered export (linked to a shape)"]
[]
[null,"Just tell me ??"]
[]
[]
[null,"please do:"]
[null,"Auto-create folder (e.g., /Logs/)"]
[null,"Button-triggered export (linked to a shape)"]
[]
[null,"Here’s a clean upgraded version of your macro with both requested features:"]
[]
[null,"? What’s added"]
[null,"?? Auto-creates a /Logs/ folder inside your workbook path"]
[]
[null,"?? Designed to be triggered by a button/shape click"]
[]
[null,"?? Updated VBA Macro"]
[null,"Sub ExportCabrilloToLog()"]
[]
[null,"    Dim wb As Workbook"]
[null,"    Dim ws As Worksheet"]
[null,"    Dim basePath As String"]
[null,"    Dim logFolder As String"]
[null,"    Dim fileName As String"]
[null,"    Dim tempTxt As String"]
[null,"    Dim finalLog As String"]
[]
[null,"    ' Reference workbook and sheet"]
[null,"    Set wb = ThisWorkbook"]
[null,"    Set ws = wb.Sheets(\"Cabrillo\")"]
[]
[null,"    ' Base path"]
[null,"    basePath = wb.Path & \"\\\""]
[null,"    logFolder = basePath & \"Logs\\\""]
[]
[null,"    ' ? Create /Logs/ folder if it does not exist"]
[null,"    If Dir(logFolder, vbDirectory) = \"\" Then"]
[null,"        MkDir logFolder"]
[null,"    End If"]
[]
[null,"    ' Get filename from named range"]
[null,"    fileName = wb.Names(\"callsign\").RefersToRange.Value"]
[]
[null,"    ' Build file paths"]
[null,"    tempTxt = logFolder & fileName & \".txt\""]
[null,"    finalLog = logFolder & fileName & \".log\""]
[]
[null,"    ' Store full path in Range(\"PathName\")"]
[null,"    wb.Names(\"PathName\").RefersToRange.Value = finalLog"]
[]
[null,"    ' Copy sheet to new workbook"]
[null,"    ws.Copy"]
[null,"    With ActiveWorkbook"]
[]
[null,"        Application.DisplayAlerts = False"]
[]
[null,"        ' Save as tab-delimited text"]
[null,"        .SaveAs Filename:=tempTxt, FileFormat:=xlText"]
[]
[null,"        Application.DisplayAlerts = True"]
[]
[null,"        ' Close temp workbook"]
[null,"        .Close SaveChanges:=False"]
[null,"    End With"]
[]
[null,"    ' Rename .txt ? .log"]
[null,"    If Dir(finalLog) <> \"\" Then Kill finalLog"]
[null,"    Name tempTxt As finalLog"]
[]
[null,"    ' Close original workbook WITHOUT saving"]
[null,"    wb.Close SaveChanges:=False"]
[]
[null,"End Sub"]
[null,"?? How to Assign This Macro to a Shape (Button)"]
[null,"Step-by-step:"]
[null,"Go to Insert ? Shapes"]
[]
[null,"Choose a shape (e.g., rectangle or button style)"]
[]
[null,"Draw it on your sheet"]
[]
[null,"Right-click the shape ? Assign Macro…"]
[]
[null,"Select:"]
[]
[null,"ExportCabrilloToLog"]
[null,"Click OK"]
[]
[null,"? Optional: Make the Button Dynamic (Pro Tip)"]
[null,"You can rename the shape and even control behavior:"]
[]
[null,"Example: Rename the shape"]
[null,"Select shape"]
[]
[null,"In Name Box (top-left), type:"]
[]
[null,"btnExportLog"]
[null,"Optional VBA (advanced)"]
[null,"Sub HighlightExportButton()"]
[null,"    With Sheets(\"Cabrillo\").Shapes(\"btnExportLog\")"]
[null,"        .Fill.ForeColor.RGB = RGB(0, 176, 80) ' Green"]
[null,"    End With"]
[null,"End Sub"]
[null,"?? Good Practice Checks"]
[null,"Before running:"]
[]
[null,"? Workbook is saved"]
[]
[null,"? Named ranges exist:"]
[]
[null,"callsign"]
[]
[null,"PathName"]
[]
[null,"? Callsign has valid filename characters (no / \\ : * ? \" < > |)"]
[]
[null,"?? If you want next level"]
[null,"I can upgrade this into a full Cabrillo export system, like:"]
[]
[null,"Auto-format Cabrillo log structure"]
[]
[null,"Validate QSO lines before export"]
[]
[null,"Add timestamp-based filenames"]
[]
[null,"Multi-band logging export"]
[]
[null,"Just say the word ??"]
[]
[]
[null,"please Add timestamp-based filenames"]
[]
[null,"Great idea—timestamped filenames make your logs unique and traceable ??"]
[]
[null,"Here’s your enhanced macro with timestamp-based filenames added cleanly."]
[]
[null,"? What’s new"]
[null,"Adds timestamp format: YYYYMMDD_HHMMSS"]
[]
[null,"Example output:"]
[]
[null,"DU1ABC_20260327_154530.log"]
[null,"?? Updated VBA Macro (with Timestamp)"]
[null,"Sub ExportCabrilloToLog()"]
[]
[null,"    Dim wb As Workbook"]
[null,"    Dim ws As Worksheet"]
[null,"    Dim basePath As String"]
[null,"    Dim logFolder As String"]
[null,"    Dim fileName As String"]
[null,"    Dim timeStamp As String"]
[null,"    Dim tempTxt As String"]
[null,"    Dim finalLog As String"]
[]
[null,"    ' Reference workbook and sheet"]
[null,"    Set wb = ThisWorkbook"]
[null,"    Set ws = wb.Sheets(\"Cabrillo\")"]
[]
[null,"    ' Base path"]
[null,"    basePath = wb.Path & \"\\\""]
[null,"    logFolder = basePath & \"Logs\\\""]
[]
[null,"    ' Create /Logs/ folder if needed"]
[null,"    If Dir(logFolder, vbDirectory) = \"\" Then"]
[null,"        MkDir logFolder"]
[null,"    End If"]
[]
[null,"    ' Get callsign"]
[null,"    fileName = wb.Names(\"callsign\").RefersToRange.Value"]
[]
[null,"    ' ? Generate timestamp (safe for filenames)"]
[null,"    timeStamp = Format(Now, \"yyyymmdd_hhnnss\")"]
[]
[null,"    ' Build file paths with timestamp"]
[null,"    tempTxt = logFolder & fileName & \"_\" & timeStamp & \".txt\""]
[null,"    finalLog = logFolder & fileName & \"_\" & timeStamp & \".log\""]
[]
[null,"    ' Store full path in Range(\"PathName\")"]
[null,"    wb.Names(\"PathName\").RefersToRange.Value = finalLog"]
[]
[null,"    ' Copy sheet to new workbook"]
[null,"    ws.Copy"]
[null,"    With ActiveWorkbook"]
[]
[null,"        Application.DisplayAlerts = False"]
[]
[null,"        ' Save as tab-delimited text"]
[null,"        .SaveAs Filename:=tempTxt, FileFormat:=xlText"]
[]
[null,"        Application.DisplayAlerts = True"]
[]
[null,"        ' Close temp workbook"]
[null,"        .Close SaveChanges:=False"]
[null,"    End With"]
[]
[null,"    ' Rename .txt ? .log"]
[null,"    Name tempTxt As finalLog"]
[]
[null,"    ' Close original workbook WITHOUT saving"]
[null,"    wb.Close SaveChanges:=False"]
[]
[null,"End Sub"]
[null,"? Timestamp Format Explained"]
[null,"Format(Now, \"yyyymmdd_hhnnss\")"]
[null,"yyyy ? year"]
[]
[null,"mm ? month"]
[]
[null,"dd ? day"]
[]
[null,"hh ? hour"]
[]
[null,"nn ? minutes"]
[]
[null,"ss ? seconds"]
[]
[null,"? Uses nn (not mm) for minutes—this is a common VBA gotcha"]
[]
[null,"?? Optional Variations"]
[null,"If you want different styles:"]
[]
[null,"1. Short version"]
[null,"Format(Now, \"yymmdd_hhnn\")"]
[null,"2. ISO-style (readable)"]
[null,"Format(Now, \"yyyy-mm-dd_hh-nn-ss\")"]
[null,"?? Pro Upgrade (optional next step)"]
[null,"If you want, I can extend this further to:"]
[]
[null,"Prevent duplicate exports within same second"]
[]
[null,"Add contest name / band into filename"]
[]
[null,"Automatically open the .log after export"]
[]
[null,"Keep workbook open (instead of closing)"]
[]
[null,"Just tell me ??"]
[]
[]
[null,"please extend with option to exit or open the .log after export"]
[]
[null,"Nice upgrade—this makes your tool feel much more “complete” ??"]
[]
[null,"Below is a professional version that:"]
[]
[null,"? Exports with timestamp"]
[]
[null,"? Saves to /Logs/"]
[]
[null,"? Prompts user after export:"]
[]
[null,"Yes ? Open the .log file"]
[]
[null,"No ? Exit quietly"]
[]
[null,"Cancel ? Keep workbook open (no close)"]
[]
[null,"?? Final Enhanced VBA Macro"]
[null,"Sub ExportCabrilloToLog()"]
[]
[null,"    Dim wb As Workbook"]
[null,"    Dim ws As Worksheet"]
[null,"    Dim basePath As String"]
[null,"    Dim logFolder As String"]
[null,"    Dim fileName As String"]
[null,"    Dim timeStamp As String"]
[null,"    Dim tempTxt As String"]
[null,"    Dim finalLog As String"]
[null,"    Dim userChoice As VbMsgBoxResult"]
[]
[null,"    ' Reference workbook and sheet"]
[null,"    Set wb = ThisWorkbook"]
[null,"    Set ws = wb.Sheets(\"Cabrillo\")"]
[]
[null,"    ' Ensure workbook is saved"]
[null,"    If wb.Path = \"\" Then"]
[null,"        MsgBox \"Please save the workbook first.\", vbExclamation"]
[null,"        Exit Sub"]
[null,"    End If"]
[]
[null,"    ' Base path"]
[null,"    basePath = wb.Path & \"\\\""]
[null,"    logFolder = basePath & \"Logs\\\""]
[]
[null,"    ' Create /Logs/ folder if needed"]
[null,"    If Dir(logFolder, vbDirectory) = \"\" Then"]
[null,"        MkDir logFolder"]
[null,"    End If"]
[]
[null,"    ' Get callsign"]
[null,"    fileName = wb.Names(\"callsign\").RefersToRange.Value"]
[]
[null,"    ' Generate timestamp"]
[null,"    timeStamp = Format(Now, \"yyyymmdd_hhnnss\")"]
[]
[null,"    ' Build file paths"]
[null,"    tempTxt = logFolder & fileName & \"_\" & timeStamp & \".txt\""]
[null,"    finalLog = logFolder & fileName & \"_\" & timeStamp & \".log\""]
[]
[null,"    ' Store full path"]
[null,"    wb.Names(\"PathName\").RefersToRange.Value = finalLog"]
[]
[null,"    ' Copy sheet to new workbook"]
[null,"    ws.Copy"]
[null,"    With ActiveWorkbook"]
[]
[null,"        Application.DisplayAlerts = False"]
[null,"        .SaveAs Filename:=tempTxt, FileFormat:=xlText"]
[null,"        Application.DisplayAlerts = True"]
[]
[null,"        .Close SaveChanges:=False"]
[null,"    End With"]
[]
[null,"    ' Rename .txt ? .log"]
[null,"    Name tempTxt As finalLog"]
[]
[null,"    ' Ask user what to do next"]
[null,"    userChoice = MsgBox( _"]
[null,"        \"Export completed:\" & vbCrLf & finalLog & vbCrLf & vbCrLf & _"]
[null,"        \"Do you want to open the log file?\", _"]
[null,"        vbYesNoCancel + vbQuestion, _"]
[null,"        \"Export Successful\")"]
[]
[null,"    Select Case userChoice"]
[]
[null,"        Case vbYes"]
[null,"            ' Open the .log file"]
[null,"            Shell \"notepad.exe \"\"\" & finalLog & \"\"\"\", vbNormalFocus"]
[null,"            wb.Close SaveChanges:=False"]
[]
[null,"        Case vbNo"]
[null,"            ' Just close workbook"]
[null,"            wb.Close SaveChanges:=False"]
[]
[null,"        Case vbCancel"]
[null,"            ' Do nothing, keep workbook open"]
[null,"            Exit Sub"]
[]
[null,"    End Select"]
[]
[null,"End Sub"]
[null,"?? Behavior Summary"]
[null,"User Click","Action"]
[null,"Yes","Opens .log in Notepad + closes workbook"]
[null,"No","Closes workbook"]
[null,"Cancel","Keeps workbook open"]
[null,"?? Optional Enhancements (Highly Recommended)"]
[null,"If you want to make it even more robust:"]
[]
[null,"1. Validate callsign (safe filename)"]
[null,"Prevent errors from invalid characters:"]
[]
[null,"fileName = Replace(fileName, \"/\", \"_\")"]
[null,"fileName = Replace(fileName, \"\\\", \"_\")"]
[null,"fileName = Replace(fileName, \":\", \"_\")"]
[null,"fileName = Replace(fileName, \"*\", \"_\")"]
[null,"fileName = Replace(fileName, \"?\", \"_\")"]
[null,"fileName = Replace(fileName, \"\"\"\", \"_\")"]
[null,"fileName = Replace(fileName, \"<\", \"_\")"]
[null,"fileName = Replace(fileName, \">\", \"_\")"]
[null,"fileName = Replace(fileName, \"|\", \"_\")"]
[null,"2. Open with default app (instead of Notepad)"]
[null,"ThisWorkbook.FollowHyperlink finalLog"]
[null,"3. Status message on sheet (for UI dashboards)"]
[null,"Range(\"Status\").Value = \"Exported: \" & finalLog"]
[null,"If you want next level, I can help you turn this into a full Cabrillo automation system (auto-header generation, QSO validation, contest-ready formatting)."]
[]
[]
[null,"please exit with closing workbook without saving."]
[]
[null,"Got it—you want no prompt at the end and always exit by closing the workbook without saving, while still keeping the export and optional file opening."]
[]
[null,"Here’s the clean final behavior:"]
[]
[null,"? Exports .log with timestamp into /Logs/"]
[]
[null,"? Automatically opens the .log file"]
[]
[null,"? Always closes workbook without saving (no prompt)"]
[]
[null,"?? Final Streamlined VBA Macro"]
[null,"Sub ExportCabrilloToLog()"]
[]
[null,"    Dim wb As Workbook"]
[null,"    Dim ws As Worksheet"]
[null,"    Dim basePath As String"]
[null,"    Dim logFolder As String"]
[null,"    Dim fileName As String"]
[null,"    Dim timeStamp As String"]
[null,"    Dim tempTxt As String"]
[null,"    Dim finalLog As String"]
[]
[null,"    ' Reference workbook and sheet"]
[null,"    Set wb = ThisWorkbook"]
[null,"    Set ws = wb.Sheets(\"Cabrillo\")"]
[]
[null,"    ' Ensure workbook is saved"]
[null,"    If wb.Path = \"\" Then"]
[null,"        MsgBox \"Please save the workbook first.\", vbExclamation"]
[null,"        Exit Sub"]
[null,"    End If"]
[]
[null,"    ' Base path and Logs folder"]
[null,"    basePath = wb.Path & \"\\\""]
[null,"    logFolder = basePath & \"Logs\\\""]
[]
[null,"    ' Create /Logs/ folder if needed"]
[null,"    If Dir(logFolder, vbDirectory) = \"\" Then MkDir logFolder"]
[]
[null,"    ' Get callsign"]
[null,"    fileName = wb.Names(\"callsign\").RefersToRange.Value"]
[]
[null,"    ' (Optional safety cleanup for filename)"]
[null,"    fileName = Replace(fileName, \"/\", \"_\")"]
[null,"    fileName = Replace(fileName, \"\\\", \"_\")"]
[null,"    fileName = Replace(fileName, \":\", \"_\")"]
[null,"    fileName = Replace(fileName, \"*\", \"_\")"]
[null,"    fileName = Replace(fileName, \"?\", \"_\")"]
[null,"    fileName = Replace(fileName, \"\"\"\", \"_\")"]
[null,"    fileName = Replace(fileName, \"<\", \"_\")"]
[null,"    fileName = Replace(fileName, \">\", \"_\")"]
[null,"    fileName = Replace(fileName, \"|\", \"_\")"]
[]
[null,"    ' Timestamp"]
[null,"    timeStamp = Format(Now, \"yyyymmdd_hhnnss\")"]
[]
[null,"    ' Build file paths"]
[null,"    tempTxt = logFolder & fileName & \"_\" & timeStamp & \".txt\""]
[null,"    finalLog = logFolder & fileName & \"_\" & timeStamp & \".log\""]
[]
[null,"    ' Store full path",null,null,null,null,null,"save workbook beween <Store full path> and <Copy sheet to new workbook>"]
[null,"    wb.Names(\"PathName\").RefersToRange.Value = finalLog"]
[]
[null,"    ' Copy sheet to new workbook"]
[null,"    ws.Copy"]
[null,"    With ActiveWorkbook"]
[null,"        Application.DisplayAlerts = False"]
[null,"        .SaveAs Filename:=tempTxt, FileFormat:=xlText"]
[null,"        Application.DisplayAlerts = True"]
[null,"        .Close SaveChanges:=False"]
[null,"    End With"]
[]
[null,"    ' Rename .txt ? .log"]
[null,"    Name tempTxt As finalLog"]
[]
[null,"    ' ? Open the log file (default app)"]
[null,"    ThisWorkbook.FollowHyperlink finalLog"]
[]
[null,"    ' ? Always close workbook WITHOUT saving"]
[null,"    wb.Close SaveChanges:=False"]
[]
[null,"End Sub"]
[]
[null,"?? Final Behavior (Simple & Fast)"]
[null,"Click your button"]
[]
[null,"File is exported ? /Logs/DU1ABC_YYYYMMDD_HHMMSS.log"]
[]
[null,"File opens automatically"]
[]
[null,"Excel closes without saving"]
[]
[null,"?? Optional tweak (if you want silent mode)"]
[null,"If you don’t want the file to open, just remove this line:"]
[]
[null,"ThisWorkbook.FollowHyperlink finalLog"]
[null,"If you want next, I can help you:"]
[]
[null,"Add auto Cabrillo formatting (contest-ready)"]
[]
[null,"Validate QSO lines before export"]
[]
[null,"Or build a one-click contest submission workflow"]
[]
[null,"Just say ??"]

{"sheet":"ZipDB","index":6,"n_rows":2274,"n_cols":4,"rows_kept":2274,"cut":false,"hidden":true,"merged":[]}
["ZIP","BARANGAY/CITY/TOWN/OFFICE","CITY/PROVINCE/CATEGORY","SEQ"]
["0000","Foreign address"," ",0]
["2800","Bangued","Abra",3]
["2815","Boliney","Abra",18]
["2805","Bucay","Abra",8]
["2817","Bucloc","Abra",20]
["2816","Daguioman","Abra",19]
["2825","Danglas","Abra",28]
["2801","Dolores","Abra",4]
["2826","La Paz","Abra",29]
["2821","Lacub","Abra",24]
["2802","Lagangilang","Abra",5]
["2824","Lagayan","Abra",27]
["2807","Langiden","Abra",10]
["2819","Licuan (Baay)","Abra",22]
["2813","Luba","Abra",16]
["2820","Malibcong","Abra",23]
["2810","Manabo","Abra",13]
["2804","Peñarrubia","Abra",7]
["2806","Pidigan","Abra",9]
["2812","Pilar","Abra",15]
["2818","Sallapadan","Abra",21]
["2809","San Isidro","Abra",12]
["2823","San Juan","Abra",26]
["2808","San Quintin","Abra",11]
["2803","Tayum","Abra",6]
["2822","Tineg","Abra",25]
["2814","Tubo","Abra",17]
["2811","Villaviciosa","Abra",14]
["8601","Buenavista","Agusan del Norte",38]
["8600","Butuan City","Agusan del Norte",37]
["8605","Cabadbaran City","Agusan del Norte",41]
["8603","Carmen","Agusan del Norte",40]
["8607","Jabonga","Agusan del Norte",47]
["8609","Kitcharao","Agusan del Norte",49]
["8610","Las Nieves","Agusan del Norte",50]
["8604","Magallanes","Agusan del Norte",42]
["8602","Nasipit","Agusan del Norte",39]
["8611","Remedios T. Romualdez","Agusan del Norte",51]
["8608","Santiago","Agusan del Norte",48]
["8606","Tubay","Agusan del Norte",46]
["8502","Bayugan","Agusan del Sur",63]
["8506","Bunawan","Agusan del Sur",67]
["8513","Esperanza","Agusan del Sur",77]
["8508","La Paz","Agusan del Sur",72]
["8507","Loreto","Agusan del Sur",71]
["8500","Prosperidad","Agusan del Sur",61]
["8504","Rosario","Agusan del Sur",65]
["8501","San Francisco","Agusan del Sur",62]
["8511","San Luis","Agusan del Sur",75]
["8512","Santa Josefa","Agusan del Sur",76]
["8503","Sibagat","Agusan del Sur",64]
["8510","Talacogon","Agusan del Sur",74]
["8505","Trento","Agusan del Sur",66]
["8509","Veruela","Agusan del Sur",73]
["5616","Altavas","Aklan",87]
["5614","Balete","Aklan",88]
["5601","Banga","Aklan",89]
["5615","Batan","Aklan",90]
["5609","Buruanga","Aklan",91]
["5613","Ibajay","Aklan",95]
["5600","Kalibo","Aklan",96]
["5605","Lezo","Aklan",97]
["5602","Libacao","Aklan",98]
["5603","Madalag","Aklan",99]
["5611","Makato","Aklan",100]
["5608","Malay","Aklan",104]
["5606","Malinao","Aklan",105]
["5607","Nabas","Aklan",106]
["5610","New Washington","Aklan",107]
["5604","Numancia","Aklan",108]
["5612","Tangalan","Aklan",109]
["4509","Bacacay","Albay",119]
["4502","Camalig","Albay",120]
["4501","Daraga (Locsin)","Albay",121]
["4503","Guinobatan","Albay",122]
["4515","Jovellar","Albay",123]
["4500","Legazpi City","Albay",124]
["4507","Libon","Albay",128]
["4504","Ligao City","Albay",129]
["4510","Malilipot","Albay",130]
["4512","Malinao","Albay",131]
["4514","Manito","Albay",132]
["4505","Oas","Albay",133]
["4516","Pio Duran (Malacbalac)","Albay",137]
["4506","Polangui","Albay",138]
["4517","Rapu-Rapu","Albay",139]
["4508","Santo Domingo","Albay",140]
["4511","Tabaco City","Albay",141]
["4513","Tiwi","Albay",142]
["5717","Anini-y","Antique",152]
["5706","Barbaza","Antique",153]
["5701","Belison","Antique",154]
["5704","Bugasong","Antique",155]
["5711","Caluya","Antique",156]
["5708","Culasi","Antique",157]
["5715","Hamtic","Antique",161]
["5705","Laua-an","Antique",162]
["5710","Libertad","Antique",163]
["5712","Pandan","Antique",164]
["5702","Patnongon","Antique",165]
["5700","San Jose","Antique",166]
["5714","San Remigio","Antique",170]
["5709","Sebaste","Antique",171]
["5713","Sibalom","Antique",172]
["5707","Tibiao","Antique",173]
["5716","Tobias Fornier (Dao)","Antique",174]
["5703","Valderrama","Antique",175]
["3814","Calanasan (Bayag)","Apayao",181]
["3807","Conner","Apayao",182]
["3810","Flora","Apayao",183]
["3809","Kabugao","Apayao",184]
["3813","Luna","Apayao",185]
["3812","Pudtol","Apayao",186]
["3811","Santa Marcela","Apayao",187]
["3200","Baler","Aurora",195]
["3204","Casiguran","Aurora",196]
["3205","Dilasag","Aurora",197]
["3206","Dinalungan","Aurora",198]
["3207","Dingalan","Aurora",202]
["3203","Dipaculao","Aurora",203]
["3202","Maria Aurora","Aurora",204]
["3201","San Luis","Aurora",205]
["7308","Froilie","Basilan",225]
["7300","Isabela City","Basilan",215]
["7302","Lamitan City","Basilan",217]
["7301","Lantawan","Basilan",216]
["7303","Maluso","Basilan",218]
["7305","Sumisip","Basilan",223]
["7304","Tipo-Tipo","Basilan",222]
["7306","Tuburan","Basilan",224]
["2114","Abucay","Bataan",235]
["2107","Bagac","Bataan",236]
["2100","Balanga City","Bataan",237]
["2110","Dinalupihan","Bataan",239]
["2111","Hermosa","Bataan",243]
["2104","Lamao","Bataan",244]
["2103","Limay","Bataan",245]
["2105","Mariveles","Bataan",246]
["2106","Mariveles (Bataan Export Processing Zone)","Bataan",238]
["2108","Morong","Bataan",247]
["2109","Morong (Refugee Processing Center)","Bataan",254]
["2112","Orani","Bataan",251]
["2102","Orion","Bataan",252]
["2101","Pilar","Bataan",253]
["2113","Samal","Bataan",255]
["3905","Itbayat","Batanes",266]
["3902","Ivana","Batanes",267]
["3901","Mahatao","Batanes",271]
["3904","Sabtang","Batanes",272]
["3900","titi","Batanes",265]
["3903","Uyugan","Batanes",273]
["4211","Agoncillo","Batangas",283]
["4205","Alitagtag","Batangas",284]
["4213","Balayan","Batangas",285]
["4219","Balete","Batangas",286]
["4200","Batangas City","Batangas",287]
["4201","Bauan","Batangas",288]
["4212","Calaca","Batangas",289]
["4215","Calatagan, incl. Punta Baluarte","Batangas",290]
["4222","Cuenca","Batangas",291]
["4218","Fernando Airbase","Batangas",292]
["4230","Ibaan","Batangas",293]
["4221","Laurel, incl. Diokno Highway","Batangas",297]
["4209","Lemery","Batangas",298]
["4216","Lian, incl. Matabungkay","Batangas",299]
["4217","Lipa City","Batangas",300]
["4229","Lobo, incl. Laiya","Batangas",301]
["4202","Mabini","Batangas",302]
["4233","Malvar","Batangas",303]
["4223","Mataas na Kahoy","Batangas",304]
["4231","Nasugbu, incl. Punta Fuego and Calaruega","Batangas",305]
["4224","Padre Garcia","Batangas",306]
["4225","Rosario","Batangas",307]
["4227","San Jose","Batangas",308]
["4226","San Juan","Batangas",312]
["4210","San Luis","Batangas",313]
["4207","San Nicolas","Batangas",314]
["4204","San Pascual","Batangas",315]
["4206","Santa Teresita","Batangas",316]
["4234","Santo Tomas","Batangas",317]
["4208","Taal","Batangas",318]
["4220","Talisay","Batangas",319]
["4232","Tanauan City","Batangas",320]
["4228","Taysan","Batangas",321]
["4203","Tingloy","Batangas",322]
["4214","Tuy","Batangas",323]
["2612","Atok","Benguet",333]
["2600","Baguio City","Benguet",334]
["2610","Bakun","Benguet",335]
["2605","Bokod","Benguet",336]
["2607","Buguias","Benguet",337]
["2604","Itogon","Benguet",341]
["2606","Kabayan","Benguet",342]
["2613","Kapangan","Benguet",343]
["2611","Kibungan","Benguet",344]
["2601","La Trinidad, including Pico","Benguet",345]
["2609","Lepanto, Mankayan","Benguet",349]
["2608","Mankayan","Benguet",350]
["2602","Philippine Military Academy","Benguet",351]
["2614","Sablan","Benguet",352]
["2603","Tuba, including Marcos Highway and Kennon Road","Benguet",353]
["2615","Tublay","Benguet",354]
["0733","739: Not used","Big users",1649]
["0770","ACCRA Law Offices","Big users",1653]
["0716","Allied Bank","Big users",1632]
["0710","American Express","Big users",1626]
["0401","Asian Development Bank","Big users",2294]
["0790","Atlantic, Gulf and Pacific","Big users",1656]
["0709","A-Z Direct Marketing","Big users",1625]
["0720","Bank of the Philippine Islands","Big users",1636]
["0731","BCD Direct Marketing","Big users",1647]
["0420","Bible School on the Air","Big users",2296]
["0713","BPI Family Savings Bank","Big users",1629]
["0707","Canadian Embassy","Big users",1623]
["0702","Citibank","Big users",1618]
["0701","Colgate Palmolive Philippines","Big users",1617]
["0717","Diners Club","Big users",1633]
["0788","Directories Pilipinas Corporation","Big users",1655]
["0726","Equitable PCI Bank","Big users",1642]
["0732","Export and Industry Bank","Big users",1648]
["0706","Faith Embassy","Big users",1622]
["0560","Far East Broadcasting Corporation","Big users",2359]
["0550","Febias College of Bible","Big users",2360]
["1530","Greenhills P.O. Box Nos. 1000 to 1099","Big users",2300]
["1531","Greenhills P.O. Box Nos. 1100 to 1199","Big users",2301]
["1532","Greenhills P.O. Box Nos. 1200 to 1299","Big users",2302]
["1533","Greenhills P.O. Box Nos. 1300 to 1399","Big users",2303]
["1534","Greenhills P.O. Box Nos. 1400 to 1499","Big users",2304]
["1535","Greenhills P.O. Box Nos. 1500 to 1599","Big users",2305]
["1536","Greenhills P.O. Box Nos. 1600 to 1699","Big users",2306]
["0725","Insular Life Assurance Company","Big users",1641]
["0718","International Center for Aquatic Resources","Big users",1634]
["0400","International Correspondence School","Big users",2293]
["0723","Japanese Embassy","Big users",1639]
["0711","Land Bank of the Philippines","Big users",1627]
["1250","Makati CPO-PO Box# 1000 to 1099","Big users",1660]
["1251","Makati CPO-PO Box# 1100 to 1199","Big users",1661]
["1252","Makati CPO-PO Box# 1200 to 1299","Big users",1662]
["1253","Makati CPO-PO Box# 1300 to 1399","Big users",1663]
["1254","Makati CPO-PO Box# 1400 to 1499","Big users",1664]
["1255","Makati CPO-PO Box# 1500 to 1599","Big users",1665]
["1256","Makati CPO-PO Box# 1600 to 1699","Big users",1666]
["1257","Makati CPO-PO Box# 1700 to 1799","Big users",1667]
["1258","Makati CPO-PO Box# 1800 to 1899","Big users",1668]
["1259","Makati CPO-PO Box# 1900 to 1999","Big users",1669]
["1260","Makati CPO-PO Box# 2000 to 2099","Big users",1670]
["1261","Makati CPO-PO Box# 2100 to 2199","Big users",1671]
["1262","Makati CPO-PO Box# 2200 to 2299","Big users",1672]
["1263","Makati CPO-PO Box# 2300 to 2399","Big users",1673]
["1264","Makati CPO-PO Box# 2400 to 2499","Big users",1674]
["1265","Makati CPO-PO Box# 2500 to 2599","Big users",1675]
["1266","Makati CPO-PO Box# 2600 to 2699","Big users",1676]
["1267","Makati CPO-PO Box# 2700 to 2799","Big users",1677]
["1268","Makati CPO-PO Box# 2800 to 2899","Big users",1678]
["1269","Makati CPO-PO Box# 2900 to 2999","Big users",1679]
["1270","Makati CPO-PO Box# 3000 to 3099","Big users",1680]
["1271","Makati CPO-PO Box# 3100 to 3199","Big users",1681]
["1272","Makati CPO-PO Box# 3200 to 3299","Big users",1682]
["1273","Makati CPO-PO Box# 3300 to 3399","Big users",1683]
["1274","Makati CPO-PO Box# 3400 to 3499","Big users",1684]
["1275","Makati CPO-PO Box# 3500 to 3599","Big users",1685]
["1276","Makati CPO-PO Box# 3600 to 3699","Big users",1686]
["1277","Makati CPO-PO Box# 3700 to 3799","Big users",1687]
["1278","Makati CPO-PO Box# 3800 to 3899","Big users",1688]
["1279","Makati CPO-PO Box# 3900 to 3999","Big users",1689]
["1280","Makati CPO-PO Box# 4000 to 4099","Big users",1690]
["1281","Makati CPO-PO Box# 4100 to 4199","Big users",1691]
["1282","Makati CPO-PO Box# 4200 to 4299","Big users",1692]
["1283","Makati CPO-PO Box# 4300 to 4399","Big users",1693]
["1284","Makati CPO-PO Box# 4400 to 4499","Big users",1694]
["1285","Makati CPO-PO Box# 4500 to 4599","Big users",1695]
["1286","Makati CPO-PO Box# 4600 to 4699","Big users",1696]
["1287","Makati CPO-PO Box# 4700 to 4799","Big users",1697]
["1288","Makati CPO-PO Box# 4800 to 4899","Big users",1698]
["1289","Makati CPO-PO Box# 4900 to 4999","Big users",1699]
["1290","Makati CPO-PO Box# 5000 to 5099","Big users",1700]
["1291","Makati CPO-PO Box# 5100 to 5199","Big users",1701]
["1292","Makati CPO-PO Box# 5200 to 5299","Big users",1702]
["1293","Makati CPO-PO Box# 5300 to 5399","Big users",1703]
["1294","Makati CPO-PO Box# 5400 to 5499","Big users",1704]
["1295","Makati CPO-PO Box# 5500 to 5599","Big users",1705]
["1296","Makati CPO-PO Box# 5600 to 5699","Big users",1706]
["1297","Makati CPO-PO Box# 5700 to 5799","Big users",1707]
["1298","Makati CPO-PO Box# 5800 to 5899","Big users",1708]
["1299","Makati CPO-PO Box# 5900 to 5999","Big users",1709]
["0715","Marcopper Mining Corporation","Big users",1631]
["0780","Mead Johnson Philippines","Big users",1654]
["0729","Not used","Big users",1645]
["0750","Philippine Airlines","Big users",1651]
["0721","Philippine Long Distance Telephone Company","Big users",1637]
["0714","Philippine Manila Mission","Big users",1630]
["0708","Philippine National Oil Company","Big users",1624]
["0760","Pilipinas Shell (subsidiary of Royal Dutch Shell)","Big users",1652]
["0700","Plain-Truth","Big users",1616]
["0704","Producers Bank","Big users",1620]
["0712","Prudential Bank","Big users",1628]
["0410","Radio Bible Class","Big users",2295]
["0727","Rizal Commercial Banking Corporation","Big users",1643]
["0703","Sarmiento Enterprises","Big users",1619]
["0719","Security Bank","Big users",1635]
["0724","Sun Life Financial","Big users",1640]
["0740","Sycip, Gorres and Velayo","Big users",1650]
["0705","Union Ajinomoto","Big users",1621]
["0728","United Coconut Planters Bank","Big users",1644]
["0722","World Executive Digest","Big users",1638]
["0730","Zuellig Pharma","Big users",1646]
["6544","Almeria","Biliran",364]
["6549","Biliran","Biliran",365]
["6550","Cabucgayan","Biliran",366]
["6548","Caibiran","Biliran",367]
["6547","Culaba","Biliran",371]
["6545","Kawayan","Biliran",372]
["6546","Maripipi","Biliran",373]
["6543","Naval","Biliran",374]
["6302","Alburquerque","Bohol",384]
["6314","Alicia","Bohol",385]
["6311","Anda","Bohol",386]
["6335","Antequera","Bohol",387]
["6301","Baclayon","Bohol",388]
["6342","Balilihan","Bohol",389]
["6318","Batuan","Bohol",390]
["6326","Bien Unido","Bohol",391]
["6317","Bilar","Bohol",392]
["6333","Buenavista","Bohol",393]
["6328","Calape","Bohol",394]
["6312","Candijay","Bohol",395]
["6319","Carmen","Bohol",397]
["6343","Catigbian","Bohol",398]
["6330","Clarin","Bohol",399]
["6337","Corella","Bohol",403]
["6341","Cortes","Bohol",404]
["6322","Dagohoy","Bohol",405]
["6344","Danao","Bohol",406]
["6339","Dauis","Bohol",407]
["6305","Dimiao","Bohol",408]
["6309","Duero","Bohol",409]
["6307","Garcia Hernandez","Bohol",410]
["6310","Guindulman","Bohol",411]
["6332","Inabanga","Bohol",412]
["6308","Jagna","Bohol",413]
["6334","Jetafe","Bohol",414]
["6304","Lila","Bohol",415]
["6202","Loay","Bohol",416]
["6316","Loboc","Bohol",417]
["6327","Loon","Bohol",418]
["6313","Mabini","Bohol",422]
["6336","Maribojoc","Bohol",423]
["6340","Panglao","Bohol",424]
["6321","Pilar","Bohol",425]
["6346","Pres. Carlos P. Garcia (Pitogo)","Bohol",396]
["6331","Sagbayan","Bohol",426]
["6345","San Isidro","Bohol",427]
["6323","San Miguel","Bohol",428]
["6347","Sevilla","Bohol",429]
["6320","Sierra Bullones","Bohol",430]
["6338","Sikatuna","Bohol",431]
["6300","Tagbilaran City","Bohol",432]
["6325","Talibon","Bohol",433]
["6324","Trinidad","Bohol",434]
["6329","Tubigon","Bohol",435]
["6315","Ubay","Bohol",436]
["6306","Valencia","Bohol",437]
["8707","Baungon","Bukidnon",447]
["8723","Cabanglasan","Bukidnon",448]
["8721","Damulog","Bukidnon",449]
["8719","Dangcagan","Bukidnon",450]
["8712","Don Carlos","Bukidnon",451]
["8702","Impasugong","Bukidnon",452]
["8713","Kadingilan","Bukidnon",453]
["8718","Kalilangan","Bukidnon",454]
["8720","Kibawe","Bukidnon",458]
["8716","Kitaotao","Bukidnon",459]
["8722","Lantapan","Bukidnon",460]
["8706","Libona","Bukidnon",461]
["8700","Malaybalay City","Bukidnon",462]
["8704","Malitbog","Bukidnon",463]
["8703","Manolo Fortich","Bukidnon",464]
["8714","Maramag","Bukidnon",465]
["8710","Musuan","Bukidnon",469]
["8717","Pangantucan","Bukidnon",470]
["8705","Phillips","Bukidnon",471]
["8715","Quezon","Bukidnon",472]
["8711","San Fernando","Bukidnon",473]
["8701","Sumilao","Bukidnon",474]
["8708","Talakag","Bukidnon",475]
["8709","Valencia City","Bukidnon",476]
["3012","Angat","Bulacan",486]
["3016","Balagtas (Bigaa)","Bulacan",487]
["3006","Baliuag","Bulacan",488]
["3018","Bocaue","Bulacan",489]
["3017","Bulacan","Bulacan",490]
["3007","Bustos","Bulacan",491]
["3003","Calumpit","Bulacan",492]
["3009","Dona Remedios Trinidad","Bulacan",493]
["3015","Guiguinto","Bulacan",497]
["3002","Hagonoy","Bulacan",498]
["3000","Malolos City","Bulacan",499]
["3019","Marilao","Bulacan",500]
["3020","Meycauayan City","Bulacan",501]
["3013","Norzagaray","Bulacan",502]
["3021","Obando","Bulacan",503]
["3014","Pandi","Bulacan",504]
["3001","Paombong","Bulacan",508]
["3004","Plaridel","Bulacan",509]
["3005","Pulilan","Bulacan",510]
["3010","San Ildefonso","Bulacan",511]
["3023","San Jose del Monte City","Bulacan",512]
["3011","San Miguel","Bulacan",513]
["3008","San Rafael","Bulacan",514]
["3022","Santa Maria","Bulacan",515]
["3024","Sapang Palay, San Jose del Monte City","Bulacan",516]
["3517","Abulug","Cagayan",526]
["3507","Alcala","Cagayan",527]
["3523","Allacapan","Cagayan",528]
["3505","Amulung","Cagayan",529]
["3515","Aparri","Cagayan",530]
["3506","Baggao","Cagayan",531]
["3516","Ballesteros","Cagayan",532]
["3511","Buguey","Cagayan",533]
["3520","Calayan","Cagayan",534]
["3510","Camalaniugan","Cagayan",538]
["3519","Claveria","Cagayan",539]
["3501","Enrile","Cagayan",540]
["3508","Gattaran","Cagayan",541]
["3513","Gonzaga","Cagayan",542]
["3504","Iguig","Cagayan",543]
["3509","Lal-Lo","Cagayan",544]
["3524","Lasam","Cagayan",545]
["3522","Pamplona","Cagayan",546]
["3502","Peñablanca","Cagayan",547]
["3527","Piat","Cagayan",551]
["3526","Rizal","Cagayan",552]
["3518","Sanchez-Mira","Cagayan",553]
["3514","Santa Ana","Cagayan",554]
["3521","Santa Praxedes","Cagayan",555]
["3512","Santa Teresita","Cagayan",556]
["3525","Santo Niño","Cagayan",557]
["3503","Solana","Cagayan",558]
["3528","Tuao","Cagayan",559]
["3500","Tuguegarao City","Cagayan",560]
["1425","Amparo Subdivision","Caloocan City",1521]
["1401","Baesa","Caloocan City",1530]
["1428","Bagong Silang","Caloocan City",1524]
["1421","Bagumbong/Pag-asa","Caloocan City",1517]
["1426","Bankers Village","Caloocan City",1522]
["1400","Caloocan City Central Post Office","Caloocan City",1529]
["1424","Captol Parkland Subdivision","Caloocan City",1520]
["14??","Cefels Park Subdivision","Caloocan City",1525]
["1405","First Avenue to Seventh Avenue West","Caloocan City",1534]
["1411","Fish Market (shared with Navotas)","Caloocan City",1540]
["1403","Grace Park East","Caloocan City",1532]
["1406","Grace Park West","Caloocan City",1535]
["1412","Isla de Cocomo","Caloocan City",1541]
["1413","Kapitbayahan","Caloocan City",1542]
["1409","Kaunlaran Village (shared with Malabon City and Navotas)","Caloocan City",1538]
["1420","Kaybiga/Deparo","Caloocan City",1516]
["1423","Lilles Ville Subdivision","Caloocan City",1519]
["1410","Maypajo","Caloocan City",1539]
["1422","Novaliches North","Caloocan City",1518]
["1404","San Jose","Caloocan City",1533]
["1408","Sangandaan","Caloocan City",1537]
["1402","Santa Quiteria","Caloocan City",1531]
["1427","Tala Leprosarium and Victory Heights","Caloocan City",1523]
["1407","University Hills","Caloocan City",1536]
["4608","Basud","Camarines Norte",570]
["4607","Capalonga","Camarines Norte",571]
["4600","Daet","Camarines Norte",572]
["4610","Imelda / San Lorenzo Ruiz","Camarines Norte",573]
["4606","Jose Panganiban","Camarines Norte",577]
["4604","Labo","Camarines Norte",578]
["4601","Mercedes","Camarines Norte",579]
["4605","Paracale","Camarines Norte",580]
["4609","San Vicente","Camarines Norte",584]
["4611","Santa Elena","Camarines Norte",585]
["4602","Talisay","Camarines Norte",586]
["4612","Tulay-na-Lupa","Camarines Norte",587]
["4603","Vinzons","Camarines Norte",588]
["4432","Baao","Camarines Sur",598]
["4436","Balatan","Camarines Sur",599]
["4435","Bato","Camarines Sur",600]
["4404","Bombon","Camarines Sur",601]
["4433","Buhi","Camarines Sur",602]
["4430","Bula","Camarines Sur",603]
["4406","Cabusao","Camarines Sur",604]
["4405","Calabanga","Camarines Sur",605]
["4401","Camaligan","Camarines Sur",606]
["4402","Canaman","Camarines Sur",607]
["4429","Caramoan","Camarines Sur",608]
["4411","Del Gallego","Camarines Sur",609]
["4412","Gainza","Camarines Sur",613]
["4428","Garchitorena","Camarines Sur",614]
["4422","Goa","Camarines Sur",615]
["4431","Iriga City","Camarines Sur",616]
["4425","Lagonoy","Camarines Sur",617]
["4407","Libmanan","Camarines Sur",618]
["4409","Lupi","Camarines Sur",619]
["4403","Magarao","Camarines Sur",620]
["4413","Milaor","Camarines Sur",621]
["4414","Minalabac","Camarines Sur",622]
["4434","Nabua","Camarines Sur",623]
["4400","Naga City","Camarines Sur",624]
["4419","Ocampo","Camarines Sur",628]
["4416","Pamplona","Camarines Sur",629]
["4417","Pasacao","Camarines Sur",630]
["4418","Pili","Camarines Sur",631]
["4424","Presentacion","Camarines Sur",632]
["4410","Ragay","Camarines Sur",633]
["4421","Sagnay","Camarines Sur",634]
["4415","San Fernando","Camarines Sur",635]
["4423","San Jose","Camarines Sur",636]
["4408","Sipocot","Camarines Sur",637]
["4427","Siruma","Camarines Sur",638]
["4420","Tigaon","Camarines Sur",639]
["4426","Tinambac","Camarines Sur",640]
["9104","Catarman","Camiguin",650]
["9102","Guinsiliban","Camiguin",648]
["9101","Mahinog","Camiguin",647]
["9100","Mambajao","Camiguin",646]
["9103","Sagay","Camiguin",649]
["5811","Cuartero","Capiz",658]
["5810","Dao","Capiz",659]
["5813","Dumalag","Capiz",660]
["5812","Dumarao","Capiz",661]
["5805","Ivisan","Capiz",662]
["5808","Jamindan","Capiz",663]
["5809","Ma-ayon","Capiz",667]
["5807","Mambusao","Capiz",668]
["5801","Panay","Capiz",669]
["5815","Panitan","Capiz",670]
["5804","Pilar","Capiz",671]
["5802","Pontevedra","Capiz",672]
["5803","President Roxas","Capiz",676]
["5800","Roxas City","Capiz",677]
["5806","Sapian","Capiz",678]
["5816","Sigma","Capiz",679]
["5814","Tapaz","Capiz",680]
["4807","Bagamanoc","Catanduanes",690]
["4803","Baras","Catanduanes",691]
["4801","Bato","Catanduanes",692]
["4808","Caramoran","Catanduanes",693]
["4804","Gigmoto","Catanduanes",694]
["4809","Pandan","Catanduanes",698]
["4806","Panganiban","Catanduanes",699]
["4810","San Andres","Catanduanes",700]
["4802","San Miguel","Catanduanes",701]
["4805","Viga","Catanduanes",702]
["4800","Virac","Catanduanes",703]
["4123","Alfonso","Cavite",714]
["4119","Amadeo","Cavite",715]
["4102","Bacoor","Cavite",716]
["4133","Bailen","Cavite",713]
["4116","Carmona","Cavite",717]
["4100","Cavite City","Cavite",718]
["4125","Corregidor Island","Cavite",720]
["4114","Dasmariñas","Cavite",721]
["4115","Dasmarinas Resettlement Area","Cavite",725]
["4124","General Emilio Aguinaldo (Bailen)","Cavite",726]
["4117","General Mariano Alvarez","Cavite",727]
["4107","General Trias","Cavite",728]
["4103","Imus","Cavite",729]
["4122","Indang","Cavite",730]
["4104","Kawit","Cavite",731]
["4113","Magallanes","Cavite",732]
["4112","Maragondon","Cavite",733]
["4121","Mendez (Mendez-Nuñez)","Cavite",737]
["4110","Naic","Cavite",738]
["4105","Noveleta","Cavite",739]
["4106","Rosario","Cavite",740]
["4101","Sangley Point Naval Base","Cavite",719]
["4118","Silang","Cavite",741]
["4120","Tagaytay City","Cavite",742]
["4108","Tanza","Cavite",743]
["4111","Ternate incl. Caylabne Bay & Puerto Azul","Cavite",744]
["4109","Trece Martires City","Cavite",745]
["6055","Alcantara","Cebu",755]
["6066","Alcoy","Cebu",756]
["6077","Alegria","Cebu",757]
["6088","Aloguinsan","Cebu",758]
["6099","Argao","Cebu",759]
["6010","Asturias","Cebu",760]
["6011","Badian","Cebu",761]
["6041","Balamban","Cebu",762]
["6052","Bantayan","Cebu",763]
["6036","Barili","Cebu",764]
["6010","Bogo City","Cebu",765]
["6024","Boljoon","Cebu",766]
["6008","Borbon","Cebu",767]
["6019","Carcar City","Cebu",768]
["6005","Carmen","Cebu",769]
["6006","Catmon","Cebu",770]
["6000","Cebu City","Cebu",771]
["6003","Compostela","Cebu",772]
["6001","Consolacion","Cebu",776]
["6017","Cordova","Cebu",777]
["6013","Daanbantayan","Cebu",778]
["6022","Dalaguete","Cebu",779]
["6004","Danao City","Cebu",780]
["6035","Dumanjug","Cebu",781]
["6028","Ginatilan","Cebu",782]
["6015","Lapu-Lapu City (Opon)","Cebu",783]
["6002","Liloan","Cebu",784]
["6016","Mactan Airport","Cebu",785]
["6053","Madridejos","Cebu",786]
["6029","Malabuyoc","Cebu",787]
["6014","Mandaue City","Cebu",788]
["6012","Medellin","Cebu",789]
["6046","Minglanilla","Cebu",790]
["6032","Moalboal","Cebu",791]
["6037","Naga","Cebu",792]
["6025","Oslob","Cebu",793]
["6048","Pilar","Cebu",797]
["6039","Pinamungahan","Cebu",798]
["6049","Poro","Cebu",799]
["6034","Ronda","Cebu",800]
["6027","Samboan","Cebu",801]
["6018","San Fernando","Cebu",802]
["6050","San Francisco","Cebu",803]
["6011","San Remigio","Cebu",804]
["6047","Santa Fe","Cebu",805]
["6026","Santander","Cebu",806]
["6020","Sibonga","Cebu",807]
["6007","Sogod","Cebu",808]
["6009","Tabogon","Cebu",809]
["6044","Tabuelan","Cebu",810]
["6045","Talisay City","Cebu",811]
["6038","Toledo City","Cebu",812]
["6043","Tuburan","Cebu",813]
["6051","Tudela","Cebu",814]
["8109","Compostela","Compostela Valley",820]
["8103","Laak (San Vicente)","Compostela Valley",821]
["8115","Mabini (Doña Alicia)","Compostela Valley",822]
["8114","Maco","Compostela Valley",823]
["8116","Maragusan (San Mariano)","Compostela Valley",824]
["8108","Mawab","Compostela Valley",825]
["8111","Monkayo","Compostela Valley",826]
["8107","Montevista","Compostela Valley",827]
["8106","Nabunturan","Compostela Valley",828]
["8110","New Bataan","Compostela Valley",829]
["8117","Pantukan","Compostela Valley",830]
["9413","Alamada","Cotabato",838]
["9415","Aleosan","Cotabato",839]
["9414","Antipas","Cotabato",840]
["9417","Arakan","Cotabato",841]
["9416","Banisilan","Cotabato",842]
["9408","Carmen","Cotabato",843]
["9407","Kabacan","Cotabato",844]
["9400","Kidapawan City","Cotabato",845]
["9411","Libungan","Cotabato",846]
["9404","Magpet","Cotabato",850]
["9401","Makilala","Cotabato",851]
["9406","Matalam","Cotabato",852]
["9410","Midsayap","Cotabato",853]
["9402","M'Lang","Cotabato",854]
["9412","Pigkawayan","Cotabato",855]
["9409","Pikit","Cotabato",856]
["9405","President Roxas","Cotabato",857]
["9403","Tulunan","Cotabato",858]
["8102","Asuncion","Davao del Norte",864]
["8118","Babak","Davao del Norte",865]
["8101","Carmen","Davao del Norte",866]
["8119","Island Garden City of Samal","Davao del Norte",871]
["8113","Kapalong","Davao del Norte",867]
["8120","Kaputian","Davao del Norte",868]
["8104","New Corella","Davao del Norte",869]
["8105","Panabo City","Davao del Norte",870]
["8112","Santo Tomas","Davao del Norte",872]
["8100","Tagum City","Davao del Norte",873]
["8016","Ateneo de Davao University","Davao del Sur",883]
["8005","Bansalan","Davao del Sur",881]
["8000","Davao City","Davao del Sur",882]
["8002","Digos City","Davao del Sur",884]
["8013","Don Marcelino","Davao del Sur",885]
["8006","Hagonoy","Davao del Sur",886]
["8014","Jose Abad Santos","Davao del Sur",890]
["8008","Kiblawan","Davao del Sur",891]
["8004","Magsaysay","Davao del Sur",892]
["8010","Malalag","Davao del Sur",893]
["8012","Malita","Davao del Sur",894]
["8003","Matanao","Davao del Sur",898]
["8200","Mati","Davao del Sur",908]
["8007","Padada","Davao del Sur",899]
["8209","San Isidro","Davao del Sur",909]
["8001","Santa Cruz","Davao del Sur",900]
["8011","Santa Maria","Davao del Sur",901]
["8015","Sarangani","Davao del Sur",902]
["8009","Sulop","Davao del Sur",903]
["8201","Tarragona","Davao del Sur",910]
["8413","Basilisa (Rizal)","Dinagat Islands",916]
["8411","Cagdianao","Dinagat Islands",917]
["8412","Dinagat","Dinagat Islands",918]
["8414","Libjo (Albor)","Dinagat Islands",919]
["8415","Loreto","Dinagat Islands",920]
["8427","San Jose","Dinagat Islands",921]
["8426","Tubajon","Dinagat Islands",922]
["6822","Arteche","Eastern Samar",930]
["6812","Balangiga","Eastern Samar",931]
["6801","Balangkayan","Eastern Samar",932]
["6800","Borongan","Eastern Samar",933]
["6806","Can-avid","Eastern Samar",934]
["6817","Dolores","Eastern Samar",935]
["6805","General MacArthur","Eastern Samar",936]
["6811","Giporlos","Eastern Samar",940]
["6809","Guiuan","Eastern Samar",941]
["6804","Hernani","Eastern Samar",942]
["6819","Jipapad","Eastern Samar",943]
["6813","Lawaan","Eastern Samar",944]
["6803","Llorente","Eastern Samar",945]
["6820","Maslog","Eastern Samar",946]
["6802","Maydolong","Eastern Samar",947]
["6808","Mercedes","Eastern Samar",951]
["6818","Oras","Eastern Samar",952]
["6810","Quinapondan","Eastern Samar",953]
["6807","Salcedo","Eastern Samar",954]
["6814","San Julian","Eastern Samar",955]
["6821","San Policarpo","Eastern Samar",956]
["6815","Sulat","Eastern Samar",957]
["6816","Taft","Eastern Samar",958]
["5044","Buenavista","Guimaras",964]
["5045","Jordan","Guimaras",965]
["5046","Nueva Valencia","Guimaras",966]
["5047","San Lorenzo","Guimaras",967]
["5048","Sibunag","Guimaras",968]
["3606","Aguinaldo","Ifugao",976]
["3608","Alfonso Lista (Potia)","Ifugao",977]
["3610","Asipulo","Ifugao",978]
["3601","Banaue","Ifugao",979]
["3607","Hingyon","Ifugao",980]
["3603","Hungduan","Ifugao",981]
["3604","Kiangan","Ifugao",985]
["3600","Lagawe","Ifugao",986]
["3605","Lamut","Ifugao",987]
["3602","Mayoyao (Mayaoyao)","Ifugao",988]
["3609","Tinoc","Ifugao",989]
["2922","Adams","Ilocos Norte",999]
["2916","Bacarra","Ilocos Norte",1000]
["2904","Badoc","Ilocos Norte",1001]
["2920","Bangui","Ilocos Norte",1002]
["2908","Banna (Espiritu)","Ilocos Norte",1003]
["2906","Batac","Ilocos Norte",1004]
["2918","Burgos","Ilocos Norte",1005]
["2911","Carasi","Ilocos Norte",1006]
["2903","Currimao","Ilocos Norte",1010]
["2913","Dingras","Ilocos Norte",1011]
["2921","Dumalneg","Ilocos Norte",1012]
["2900","Laoag City","Ilocos Norte",1013]
["2907","Marcos","Ilocos Norte",1014]
["2909","Nueva Era","Ilocos Norte",1015]
["2919","Pagudpud","Ilocos Norte",1016]
["2902","Paoay","Ilocos Norte",1020]
["2917","Pasuquin","Ilocos Norte",1021]
["2912","Piddig","Ilocos Norte",1022]
["2905","Pinili","Ilocos Norte",1023]
["2901","San Nicolas","Ilocos Norte",1024]
["2914","Sarrat","Ilocos Norte",1025]
["2910","Solsona","Ilocos Norte",1026]
["2915","Vintar","Ilocos Norte",1027]
["2716","Alilem","Ilocos Sur",1037]
["2708","Banayoyo","Ilocos Sur",1038]
["2727","Bantay","Ilocos Sur",1039]
["2724","Burgos","Ilocos Sur",1040]
["2732","Cabugao","Ilocos Sur",1041]
["2710","Candon City","Ilocos Sur",1042]
["2702","Caoayan","Ilocos Sur",1043]
["2718","Cervantes","Ilocos Sur",1044]
["2709","Galimuyod","Ilocos Sur",1045]
["2720","Gregorio del Pilar","Ilocos Sur",1046]
["2723","Lidlidda","Ilocos Sur",1047]
["2730","Magsingal","Ilocos Sur",1051]
["2725","Nagbukel","Ilocos Sur",1052]
["2704","Narvacan","Ilocos Sur",1053]
["2721","Quirino (Angkaki)","Ilocos Sur",1054]
["2711","Salcedo (Baugen)","Ilocos Sur",1055]
["2722","San Emilio","Ilocos Sur",1056]
["2706","San Esteban","Ilocos Sur",1057]
["2728","San Ildefonso","Ilocos Sur",1058]
["2731","San Juan (Lapog)","Ilocos Sur",1059]
["2726","San Vicente","Ilocos Sur",1060]
["2703","Santa","Ilocos Sur",1061]
["2701","Santa Catalina","Ilocos Sur",1065]
["2713","Santa Cruz","Ilocos Sur",1066]
["2712","Santa Lucia","Ilocos Sur",1067]
["2705","Santa Maria","Ilocos Sur",1068]
["2707","Santiago","Ilocos Sur",1069]
["2729","Santo Domingo","Ilocos Sur",1070]
["2719","Sigay","Ilocos Sur",1071]
["2733","Sinait","Ilocos Sur",1072]
["2717","Sugpon","Ilocos Sur",1073]
["2715","Suyo","Ilocos Sur",1074]
["2714","Tagudin","Ilocos Sur",1075]
["2700","Vigan City","Ilocos Sur",1076]
["5012","Ajuy","Iloilo",1086]
["5028","Alimodian","Iloilo",1087]
["5009","Anilao","Iloilo",1088]
["5033","Badiangan","Iloilo",1089]
["5018","Balasan","Iloilo",1090]
["5010","Banate","Iloilo",1091]
["5007","Barotoc Nuevo","Iloilo",1092]
["5011","Barotoc Viejo","Iloilo",1093]
["5016","Batad","Iloilo",1094]
["5041","Bingawan","Iloilo",1095]
["5031","Cabatuan","Iloilo",1096]
["5040","Calinog","Iloilo",1097]
["5019","Carles","Iloilo",1098]
["5013","Concepcion","Iloilo",1099]
["5035","Dingle","Iloilo",1103]
["5038","Duenas","Iloilo",1104]
["5006","Dumangas","Iloilo",1105]
["5017","Estancia","Iloilo",1106]
["5022","Guimbal","Iloilo",1107]
["5029","Igbaras","Iloilo",1108]
["5000","Iloilo City","Iloilo",1109]
["5034","Janiuay","Iloilo",1110]
["5042","Lambunao","Iloilo",1111]
["5003","Leganes","Iloilo",1112]
["5043","Lemery","Iloilo",1113]
["5026","Leon","Iloilo",1114]
["5030","Maasin","Iloilo",1115]
["5023","Miagao","Iloilo",1116]
["5032","Mina","Iloilo",1117]
["5005","New Lucena","Iloilo",1121]
["5020","Oton","Iloilo",1122]
["5037","Passi City","Iloilo",1123]
["5001","Pavia","Iloilo",1124]
["5008","Pototan","Iloilo",1125]
["5015","San Dionisio","Iloilo",1126]
["5036","San Enrique","Iloilo",1127]
["5024","San Joaquin","Iloilo",1128]
["5025","San Miguel","Iloilo",1129]
["5039","San Rafael","Iloilo",1130]
["5002","Santa Barbara","Iloilo",1131]
["5014","Sara","Iloilo",1132]
["5021","Tigbauan","Iloilo",1133]
["5027","Tubungan","Iloilo",1134]
["5004","Zarraga","Iloilo",1135]
["3306","Alicia","Isabela",1145]
["3307","Angadanan","Isabela",1146]
["3316","Aurora","Isabela",1147]
["3331","Benito Soliven","Isabela",1148]
["3322","Burgos","Isabela",1149]
["3328","Cabagan","Isabela",1150]
["3315","Cabatuan","Isabela",1151]
["3305","Cauayan City","Isabela",1152]
["3312","Cordon","Isabela",1153]
["3326","Delfin Albano","Isabela",1154]
["3336","Dinapigui","Isabela",1155]
["3335","Divilacan","Isabela",1156]
["3309","Echague","Isabela",1160]
["3301","Gamu","Isabela",1161]
["3300","Ilagan","Isabela",1162]
["3313","Jones","Isabela",1163]
["3304","Luna","Isabela",1164]
["3333","Maconacon","Isabela",1165]
["3323","Mallig","Isabela",1166]
["3302","Naguillan","Isabela",1167]
["3334","Palanan","Isabela",1168]
["3324","Quezon","Isabela",1169]
["3321","Quirino","Isabela",1170]
["3319","Ramon","Isabela",1171]
["3303","Reina Mercedes","Isabela",1175]
["3320","Roxas","Isabela",1176]
["3314","San Agustin","Isabela",1177]
["3308","San Guillermo","Isabela",1178]
["3310","San Isidro","Isabela",1179]
["3317","San Manuel (Callang)","Isabela",1180]
["3332","San Mariano","Isabela",1181]
["3318","San Mateo","Isabela",1182]
["3329","San Pablo","Isabela",1183]
["3330","Santa Maria","Isabela",1184]
["3311","Santiago City","Isabela",1185]
["3327","Santo Tomas","Isabela",1186]
["3325","Tumauini","Isabela",1187]
["3801","Balbalan","Kalinga",1193]
["3808","Liwan (Rizal)","Kalinga",1194]
["3802","Lubuagan","Kalinga",1195]
["3803","Pasil","Kalinga",1196]
["3806","Pinukpuk","Kalinga",1197]
["3800","Tabuk City","Kalinga",1198]
["3805","Tanudan","Kalinga",1199]
["3804","Tinglayan","Kalinga",1200]
["2504","Agoo","La Union",1208]
["2503","Aringay","La Union",1209]
["2515","Bacnotan","La Union",1210]
["2512","Bagulin","La Union",1211]
["2517","Balaoan","La Union",1212]
["2519","Bangar","La Union",1213]
["2501","Bauang","La Union",1214]
["2510","Burgos","La Union",1218]
["2502","Caba","La Union",1219]
["2507","Damortis","La Union",1220]
["2518","Luna","La Union",1221]
["2511","Naguillan","La Union",1222]
["2508","Pugo","La Union",1223]
["2506","Rosario","La Union",1224]
["2500","San Fernando City","La Union",1228]
["2513","San Gabriel","La Union",1229]
["2514","San Juan","La Union",1230]
["2505","Santo Tomas","La Union",1231]
["2516","Santol","La Union",1232]
["2520","Sudepen","La Union",1233]
["2509","Tubao","La Union",1234]
["4001","Alaminos","Laguna",1244]
["4033","Bay","Laguna",1245]
["4024","Biñan City","Laguna",1246]
["4006","Botocan, Magdalena","Laguna",1247]
["4025","Cabuyao","Laguna",1248]
["4027","Calamba City","Laguna",1249]
["4012","Calauan","Laguna",1250]
["4029","Camp Vicente Lim","Laguna",1251]
["4028","Canlubang, Calamba City","Laguna",1252]
["4013","Cavinti","Laguna",1253]
["4021","Famy","Laguna",1254]
["4015","Kalayaan","Laguna",1258]
["4004","Liliw","Laguna",1259]
["4030","Los Baños","Laguna",1260]
["4032","Luisiana","Laguna",1261]
["4014","Lumban","Laguna",1262]
["4020","Mabitac","Laguna",1263]
["4007","Magdalena","Laguna",1264]
["4005","Majayjay","Laguna",1265]
["4002","Nagcarlan","Laguna",1266]
["4016","Paete","Laguna",1267]
["4008","Pagsanjan","Laguna",1268]
["4017","Pakil","Laguna",1272]
["4018","Pangil","Laguna",1273]
["4010","Pila","Laguna",1274]
["4003","Rizal","Laguna",1275]
["4000","San Pablo City","Laguna",1276]
["4023","San Pedro","Laguna",1277]
["4009","Santa Cruz","Laguna",1278]
["4022","Santa Maria","Laguna",1279]
["4026","Santa Rosa City","Laguna",1280]
["4019","Siniloan","Laguna",1281]
["4031","University of the Philippines, Los Baños","Laguna",1282]
["4011","Victoria","Laguna",1283]
["9205","Bacolod","Lanao del Norte",1293]
["9217","Baloi","Lanao del Norte",1294]
["9210","Baroy","Lanao del Norte",1295]
["9200","Iligan City","Lanao del Norte",1296]
["9214","Kapatagan","Lanao del Norte",1297]
["9215","Karomatan","Lanao del Norte",1298]
["9202","Kauswagan","Lanao del Norte",1299]
["9207","Kolambogan","Lanao del Norte",1303]
["9211","Lala","Lanao del Norte",1304]
["9201","Linamon","Lanao del Norte",1305]
["9221","Magsaysay","Lanao del Norte",1306]
["9206","Maigo","Lanao del Norte",1307]
["9203","Matungao","Lanao del Norte",1308]
["9219","Munai","Lanao del Norte",1309]
["9216","Nunungan","Lanao del Norte",1310]
["9208","Pantao Ragat","Lanao del Norte",1314]
["9218","Pantar","Lanao del Norte",1315]
["9204","Poona Piagapo","Lanao del Norte",1316]
["9212","Salvador","Lanao del Norte",1317]
["9213","Sapad","Lanao del Norte",1318]
["9222","Tagoloan","Lanao del Norte",1319]
["9220","Tangkal","Lanao del Norte",1320]
["9209","Tubod","Lanao del Norte",1321]
["9316","Bacolod Kalawi","Lanao del Sur",1331]
["9302","Balabagan","Lanao del Sur",1332]
["9318","Balindong","Lanao del Sur",1333]
["9309","Bayang","Lanao del Sur",1334]
["9310","Binidayan","Lanao del Sur",1335]
["9714","Buadiposo Buntong","Lanao del Sur",1336]
["9708","Bubong","Lanao del Sur",1337]
["9320","Bumbaran","Lanao del Sur",1338]
["9305","Butig","Lanao del Sur",1339]
["9319","Calanogas","Lanao del Sur",1340]
["9311","Ganassi","Lanao del Sur",1341]
["9709","Kapai","Lanao del Sur",1342]
["9703","Lumba Bayabao","Lanao del Sur",1346]
["9307","Lumbatan","Lanao del Sur",1347]
["9306","Lumbayanague","Lanao del Sur",1348]
["9308","Macadar Andong","Lanao del Sur",1349]
["9315","Madalum","Lanao del Sur",1350]
["9314","Madamba","Lanao del Sur",1351]
["9715","Maguing","Lanao del Sur",1352]
["9300","Malabang","Lanao del Sur",1353]
["9711","Marantao","Lanao del Sur",1355]
["9700","Marawi City","Lanao del Sur",1356]
["9303","Marogong","Lanao del Sur",1354]
["9706","Masui","Lanao del Sur",1357]
["9702","Mulondo","Lanao del Sur",1358]
["9312","Pagayawan","Lanao del Sur",1362]
["9710","Piagapo","Lanao del Sur",1363]
["9301","Picong(Sultan Gumander)","Lanao del Sur",1368]
["9705","Poona Bayabao","Lanao del Sur",1364]
["9313","Pualas","Lanao del Sur",1365]
["9713","Ramain-Ditsaan","Lanao del Sur",1366]
["9701","Saguiaran","Lanao del Sur",1367]
["9321","Tagoloan-II","Lanao del Sur",1369]
["9704","Tamparan","Lanao del Sur",1370]
["9712","Taraka","Lanao del Sur",1371]
["9304","Tubaran","Lanao del Sur",1372]
["9317","Tugaya","Lanao del Sur",1373]
["9716","Wao","Lanao del Sur",1374]
["1750","Almanza","Las Piñas City",1565]
["1749","Angela Village","Las Piñas City",1564]
["1743","Cut-cut","Las Piñas City",1555]
["1745","Gatchalian Subdivision","Las Piñas City",1557]
["1741","Greymarville Subdivision","Las Piñas City",1553]
["1740","Las Piñas Central Post Office","Las Piñas City",1552]
["1748","Manila Doctors Village","Las Piñas City",1563]
["1744","Manuyo","Las Piñas City",1556]
["1747","Moonwalk Subdivision and Talon","Las Piñas City",1562]
["1742","Pulang Lupa and Zapote","Las Piñas City",1554]
["1752","Soldiers Hills Subdivision","Las Piñas City",1567]
["1751","T.S. Cruz Subdivision","Las Piñas City",1566]
["1746","Verdant Acres Subdivision","Las Piñas City",1558]
["6510","Abuyog","Leyte",1384]
["6517","Alangalang","Leyte",1385]
["6542","Albuera","Leyte",1386]
["6520","Babatngon","Leyte",1387]
["6519","Barugo","Leyte",1388]
["6525","Bato","Leyte",1389]
["6521","Baybay","Leyte",1390]
["6516","Burauen","Leyte",1391]
["6534","Calubian","Leyte",1392]
["6530","Capoocan","Leyte",1393]
["6529","Carigara","Leyte",1394]
["6515","Dagami","Leyte",1395]
["6505","Dulag","Leyte",1396]
["6524","Hilongos","Leyte",1397]
["6523","Hindang","Leyte",1401]
["6522","Inopacan","Leyte",1402]
["6539","Isabel","Leyte",1403]
["6527","Jaro","Leyte",1404]
["6511","Javier","Leyte",1405]
["6506","Julita","Leyte",1406]
["6531","Kananga","Leyte",1407]
["6508","La Paz","Leyte",1408]
["6533","Leyte","Leyte",1409]
["6509","Macarthur","Leyte",1410]
["6512","Mahaplag","Leyte",1411]
["6532","Matag-ob","Leyte",1412]
["6526","Matalom","Leyte",1413]
["6507","Mayorga","Leyte",1414]
["6540","Merida","Leyte",1418]
["6541","Ormoc City","Leyte",1419]
["6501","Palo","Leyte",1420]
["6538","Palompon","Leyte",1421]
["6514","Pastrana","Leyte",1422]
["6535","San Isidro","Leyte",1423]
["6518","San Miguel","Leyte",1424]
["6513","Santa Fe","Leyte",1425]
["6536","Tabango","Leyte",1426]
["6504","Tabontabon","Leyte",1427]
["6500","Tacloban City","Leyte",1428]
["6502","Tanuan","Leyte",1429]
["6503","Tolosa","Leyte",1430]
["6528","Tunga","Leyte",1431]
["6537","Villaba","Leyte",1432]
["9609","Ampatuan","Maguindanao",1443]
["9616","Buluan","Maguindanao",1444]
["9600","Cotabato City","Maguindanao",1442]
["9617","Datu Paglas","Maguindanao",1445]
["9607","Datu Piang","Maguindanao",1449]
["9618","Gen. S.K. Pendatun","Maguindanao",1450]
["9610","Pagalungan","Maguindanao",1455]
["9608","Sarip Aguak (Maganoy)","Maguindanao",1451]
["9603","South Upi","Maguindanao",1456]
["9611","Sultan sa Barongis","Maguindanao",1457]
["9612","Talayan","Maguindanao",1458]
["1226","Ayala Avenue-Paseo de Roxas","Makati City",1603]
["1233","Bangkal","Makati City",1610]
["1209","Bel-Air","Makati City",1586]
["1207","Carmona and Olympia","Makati City",1584]
["1214","Cembo","Makati City",1591]
["1217","Comembo","Makati City",1594]
["1221","Dasmariñas Village North","Makati City",1598]
["1222","Dasmariñas Village South","Makati City",1599]
["1216","East Rembo and Malapad na Bato","Makati City",1593]
["1219","Forbes Park North","Makati City",1596]
["1220","Forbes Park South","Makati City",1597]
["1201","Fort Bonifacio (now part of Taguig City)","Makati City",1578]
["1202","Fort Bonifacio Naval Station","Makati City",1579]
["1228","Greenbelt","Makati City",1605]
["1212","Guadalupe Nuevo (includes Visayan Village)","Makati City",1589]
["1211","Guadalupe Viejo (includes Palm Village)","Makati City",1588]
["1206","Kasilawan","Makati City",1583]
["1204","La Paz, Singkamas, and Tejeros","Makati City",1581]
["1229","Legaspi Village","Makati City",1606]
["1232","Magallanes Village","Makati City",1609]
["1200","Makati Central Post Office","Makati City",1577]
["1224","Makati Commercial Center","Makati City",1601]
["1235","Palanan","Makati City",1612]
["1231","Pasong Tamo and Ecology Village","Makati City",1608]
["1218","Pembo","Makati City",1595]
["1213","Pinagkaisahan - Pitogo","Makati City",1590]
["1230","Pio del Pilar","Makati City",1607]
["1210","Poblacion","Makati City",1587]
["1227","Salcedo Village","Makati City",1604]
["1203","San Antonio Village","Makati City",1580]
["1234","San Isidro","Makati City",1611]
["1223","San Lorenzo Village","Makati City",1600]
["1205","Santa Cruz","Makati City",1582]
["1225","Urdaneta Village","Makati City",1602]
["1208","Valenzuela (includes Rizal, San Miguel, and Santiago Villages)","Makati City",1585]
["1215","West Rembo","Makati City",1592]
["1474","Acacia","Malabon City",1724]
["1476","Araneta Subdivision","Malabon City",1729]
["1480","Dampalit","Malabon City",1733]
["1471","Flores","Malabon City",1721]
["1409","Kaunlaran Village (shared with Caloocan City and Navotas)","Malabon City",1719]
["1472","Longos","Malabon City",1722]
["1470","Malabon","Malabon City",1720]
["1477","Maysilo","Malabon City",1730]
["1479","Muzon","Malabon City",1732]
["1475","Potrero","Malabon City",1728]
["1478","Santolan","Malabon City",1731]
["1470","Tinajeros","Malabon City",1734]
["1473","Tonsuya","Malabon City",1723]
["1554","East EDSA","Mandaluyong City",1744]
["1556","Greenhills South","Mandaluyong City",1746]
["1550","Mandaluyong Central Post Office","Mandaluyong City",1740]
["1553","National Center for Mental Health","Mandaluyong City",1743]
["1552","Shaw Boulevard","Mandaluyong City",1742]
["1551","Vergara","Mandaluyong City",1741]
["1555","Wack Wack","Mandaluyong City",1745]
["0901","Adventist University of the Philippines","Manila",1777]
["0980","Asian Development Bank","Manila",1811]
["0917","Ateneo de Manila University","Manila",1793]
["1006","Binondo","Manila",1760]
["0912","Bureau of Plant Industry","Manila",1788]
["0926","Caltex Philippines","Manila",1802]
["0925","Chinabank","Manila",1801]
["0922","De La Salle University","Manila",1798]
["0970","Department of Justice","Manila",1810]
["0910","Department of Labor and Employment","Manila",1786]
["0923","Don Stewart Evangelistic Association","Manila",1799]
["1045","Ermita P.O. Box","Manila",1818]
["0902","Far East Broadcasting Corporation","Manila",1778]
["0918","Fil-Japan Shipping Company","Manila",1794]
["0915","International Correspondence Institute","Manila",1791]
["0960","International Rice Research Institute","Manila",1809]
["1002","Intramuros","Manila",1756]
["1004","Malate","Manila",1758]
["0900","Manila Bulletin","Manila",1776]
["1000","Manila Central Post Office","Manila",1754]
["0903","Manila Hilton","Manila",1779]
["0913","Manila Hotel","Manila",1789]
["0906","Manila Medical Center","Manila",1782]
["0950","Manila Midtown Hotel","Manila",1808]
["0919","Manila Police District","Manila",1795]
["0904","Midland Hotel","Manila",1780]
["0911","National Statistics Office","Manila",1787]
["0929","Not used","Manila",1805]
["1007","Paco","Manila",1761]
["1011","Pandacan","Manila",1765]
["0908","Pan-Filipino Shipping","Manila",1784]
["0990","Philamlife","Manila",1812]
["0928","Philippine Campus Crusade","Manila",1804]
["0940","Philippine National Bank","Manila",1807]
["0921","Philippine Plaza Hotel","Manila",1797]
["0914","Philippine Refining Company and Unilever Philippines","Manila",1790]
["0927","Philippine Veterans Affairs Office","Manila",1803]
["1018","Port Area South","Manila",1772]
["1001","Quiapo","Manila",1755]
["0916","Radio Veritas","Manila",1792]
["1008","Sampaloc East","Manila",1762]
["1015","Sampaloc West","Manila",1769]
["1017","San Andres","Manila",1771]
["1005","San Miguel","Manila",1759]
["0907","San Miguel Corporation","Manila",1783]
["1010","San Nicolas","Manila",1764]
["1009","Santa Ana","Manila",1763]
["1014","Santa Cruz North","Manila",1768]
["1040","Santa Cruz P.O. Box","Manila",1817]
["1003","Santa Cruz South","Manila",1757]
["1016","Santa Mesa","Manila",1770]
["1035","Santa Mesa P.O. Box","Manila",1816]
["0909","Summer Institute of Linguistics","Manila",1785]
["0920","Sunbursts Publications","Manila",1796]
["0905","The Philippine Star","Manila",1781]
["1013","Tondo North","Manila",1767]
["1012","Tondo South","Manila",1766]
["0930","United States Embassy","Manila",1806]
["0924","World Map","Manila",1800]
["1050","Manila CPO-PO Box# 1000 to 1099","Manila CPO - P.O. Box Nos",1822]
["1051","Manila CPO-PO Box# 1100 to 1199","Manila CPO - P.O. Box Nos",1823]
["1052","Manila CPO-PO Box# 1200 to 1299","Manila CPO - P.O. Box Nos",1824]
["1053","Manila CPO-PO Box# 1300 to 1399","Manila CPO - P.O. Box Nos",1825]
["1054","Manila CPO-PO Box# 1400 to 1499","Manila CPO - P.O. Box Nos",1826]
["1055","Manila CPO-PO Box# 1500 to 1599","Manila CPO - P.O. Box Nos",1827]
["1056","Manila CPO-PO Box# 1600 to 1699","Manila CPO - P.O. Box Nos",1828]
["1057","Manila CPO-PO Box# 1700 to 1799","Manila CPO - P.O. Box Nos",1829]
["1058","Manila CPO-PO Box# 1800 to 1899","Manila CPO - P.O. Box Nos",1830]
["1059","Manila CPO-PO Box# 1900 to 1999","Manila CPO - P.O. Box Nos",1831]
["1060","Manila CPO-PO Box# 2000 to 2099","Manila CPO - P.O. Box Nos",1832]
["1061","Manila CPO-PO Box# 2100 to 2199","Manila CPO - P.O. Box Nos",1833]
["1062","Manila CPO-PO Box# 2200 to 2299","Manila CPO - P.O. Box Nos",1834]
["1063","Manila CPO-PO Box# 2300 to 2399","Manila CPO - P.O. Box Nos",1835]
["1064","Manila CPO-PO Box# 2400 to 2499","Manila CPO - P.O. Box Nos",1836]
["1065","Manila CPO-PO Box# 2500 to 2599","Manila CPO - P.O. Box Nos",1837]
["1066","Manila CPO-PO Box# 2600 to 2699","Manila CPO - P.O. Box Nos",1838]
["1067","Manila CPO-PO Box# 2700 to 2799","Manila CPO - P.O. Box Nos",1839]
["1068","Manila CPO-PO Box# 2800 to 2899","Manila CPO - P.O. Box Nos",1840]
["1069","Manila CPO-PO Box# 2900 to 2999","Manila CPO - P.O. Box Nos",1841]
["1070","Manila CPO-PO Box# 3000 to 3099","Manila CPO - P.O. Box Nos",1842]
["1071","Manila CPO-PO Box# 3100 to 3199","Manila CPO - P.O. Box Nos",1843]
["1072","Manila CPO-PO Box# 3200 to 3299","Manila CPO - P.O. Box Nos",1844]
["1073","Manila CPO-PO Box# 3300 to 3399","Manila CPO - P.O. Box Nos",1845]
["1074","Manila CPO-PO Box# 3400 to 3499","Manila CPO - P.O. Box Nos",1846]
["1075","Manila CPO-PO Box# 3500 to 3599","Manila CPO - P.O. Box Nos",1847]
["1076","Manila CPO-PO Box# 3600 to 3699","Manila CPO - P.O. Box Nos",1848]
["1077","Manila CPO-PO Box# 3700 to 3799","Manila CPO - P.O. Box Nos",1849]
["1078","Manila CPO-PO Box# 3800 to 3899","Manila CPO - P.O. Box Nos",1850]
["1079","Manila CPO-PO Box# 3900 to 3999","Manila CPO - P.O. Box Nos",1851]
["1080","Manila CPO-PO Box# 4000 to 4099","Manila CPO - P.O. Box Nos",1852]
["1081","Manila CPO-PO Box# 4100 to 4199","Manila CPO - P.O. Box Nos",1853]
["1082","Manila CPO-PO Box# 4200 to 4299","Manila CPO - P.O. Box Nos",1854]
["1083","Manila CPO-PO Box# 4300 to 4399","Manila CPO - P.O. Box Nos",1855]
["1084","Manila CPO-PO Box# 4400 to 4499","Manila CPO - P.O. Box Nos",1856]
["1085","Manila CPO-PO Box# 4500 to 4599","Manila CPO - P.O. Box Nos",1857]
["1086","Manila CPO-PO Box# 4600 to 4699","Manila CPO - P.O. Box Nos",1858]
["1087","Manila CPO-PO Box# 4700 to 4799","Manila CPO - P.O. Box Nos",1859]
["1088","Manila CPO-PO Box# 4800 to 4899","Manila CPO - P.O. Box Nos",1860]
["1089","Manila CPO-PO Box# 4900 to 4999","Manila CPO - P.O. Box Nos",1861]
["1090","Manila CPO-PO Box# 5000 to 5099","Manila CPO - P.O. Box Nos",1862]
["1091","Manila CPO-PO Box# 5100 to 5199","Manila CPO - P.O. Box Nos",1863]
["1092","Manila CPO-PO Box# 5200 to 5299","Manila CPO - P.O. Box Nos",1864]
["1093","Manila CPO-PO Box# 5300 to 5399","Manila CPO - P.O. Box Nos",1865]
["1094","Manila CPO-PO Box# 5400 to 5499","Manila CPO - P.O. Box Nos",1866]
["1095","Manila CPO-PO Box# 5500 to 5599","Manila CPO - P.O. Box Nos",1867]
["1096","Manila CPO-PO Box# 5600 to 5699","Manila CPO - P.O. Box Nos",1868]
["1812","819: Not used","Marikina City",1893]
["1820","Bagong Nayon, Cupang, Mambagat, and Mayamot","Marikina City",1894]
["1803","Barangka and Tañong","Marikina City",1881]
["1811","Concepcion 2","Marikina City",1892]
["1807","Concepcion tarlac","Marikina City",1888]
["1802","Industrial Valley","Marikina City",1880]
["1804","J. De La Peña","Marikina City",1882]
["1805","Malanday","Marikina City",1883]
["1800","Marikina Central Post Office","Marikina City",1878]
["1810","Marikina Heights","Marikina City",1891]
["1808","Nangka","Marikina City",1889]
["1806","Northern and Western Marikina River","Marikina City",1884]
["1809","Parang","Marikina City",1890]
["1801","San Roque-Calumpang","Marikina City",1879]
["4900","Boac","Marinduque",1464]
["4904","Buenavista","Marinduque",1468]
["4905","Gasan","Marinduque",1469]
["4901","Mogpog","Marinduque",1465]
["4902","Santa Cruz","Marinduque",1466]
["4903","Torrijos","Marinduque",1467]
["5414","Aroroy","Masbate",1477]
["5413","Baleno","Masbate",1478]
["5412","Balud","Masbate",1479]
["5415","Batuan","Masbate",1480]
["5421","Buenavista","Masbate",1481]
["5405","Cataingan","Masbate",1482]
["5409","Cawayan","Masbate",1483]
["5419","Claveria","Masbate",1487]
["5403","Dimasalang","Masbate",1488]
["5407","Esperanza","Masbate",1489]
["5411","Mandaon","Masbate",1490]
["5400","Masbate City","Masbate",1491]
["5410","Milagros","Masbate",1492]
["5401","Mobo","Masbate",1493]
["5418","Monreal","Masbate",1497]
["5404","Palanas","Masbate",1498]
["5406","Pio V. Corpuz","Masbate",1499]
["5408","Placer","Masbate",1500]
["5416","San Fernando","Masbate",1501]
["5417","San Jacinto","Masbate",1502]
["5420","San Pascual","Masbate",1503]
["5402","Uson","Masbate",1504]
["7206","Aloran","Misamis Occidental",2370]
["7211","Baliangao","Misamis Occidental",2371]
["7215","Bonifacio","Misamis Occidental",2372]
["7210","Calamba","Misamis Occidental",2373]
["7201","Clarin","Misamis Occidental",2374]
["7213","Concepcion","Misamis Occidental",2375]
["7204","Jimenez","Misamis Occidental",2376]
["7208","Lopez Jaena","Misamis Occidental",2377]
["7207","Oroquieta City","Misamis Occidental",2381]
["7200","Ozamis City","Misamis Occidental",2382]
["7205","Panaon","Misamis Occidental",2383]
["7209","Plaridel","Misamis Occidental",2384]
["7212","Sapang Dalaga","Misamis Occidental",2385]
["7203","Sinacaban","Misamis Occidental",2386]
["7214","Tangub City","Misamis Occidental",2387]
["7202","Tudela","Misamis Occidental",2388]
["9018","Alubijid","Misamis Oriental",2398]
["9005","Balingasag","Misamis Oriental",2399]
["9011","Balinguan","Misamis Oriental",2400]
["9008","Binuangan","Misamis Oriental",2401]
["9000","Cagayan de Oro City","Misamis Oriental",2402]
["9004","Claveria","Misamis Oriental",2403]
["9017","El Salvador","Misamis Oriental",2404]
["9014","Gingoog City","Misamis Oriental",2405]
["9020","Gitagum","Misamis Oriental",2409]
["9022","Initao","Misamis Oriental",2410]
["9003","Jasaan","Misamis Oriental",2411]
["9010","Kinogitan","Misamis Oriental",2412]
["9006","Lagonglong","Misamis Oriental",2413]
["9019","Laguindingan","Misamis Oriental",2414]
["9021","Libertad","Misamis Oriental",2415]
["9025","Lugait","Misamis Oriental",2416]
["9015","Magsaysay","Misamis Oriental",2417]
["9024","Manticao","Misamis Oriental",2421]
["9013","Medina","Misamis Oriental",2422]
["9023","Naawan","Misamis Oriental",2423]
["9016","Opol","Misamis Oriental",2424]
["9007","Salay","Misamis Oriental",2425]
["9009","Sugbungcogon","Misamis Oriental",2426]
["9001","Tagoloan","Misamis Oriental",2427]
["9012","Talisayan","Misamis Oriental",2428]
["9002","Villanueva","Misamis Oriental",2429]
["2623","Barlig","Mountain Province",2435]
["2621","Bauko","Mountain Province",2436]
["2618","Besao","Mountain Province",2437]
["2616","Bontoc","Mountain Province",2438]
["2624","Natonin","Mountain Province",2439]
["2625","Paracelis","Mountain Province",2440]
["2622","Sabangan","Mountain Province",2441]
["2617","Sadanga","Mountain Province",2442]
["2619","Sagada","Mountain Province",2443]
["2620","Tadian","Mountain Province",2444]
["1799","Ayala Alabang P.O. Boxes","Muntinlupa City",1910]
["1780","Ayala Alabang Subdivision","Muntinlupa City",1909]
["1772","Bayanan/Putatan","Muntinlupa City",1902]
["1771","Buli/Cupang","Muntinlupa City",1901]
["1770","Muntinlupa Central Post Office","Muntinlupa City",1900]
["1775","Pearl Heights","Muntinlupa City",1906]
["1777","Pleasant Village","Muntinlupa City",1908]
["1776","Poblacion","Muntinlupa City",1907]
["1772","Soldiers' Hills","Muntinlupa City",1903]
["1774","Susana Heights","Muntinlupa City",1905]
["1773","Tunasan","Muntinlupa City",1904]
["1411","Fish Market","Navotas City",1914]
["1412","Isla de Cocomo","Navotas City",1915]
["1413","Kapitbahayan [East]","Navotas City",1916]
["1409","Kaunlaran Village","Navotas City",1917]
["1485","Navotas","Navotas City",1918]
["1489","Tangos","Navotas City",1919]
["1490","Tanza","Navotas City",1920]
["6100","Bacolod City","Negros Occidental",2452]
["6101","Bago City","Negros Occidental",2453]
["6107","Binalbagan City","Negros Occidental",2454]
["6121","Cadiz City","Negros Occidental",2455]
["6126","Calatrava","Negros Occidental",2456]
["6110","Candoni","Negros Occidental",2457]
["6112","Cauayan","Negros Occidental",2469]
["6118","Enrique Magalona","Negros Occidental",2458]
["6124","Escalante City","Negros Occidental",2459]
["6108","Himamaylan City","Negros Occidental",2460]
["6106","Hinigaran City","Negros Occidental",2461]
["6114","Hinoba-an","Negros Occidental",2462]
["6109","Ilog","Negros Occidental",2466]
["6128","Isabela","Negros Occidental",2467]
["6111","Kabankalan City","Negros Occidental",2468]
["6130","La Carlota City","Negros Occidental",2470]
["6131","La Castillana","Negros Occidental",2471]
["6120","Manapla","Negros Occidental",2472]
["6132","Moises Padilla","Negros Occidental",2473]
["6129","Murcia","Negros Occidental",2474]
["6123","Paraiso (Fabrica)","Negros Occidental",2475]
["6105","Pontevedra","Negros Occidental",2476]
["6102","Pulupandan","Negros Occidental",2480]
["6122","Sagay City","Negros Occidental",2481]
["6127","San Carlos City","Negros Occidental",2482]
["6104","San Enrique","Negros Occidental",2483]
["6116","Silay City","Negros Occidental",2484]
["6117","Silay Hawaiian Central","Negros Occidental",2485]
["6113","Sipalay City","Negros Occidental",2486]
["6115","Talisay City","Negros Occidental",2487]
["6125","Toboso","Negros Occidental",2488]
["6103","Valladolid","Negros Occidental",2489]
["6119","Victorias City","Negros Occidental",2490]
["6203","Amlan","Negros Oriental",2500]
["6210","Ayungon","Negros Oriental",2501]
["6216","Bacong","Negros Oriental",2502]
["6206","Bais City","Negros Oriental",2503]
["6222","Basay","Negros Oriental",2504]
["6221","Bayawan City","Negros Oriental",2505]
["6209","Bindoy","Negros Oriental",2506]
["6223","Canlaon City","Negros Oriental",2507]
["6217","Dauin","Negros Oriental",2511]
["6200","Dumaguete City","Negros Oriental",2512]
["6214","Guihulngan","Negros Oriental",2513]
["6212","Jimalalud","Negros Oriental",2514]
["6213","La Libertad","Negros Oriental",2515]
["6207","Mabinay","Negros Oriental",2516]
["6208","Manjuyod","Negros Oriental",2517]
["6205","Pamplona","Negros Oriental",2518]
["6202","San Jose","Negros Oriental",2522]
["6219","Siaton","Negros Oriental",2523]
["6201","Sibulan","Negros Oriental",2524]
["6220","Sta. Catalina","Negros Oriental",2525]
["6204","Tanjay City","Negros Oriental",2526]
["6211","Tayasan","Negros Oriental",2527]
["6215","Valencia","Negros Oriental",2528]
["6224","Valle Hermoso","Negros Oriental",2529]
["6218","Zamboanguita","Negros Oriental",2531]
["6405","Allen","Northern Samar",2541]
["6410","Biri","Northern Samar",2542]
["6401","Bobon","Northern Samar",2543]
["6408","Capul","Northern Samar",2544]
["6400","Catarman","Northern Samar",2545]
["6418","Catubig","Northern Samar",2546]
["6422","Gamay","Northern Samar",2547]
["6411","Laoang","Northern Samar",2548]
["6423","Lapinig","Northern Samar",2552]
["6420","Las Navas","Northern Samar",2553]
["6404","Lavezares","Northern Samar",2554]
["6403","Lope de Vega","Northern Samar",2555]
["6412","Mapanas","Northern Samar",2556]
["6417","Mondragon","Northern Samar",2557]
["6421","Palapag","Northern Samar",2558]
["6413","Pambujan","Northern Samar",2559]
["6416","Rosario","Northern Samar",2563]
["6407","San Antonio","Northern Samar",2564]
["6409","San Isidro","Northern Samar",2565]
["6402","San Jose","Northern Samar",2566]
["6415","San Roque","Northern Samar",2567]
["6419","San Vicente","Northern Samar",2568]
["6414","Silvino Lobos","Northern Samar",2569]
["6406","Victoria","Northern Samar",2570]
["3111","Aliaga","Nueva Ecija",2580]
["3128","Bongabon","Nueva Ecija",2581]
["3100","Cabanatuan City","Nueva Ecija",2582]
["3107","Cabiao","Nueva Ecija",2583]
["3123","Carranglan","Nueva Ecija",2584]
["3120","Central Luzon State University","Nueva Ecija",2585]
["3117","Cuyapo","Nueva Ecija",2586]
["3130","Fort Magsaysay","Nueva Ecija",2587]
["3131","Gabaldon","Nueva Ecija",2588]
["3105","Gapan City","Nueva Ecija",2589]
["3125","General M. Natividad","Nueva Ecija",2590]
["3104","General Tinio","Nueva Ecija",2594]
["3115","Guimba","Nueva Ecija",2595]
["3109","Jaen","Nueva Ecija",2596]
["3129","Laur","Nueva Ecija",2597]
["3112","Licab","Nueva Ecija",2598]
["3126","Llanera","Nueva Ecija",2599]
["3122","Lupao","Nueva Ecija",2600]
["3116","Nampicuan","Nueva Ecija",2602]
["3132","Palayan City","Nueva Ecija",2603]
["3124","Pantabangan","Nueva Ecija",2604]
["3103","Peñaranda","Nueva Ecija",2608]
["3113","Quezon","Nueva Ecija",2609]
["3127","Rizal","Nueva Ecija",2610]
["3108","San Antonio","Nueva Ecija",2611]
["3106","San Isidro","Nueva Ecija",2612]
["3121","San Jose City","Nueva Ecija",2613]
["3102","San Leonardo","Nueva Ecija",2614]
["3101","Santa Rosa","Nueva Ecija",2615]
["3133","Santo Domingo","Nueva Ecija",2616]
["3119","Science City of Muñoz","Nueva Ecija",2601]
["3114","Talavera","Nueva Ecija",2617]
["3118","Talugtog","Nueva Ecija",2618]
["3110","Zaragoza","Nueva Ecija",2619]
["3714","Alfonso Castañeda","Nueva Vizcaya",2629]
["3701","Ambaguio","Nueva Vizcaya",2630]
["3704","Aritao","Nueva Vizcaya",2631]
["3711","Bagabag","Nueva Vizcaya",2632]
["3702","Bambang","Nueva Vizcaya",2633]
["3700","Bayombong","Nueva Vizcaya",2637]
["3712","Diadi","Nueva Vizcaya",2638]
["3706","Dupax del Norte","Nueva Vizcaya",2639]
["3707","Dupax del Sur","Nueva Vizcaya",2640]
["3703","Kasibu","Nueva Vizcaya",2641]
["3708","Kayapa","Nueva Vizcaya",2645]
["3714","Quezon","Nueva Vizcaya",2646]
["3705","Santa Fe (Imugan)","Nueva Vizcaya",2648]
["3709","Solano","Nueva Vizcaya",2647]
["3710","Villa Verde (Ibung)","Nueva Vizcaya",2649]
["5108","Abra de Ilog","Occidental Mindoro",2659]
["5102","Calintaan","Occidental Mindoro",2660]
["5111","Looc","Occidental Mindoro",2661]
["5109","Lubang","Occidental Mindoro",2662]
["5101","Magsaysay","Occidental Mindoro",2663]
["5106","Mamburao","Occidental Mindoro",2664]
["5107","Paluan","Occidental Mindoro",2668]
["5103","Rizal","Occidental Mindoro",2669]
["5104","Sablayan","Occidental Mindoro",2670]
["5100","San Jose","Occidental Mindoro",2671]
["5105","Santa Cruz","Occidental Mindoro",2672]
["5110","Tilik","Occidental Mindoro",2673]
["5201","Baco","Oriental Mindoro",2683]
["5210","Bansud","Oriental Mindoro",2684]
["5211","Bongabon","Oriental Mindoro",2685]
["5214","Bulalacao","Oriental Mindoro",2686]
["5200","Calapan","Oriental Mindoro",2687]
["5209","Gloria","Oriental Mindoro",2691]
["5213","Mansalay","Oriental Mindoro",2692]
["5204","Naujan","Oriental Mindoro",2693]
["5208","Pinamalayan","Oriental Mindoro",2694]
["5206","Pola","Oriental Mindoro",2695]
["5203","Puerto Galera","Oriental Mindoro",2699]
["5212","Roxas","Oriental Mindoro",2700]
["5202","San Teodoro","Oriental Mindoro",2701]
["5207","Socorro","Oriental Mindoro",2702]
["5205","Victoria","Oriental Mindoro",2703]
["5302","Aborlan","Palawan",2715]
["5320","Agutaya","Palawan",2739]
["5311","Araceli","Palawan",2727]
["5307","Balabac","Palawan",2723]
["5306","Bataraza","Palawan",2719]
["5305","Brooke's Point","Palawan",2718]
["5317","Busuanga","Palawan",2736]
["5321","Cagayancillo","Palawan",2740]
["5316","Coron","Palawan",2735]
["5315","Culion","Palawan",2734]
["5318","Cuyo","Palawan",2737]
["5310","Dumaran","Palawan",2726]
["5313","El Nido (Bacuit)","Palawan",2729]
["5301","Iwahig Penal Colony","Palawan",2714]
["5322","Kalayaan","Palawan",2741]
["5314","Linapacan","Palawan",2730]
["5319","Magsaysay","Palawan",2738]
["5303","Narra (Panacan)","Palawan",2716]
["5300","Puerto Princesa","Palawan",2713]
["5304","Quezon","Palawan",2717]
["5308","Roxas","Palawan",2724]
["5309","San Vicente","Palawan",2725]
["5312","Taytay","Palawan",2728]
["2009","Angeles City/Clark Special Economic ZoneBalibago a Barangay in Angeles city has its own zip code 2024","Pampanga",2751]
["2016","Apalit","Pampanga",2752]
["2012","Arayat","Pampanga",2753]
["2001","Bacolor","Pampanga",2754]
["2007","Basa Airbase","Pampanga",2755]
["2013","Candaba","Pampanga",2756]
["2000","City of San Fernando","Pampanga",2773]
["2006","Floridablanca","Pampanga",2757]
["2003","Guagua","Pampanga",2761]
["2005","Lubao","Pampanga",2762]
["2010","Mabalacat","Pampanga",2763]
["2018","Macabebe","Pampanga",2764]
["2011","Magalang","Pampanga",2765]
["2017","Masantol","Pampanga",2766]
["2021","Mexico","Pampanga",2767]
["2019","Minalin","Pampanga",2768]
["2008","Porac","Pampanga",2772]
["2014","San Luis","Pampanga",2774]
["2015","San Simon","Pampanga",2775]
["2022","Santa Ana","Pampanga",2776]
["2002","Santa Rita","Pampanga",2777]
["2020","Santo Tomas","Pampanga",2778]
["2004","Sasmuan (Sexmoan)","Pampanga",2779]
["2408","Agno","Pangasinan",2789]
["2415","Aguilar","Pangasinan",2790]
["2404","Alaminos","Pangasinan",2791]
["2425","Alcala","Pangasinan",2792]
["2405","Anda","Pangasinan",2793]
["2439","Asingan","Pangasinan",2794]
["2442","Balungao","Pangasinan",2795]
["2407","Bani","Pangasinan",2796]
["2422","Basista","Pangasinan",2797]
["2424","Bautista","Pangasinan",2798]
["2423","Bayambang","Pangasinan",2799]
["2436","Binalonan","Pangasinan",2800]
["2417","Binmaley","Pangasinan",2801]
["2406","Bolinao","Pangasinan",2802]
["2416","Bugallon","Pangasinan",2803]
["2410","Burgos","Pangasinan",2804]
["2418","Calasiao","Pangasinan",2808]
["2400","Dagupan City","Pangasinan",2809]
["2411","Dasol","Pangasinan",2810]
["2412","Infanta","Pangasinan",2811]
["2402","Labrador","Pangasinan",2812]
["2437","Laoac","Pangasinan",2813]
["2401","Lingayen","Pangasinan",2814]
["2409","Mabini","Pangasinan",2815]
["2421","Malasiqui","Pangasinan",2816]
["2430","Manaoag","Pangasinan",2817]
["2432","Mangaldan","Pangasinan",2818]
["2413","Mangatarem","Pangasinan",2819]
["2429","Mapandan","Pangasinan",2820]
["2446","Natividad","Pangasinan",2821]
["2435","Pozorrubio","Pangasinan",2822]
["2441","Rosales","Pangasinan",2823]
["2420","San Carlos City","Pangasinan",2827]
["2433","San Fabian","Pangasinan",2828]
["2431","San Jacinto","Pangasinan",2829]
["2438","San Manuel","Pangasinan",2830]
["2447","San Nicolas","Pangasinan",2831]
["2444","San Quintin","Pangasinan",2832]
["2419","Santa Barbara","Pangasinan",2833]
["2440","Santa Maria","Pangasinan",2834]
["2426","Santo Tomas","Pangasinan",2835]
["2434","Sison","Pangasinan",2836]
["2403","Sual","Pangasinan",2837]
["2445","Tayug","Pangasinan",2838]
["2443","Umingan","Pangasinan",2839]
["2414","Urbiztondo","Pangasinan",2840]
["2428","Urdaneta","Pangasinan",2841]
["2427","Villasis","Pangasinan",2842]
["1714","Aeropark Subdivision","Parañaque City",1928]
["1702","Baclaran","Parañaque City",1929]
["1711","Better Living Subdivision","Parañaque City",1930]
["1720","BF Homes 1","Parañaque City",1931]
["1718","BF Homes 2","Parañaque City",1932]
["1375","Domestic Airport P.O. - P.O. Box Nos. 1000 to 1099","Parañaque City",1933]
["1376","Domestic Airport P.O. - P.O. Box Nos. 1100 to 1199","Parañaque City",1934]
["1377","Domestic Airport P.O. - P.O. Box Nos. 1200 to 1299","Parañaque City",1935]
["1378","Domestic Airport P.O. - P.O. Box Nos. 1300 to 1399","Parañaque City",1936]
["1379","Domestic Airport P.O. - P.O. Box Nos. 1400 to 1499","Parañaque City",1937]
["1380","Domestic Airport P.O. - P.O. Box Nos. 1500 to 1599","Parañaque City",1938]
["1381","Domestic Airport P.O. - P.O. Box Nos. 1600 to 1699","Parañaque City",1939]
["1710","Executive Heights Subdivision","Parañaque City",1940]
["1719","Ireneville Subdivision I & III","Parañaque City",1941]
["1714","Ireneville Subdivision II","Parañaque City",1942]
["1717","Manila Memorial Park","Parañaque City",1946]
["1703","Marina Subdivision (Reclamation)","Parañaque City",1947]
["1719","Maywood Village I","Parañaque City",1948]
["1716","Maywood Village II","Parañaque City",1949]
["1712","Miramar Subdivision","Parañaque City",1950]
["1708","Multinational Village","Parañaque City",1951]
["1705","Ninoy Aquino International Airport","Parañaque City",1952]
["1700","Parañaque CPO","Parañaque City",1953]
["1706","Pulo","Parañaque City",1954]
["1715","San Antonio Valley 1","Parañaque City",1955]
["1707","San Antonio Valley 11 & 12","Parañaque City",1956]
["1704","Santo Niño","Parañaque City",1957]
["1709","South Admiral Village, Merville Park & Moonwalk Subdivision","Parañaque City",1958]
["1701","Tambo","Parañaque City",1959]
["1713","United Parañaque Subdivision","Parañaque City",1960]
["1308","Bay City","Pasay City",1980]
["1301","Domestic Airport P.O.","Pasay City",1973]
["1300","Pasay City Central Post Office","Pasay City",1972]
["1350","Pasay City CPO - P.O. Box Nos. 1000 to 1099","Pasay City",1985]
["1351","Pasay City CPO - P.O. Box Nos. 1100 to 1199","Pasay City",1986]
["1352","Pasay City CPO - P.O. Box Nos. 1200 to 1299","Pasay City",1987]
["1353","Pasay City CPO - P.O. Box Nos. 1300 to 1399","Pasay City",1988]
["1354","Pasay City CPO - P.O. Box Nos. 1400 to 1499","Pasay City",1989]
["1307","Philippine International Convention Center","Pasay City",1979]
["1306","San Isidro","Pasay City",1978]
["1305","San Jose","Pasay City",1977]
["1302","San Rafael","Pasay City",1974]
["1303","San Roque","Pasay City",1975]
["1304","Santa Clara","Pasay City",1976]
["1309","Villamor Airbase","Pasay City",1981]
["1606","Caniogan","Pasig City",2005]
["1612","Green Park","Pasig City",2011]
["1603","Kapitolyo","Pasig City",2002]
["1611","Manggahan","Pasig City",2010]
["1607","Maybunga","Pasig City",2006]
["1605","Ortigas Post Office","Pasig City",2004]
["1600","Pasig Central Post Office","Pasig City",1999]
["1650","Pasig Ortigas CTR-PO Box# 1000 to 1099","Pasig City",2015]
["1651","Pasig Ortigas CTR-PO Box# 1100 to 1199","Pasig City",2016]
["1652","Pasig Ortigas CTR-PO Box# 1200 to 1299","Pasig City",2017]
["1653","Pasig Ortigas CTR-PO Box# 1300 to 1399","Pasig City",2018]
["1654","Pasig Ortigas CTR-PO Box# 1400 to 1499","Pasig City",2019]
["1655","Pasig Ortigas CTR-PO Box# 1500 to 1599","Pasig City",2020]
["1656","Pasig Ortigas CTR-PO Box# 1600 to 1699","Pasig City",2021]
["1657","Pasig Ortigas CTR-PO Box# 1700 to 1799","Pasig City",2022]
["1658","Pasig Ortigas CTR-PO Box# 1800 to 1899","Pasig City",2023]
["1659","Pasig Ortigas CTR-PO Box# 1900 to 1999","Pasig City",2024]
["1660","Pasig Ortigas CTR-PO Box# 2000 to 2099","Pasig City",2025]
["1661","Pasig Ortigas CTR-PO Box# 2100 to 2199","Pasig City",2026]
["1662","Pasig Ortigas CTR-PO Box# 2200 to 2299","Pasig City",2027]
["1663","Pasig Ortigas CTR-PO Box# 2300 to 2399","Pasig City",2028]
["1664","Pasig Ortigas CTR-PO Box# 2400 to 2499","Pasig City",2029]
["1665","Pasig Ortigas CTR-PO Box# 2500 to 2599","Pasig City",2030]
["1666","Pasig Ortigas CTR-PO Box# 2600 to 2699","Pasig City",2031]
["1667","Pasig Ortigas CTR-PO Box# 2700 to 2799","Pasig City",2032]
["1668","Pasig Ortigas CTR-PO Box# 2800 to 2899","Pasig City",2033]
["1669","Pasig Ortigas CTR-PO Box# 2900 to 2999","Pasig City",2034]
["1670","Pasig Ortigas CTR-PO Box# 3000 to 3099","Pasig City",2035]
["1671","Pasig Ortigas CTR-PO Box# 3100 to 3199","Pasig City",2036]
["1672","Pasig Ortigas CTR-PO Box# 3200 to 3299","Pasig City",2037]
["1673","Pasig Ortigas CTR-PO Box# 3300 to 3399","Pasig City",2038]
["1674","Pasig Ortigas CTR-PO Box# 3400 to 3499","Pasig City",2039]
["1675","Pasig Ortigas CTR-PO Box# 3500 to 3599","Pasig City",2040]
["1676","Pasig Ortigas CTR-PO Box# 3600 to 3699","Pasig City",2041]
["1677","Pasig Ortigas CTR-PO Box# 3700 to 3799","Pasig City",2042]
["1678","Pasig Ortigas CTR-PO Box# 3800 to 3899","Pasig City",2043]
["1679","Pasig Ortigas CTR-PO Box# 3900 to 3999","Pasig City",2044]
["1680","Pasig Ortigas CTR-PO Box# 4000 to 4099","Pasig City",2045]
["1681","Pasig Ortigas CTR-PO Box# 4100 to 4199","Pasig City",2046]
["1682","Pasig Ortigas CTR-PO Box# 4200 to 4299","Pasig City",2047]
["1683","Pasig Ortigas CTR-PO Box# 4300 to 4399","Pasig City",2048]
["1684","Pasig Ortigas CTR-PO Box# 4400 to 4499","Pasig City",2049]
["1685","Pasig Ortigas CTR-PO Box# 4500 to 4599","Pasig City",2050]
["1686","Pasig Ortigas CTR-PO Box# 4600 to 4699","Pasig City",2051]
["1687","Pasig Ortigas CTR-PO Box# 4700 to 4799","Pasig City",2052]
["1688","Pasig Ortigas CTR-PO Box# 4800 to 4899","Pasig City",2053]
["1689","Pasig Ortigas CTR-PO Box# 4900 to 4999","Pasig City",2054]
["1690","Pasig Ortigas CTR-PO Box# 5000 to 5099","Pasig City",2055]
["1691","Pasig Ortigas CTR-PO Box# 5100 to 5199","Pasig City",2056]
["1692","Pasig Ortigas CTR-PO Box# 5200 to 5299","Pasig City",2057]
["1693","Pasig Ortigas CTR-PO Box# 5300 to 5399","Pasig City",2058]
["1694","Pasig Ortigas CTR-PO Box# 5400 to 5499","Pasig City",2059]
["1695","Pasig Ortigas CTR-PO Box# 5500 to 5599","Pasig City",2060]
["1696","Pasig Ortigas CTR-PO Box# 5600 to 5699","Pasig City",2061]
["1697","Pasig Ortigas CTR-PO Box# 5700 to 5799","Pasig City",2062]
["1698","Pasig Ortigas CTR-PO Box# 5800 to 5899","Pasig City",2063]
["1699","Pasig Ortigas CTR-PO Box# 5900 to 5999","Pasig City",2064]
["1602","Pinagbuhatan","Pasig City",2001]
["1609","Rosario","Pasig City",2008]
["1601","San Joaquin","Pasig City",2000]
["1608","Santa Lucia","Pasig City",2007]
["1610","Santolan","Pasig City",2009]
["1604","Ugong","Pasig City",2003]
["1620","Aguho","Pateros",2070]
["1621","Santa Ana","Pateros",2071]
["4304","Agdangan","Quezon",2852]
["4333","Alabat","Quezon",2853]
["4331","Atimonan","Quezon",2854]
["4320","Buenavista","Quezon",2855]
["4340","Burdeos","Quezon",2856]
["4318","Calauag","Quezon",2857]
["4323","Candelaria","Quezon",2858]
["4311","Catanauan","Quezon",2859]
["4326","Dolores","Quezon",2860]
["4310","General Antonio Luna","Quezon",2861]
["4338","General Nakar","Quezon",2862]
["4319","Guinayangan","Quezon",2863]
["4307","Gumaca","Quezon",2864]
["4317","Hondagua","Quezon",2865]
["4336","Infanta","Quezon",2869]
["4342","Jomalig","Quezon",2870]
["4316","Lopez","Quezon",2871]
["4328","Lucban","Quezon",2872]
["4301","Lucena City","Quezon",2873]
["4309","Macalelon","Quezon",2874]
["4330","Mauban","Quezon",2875]
["4312","Mulanay","Quezon",2876]
["4303","Padre Burgos","Quezon",2877]
["4302","Pagbilao","Quezon",2878]
["4337","Panukulan","Quezon",2879]
["4341","Patnanungan","Quezon",2880]
["4334","Perez","Quezon",2881]
["4308","Pitogo","Quezon",2882]
["4306","Plaridel","Quezon",2883]
["4339","Polilio","Quezon",2887]
["4300","Provincial Capitol, Lucena City","Quezon",2889]
["4332","Quezon","Quezon",2888]
["4335","Real","Quezon",2890]
["4329","Sampaloc","Quezon",2891]
["4314","San Andres","Quezon",2892]
["4324","San Antonio","Quezon",2893]
["4315","San Francisco (Aurora)","Quezon",2894]
["4313","San Narciso","Quezon",2895]
["4322","Sariaya","Quezon",2896]
["4321","Tagkawayan","Quezon",2897]
["4327","Tayabas","Quezon",2898]
["4325","Tiaong","Quezon",2899]
["4305","Unisan","Quezon",2900]
["1105","Alicia","Quezon City",2079]
["1102","Amihan","Quezon City",2080]
["1106","Apolonio Samson","Quezon City",2081]
["0810","Araneta Center","Quezon City",2082]
["1135","Araneta Center P.O. Boxes","Quezon City",2083]
["1106","Baesa","Quezon City",2084]
["1116","Bagbag","Quezon City",2085]
["1110","Bagong Bayan","Quezon City",2086]
["1109","Bagong Buhay","Quezon City",2087]
["1111","Bagong Lipunan","Quezon City",2088]
["1105","Bagong Pag-Asa","Quezon City",2089]
["1119","Bagong Silangan","Quezon City",2090]
["1106","Bahay Toro","Quezon City",2091]
["1115","Balingasa","Quezon City",2092]
["1106","Balintawak","Quezon City",2093]
["1106","Balumbato","Quezon City",2094]
["1126","Batasan Hills","Quezon City",2095]
["1109","Bayanihan","Quezon City",2096]
["1120","BF Homes","Quezon City",2097]
["1109","Blue Ridge","Quezon City",2098]
["1101","Botocan","Quezon City",2099]
["1141","Broadway Center P.O. Boxes","Quezon City",2100]
["1105","Bungad","Quezon City",2101]
["0820","Bureau of Internal Revenue","Quezon City",2102]
["0802","Camp Aguinaldo","Quezon City",2104]
["1110","Camp Aguinaldo","Quezon City",2103]
["0801","Camp Crame","Quezon City",2105]
["1126","Capitol Hills/Park","Quezon City",2106]
["1117","Capri","Quezon City",2107]
["1100","Central","Quezon City",2108]
["1102","Claro","Quezon City",2109]
["0880","Commission on Audit","Quezon City",2110]
["1121","Commonwealth","Quezon City",2111]
["1111","Crame","Quezon City",2112]
["1109","Cubao","Quezon City",2113]
["1128","Culiat","Quezon City",2114]
["1115","Damar","Quezon City",2115]
["1104","Damayan","Quezon City",2116]
["1112","Damayan Lagi","Quezon City",2117]
["1123","Damong Maliit","Quezon City",2118]
["1105","Del Monte","Quezon City",2119]
["1104","Diliman","Quezon City",2120]
["1109","Dioquino Zobel","Quezon City",2121]
["1113","Don Manuel","Quezon City",2122]
["1113","Doña Aurora","Quezon City",2123]
["1125","Doña Faustina Subdivision","Quezon City",2124]
["1113","Doña Imelda","Quezon City",2125]
["1113","Doña Josefa","Quezon City",2126]
["1102","Duyan-Duyan","Quezon City",2127]
["1102","E. Rodriguez","Quezon City",2128]
["1109","Escopa","Quezon City",2129]
["1118","Fairview","Quezon City",2130]
["1121","Fairview [North]","Quezon City",2131]
["1122","Fairview [South]","Quezon City",2132]
["1114","Gintong Silahis","Quezon City",2133]
["1117","Gulod","Quezon City",2134]
["1127","Holy Spirit","Quezon City",2135]
["1112","Horseshoe","Quezon City",2136]
["1111","Immaculate Concepcion","Quezon City",2137]
["1124","Kaligayahan","Quezon City",2138]
["1112","Kalusugan","Quezon City",2139]
["1102","Kamias","Quezon City",2140]
["1103","Kamuning","Quezon City",2141]
["1105","Katipunan","Quezon City",2142]
["1111","Kaunlaran","Quezon City",2146]
["1112","Kristong Hari","Quezon City",2147]
["1101","Krus na Ligas","Quezon City",2148]
["1114","La Loma","Quezon City",2149]
["1103","Laging Handa","Quezon City",2150]
["1110","Libis","Quezon City",2151]
["1114","Lourdes","Quezon City",2152]
["1108","Loyola Heights","Quezon City",2153]
["1114","Maharlika","Quezon City",2154]
["1101","Malaya","Quezon City",2155]
["1109","Mangga","Quezon City",2156]
["1115","Manresa","Quezon City",2157]
["1112","Mariana","Quezon City",2158]
["1104","Mariblo","Quezon City",2159]
["1109","Marilag","Quezon City",2160]
["1109","Masagana","Quezon City",2161]
["1115","Masambong","Quezon City",2162]
["1114","Matalahib","Quezon City",2163]
["1119","Matandang Balara","Quezon City",2164]
["1109","Milagrosa","Quezon City",2165]
["1138","Murphy District P.O. Boxes","Quezon City",2166]
["1125","Nagkaisang Nayon","Quezon City",2167]
["0830","National Irrigation Administration","Quezon City",2168]
["1104","Nayon Kaunlaran","Quezon City",2169]
["1107","New Era","Quezon City",2170]
["1147","Novaliches P.O. Boxes","Quezon City",2171]
["1123","Novaliches Proper","Quezon City",2172]
["1103","Obrero","Quezon City",2173]
["1101","Old Capitol Site","Quezon City",2174]
["1114","Paang Bundok","Quezon City",2175]
["1115","Pag-Ibig sa Nayon","Quezon City",2176]
["1103","Paligsahan","Quezon City",2177]
["1105","Paltok","Quezon City",2178]
["1108","Pansol","Quezon City",2179]
["1104","Paraiso","Quezon City",2180]
["1118","Pasong Putik","Quezon City",2181]
["1107","Pasong Tamo","Quezon City",2182]
["1119","Payatas","Quezon City",2183]
["1104","Phil-Am","Quezon City",2184]
["0850","Philippine Heart Center","Quezon City",2185]
["1111","Pinagkaisahan","Quezon City",2186]
["1100","Piñahan","Quezon City",2187]
["1109","Project 4","Quezon City",2188]
["1100","Project 6","Quezon City",2189]
["1105","Project 7","Quezon City",2190]
["1106","Project 8","Quezon City",2191]
["1100","Quezon City CPO","Quezon City",2192]
["1150","Quezon City CPO - P.O. Box Nos. 1000 to 1099","Quezon City",2193]
["1151","Quezon City CPO - P.O. Box Nos. 1100 to 1199","Quezon City",2194]
["1152","Quezon City CPO - P.O. Box Nos. 1200 to 1299","Quezon City",2195]
["1153","Quezon City CPO - P.O. Box Nos. 1300 to 1399","Quezon City",2196]
["1154","Quezon City CPO - P.O. Box Nos. 1400 to 1499","Quezon City",2197]
["1155","Quezon City CPO - P.O. Box Nos. 1500 to 1599","Quezon City",2198]
["1156","Quezon City CPO - P.O. Box Nos. 1600 to 1699","Quezon City",2199]
["1157","Quezon City CPO - P.O. Box Nos. 1700 to 1799","Quezon City",2200]
["1158","Quezon City CPO - P.O. Box Nos. 1800 to 1899","Quezon City",2201]
["1159","Quezon City CPO - P.O. Box Nos. 1900 to 1999","Quezon City",2202]
["1160","Quezon City CPO - P.O. Box Nos. 2000 to 2099","Quezon City",2203]
["1161","Quezon City CPO - P.O. Box Nos. 2100 to 2199","Quezon City",2204]
["1162","Quezon City CPO - P.O. Box Nos. 2200 to 2299","Quezon City",2205]
["1163","Quezon City CPO - P.O. Box Nos. 2300 to 2399","Quezon City",2206]
["1164","Quezon City CPO - P.O. Box Nos. 2400 to 2499","Quezon City",2207]
["1165","Quezon City CPO - P.O. Box Nos. 2500 to 2599","Quezon City",2208]
["1166","Quezon City CPO - P.O. Box Nos. 2600 to 2699","Quezon City",2209]
["1167","Quezon City CPO - P.O. Box Nos. 2700 to 2799","Quezon City",2213]
["1168","Quezon City CPO - P.O. Box Nos. 2800 to 2899","Quezon City",2214]
["1169","Quezon City CPO - P.O. Box Nos. 2900 to 2999","Quezon City",2215]
["1170","Quezon City CPO - P.O. Box Nos. 3000 to 3099","Quezon City",2216]
["1171","Quezon City CPO - P.O. Box Nos. 3100 to 3199","Quezon City",2217]
["1172","Quezon City CPO - P.O. Box Nos. 3200 to 3299","Quezon City",2218]
["1173","Quezon City CPO - P.O. Box Nos. 3300 to 3399","Quezon City",2219]
["1174","Quezon City CPO - P.O. Box Nos. 3400 to 3499","Quezon City",2220]
["1175","Quezon City CPO - P.O. Box Nos. 3500 to 3599","Quezon City",2221]
["1176","Quezon City CPO - P.O. Box Nos. 3600 to 3699","Quezon City",2222]
["1177","Quezon City CPO - P.O. Box Nos. 3700 to 3799","Quezon City",2223]
["0860","Quezon City Hall","Quezon City",2224]
["1102","Quirino District (Project 2 & 3)","Quezon City",2225]
["1105","R. Magsaysay","Quezon City",2226]
["1103","Roxas District","Quezon City",2227]
["1103","Sacred Heart","Quezon City",2228]
["1114","Salvacion","Quezon City",2229]
["1117","San Agustin","Quezon City",2230]
["1105","San Antonio, Quezon City","Quezon City",2231]
["1116","San Bartolome","Quezon City",2232]
["1113","San Isidro","Quezon City",2233]
["1114","San Isidro Labrador","Quezon City",2234]
["1115","San Jose","Quezon City",2235]
["1109","San Roque","Quezon City",2236]
["1101","San Vicente","Quezon City",2237]
["1116","Sangandaan","Quezon City",2238]
["1104","Santa Cruz","Quezon City",2239]
["1117","Santa Lucia","Quezon City",2240]
["1117","Santa Monica","Quezon City",2241]
["1114","Santa Teresita","Quezon City",2242]
["1105","Santo Cristo","Quezon City",2243]
["1113","Santo Niño","Quezon City",2244]
["1113","Santol","Quezon City",2245]
["1116","Sauyo","Quezon City",2246]
["1114","Sienna","Quezon City",2247]
["1101","Sikatuna Village","Quezon City",2248]
["1102","Silangan","Quezon City",2249]
["0800","Social Security System","Quezon City",2250]
["1109","Socorro","Quezon City",2251]
["1103","South Triangle","Quezon City",2252]
["1110","St. Ignatius","Quezon City",2253]
["1111","St. Martin de Porres","Quezon City",2254]
["1114","St. Peter","Quezon City",2255]
["1109","Tagumpay","Quezon City",2256]
["1110","Talampas","Quezon City",2257]
["1104","Talayan","Quezon City",2258]
["1116","Talipapa","Quezon City",2259]
["1116","Tandang Sora","Quezon City",2260]
["1113","Tatalon","Quezon City",2261]
["1101","Teachers Village","Quezon City",2262]
["1110","Ugong Norte","Quezon City",2263]
["1106","Unang Sigaw","Quezon City",2264]
["1144","University of the Philippines P.O. Boxes","Quezon City",2266]
["1101","University of the Philippines Post Office","Quezon City",2265]
["1101","University of the Philippines Village","Quezon City",2267]
["0840","V. Luna Hospital","Quezon City",2268]
["1112","Valencia","Quezon City",2269]
["1128","Vasra","Quezon City",2270]
["0870","Veterans Hospital","Quezon City",2271]
["1105","Veterans Village","Quezon City",2272]
["1109","Villa Maria Clara","Quezon City",2273]
["1120","Violago Homes","Quezon City",2274]
["1104","West Triangle","Quezon City",2275]
["1110","White Plains","Quezon City",2276]
["3403","Aglipay","Quirino",2909]
["3400","Cabarroguis","Quirino",2906]
["3401","Diffun","Quirino",2907]
["3404","Maddela","Quirino",2910]
["3405","Nagtipunan (Abbag)","Quirino",2911]
["3402","Saguday","Quirino",2908]
["1930","Angono","Rizal",2929]
["1870","Antipolo City","Rizal",2921]
["1970","Baras","Rizal",2933]
["1940","Binangonan","Rizal",2930]
["1900","Cainta","Rizal",2923]
["1950","Cardona","Rizal",2931]
["1900","Jalajala","Rizal",2935]
["1960","Morong","Rizal",2932]
["1910","Pililla","Rizal",2924]
["1860","Rodriguez","Rizal",2920]
["1850","San Mateo","Rizal",2919]
["1980","Tanay","Rizal",2934]
["1920","Taytay","Rizal",2925]
["1880","Teresa","Rizal",2922]
["5509","Alcantara","Romblon",2945]
["5515","Banton (Jones)","Romblon",2946]
["5512","Cajidiocan","Romblon",2947]
["5503","Calatrava","Romblon",2948]
["5516","Concepcion","Romblon",2949]
["5514","Corcuera","Romblon",2953]
["5506","Ferrol","Romblon",2954]
["5502","Imelda","Romblon",2955]
["5507","Looc","Romblon",2956]
["5511","Magdiwang","Romblon",2957]
["5505","Odiongan","Romblon",2958]
["5500","Romblon","Romblon",2962]
["5501","San Agustin","Romblon",2963]
["5504","San Andres","Romblon",2964]
["5513","San Fernando","Romblon",2965]
["5510","San Jose","Romblon",2966]
["5508","Santa Fe","Romblon",2967]
["1504","Eisenhower - Crame","San Juan City",2286]
["1503","Greenhills [North]","San Juan City",2288]
["1502","Greenhills Post Office","San Juan City",2287]
["1500","San Juan Central Post Office","San Juan City",2289]
["9501","Alabel","Sarangani",2973]
["9517","Glan","Sarangani",2974]
["9514","Kiamba","Sarangani",2975]
["9502","Maasim","Sarangani",2976]
["9515","Maitum","Sarangani",2977]
["9516","Malapatan","Sarangani",2978]
["9503","Malungon","Sarangani",2979]
["9603","Ampatuan City","Shariff Kabunsuan",2991]
["9614","Barira","Shariff Kabunsuan",2983]
["9615","Buldon","Shariff Kabunsuan",2984]
["9601","Datu Odin Sinsuat (Dinaig)","Shariff Kabunsuan",2985]
["9606","Kabuntalan/Northern Kabuntalan","Shariff Kabunsuan",2986]
["9613","Matanog","Shariff Kabunsuan",2987]
["9604","Parang","Shariff Kabunsuan",2988]
["9605","Sultan Kudarat/Sultan Mastura","Shariff Kabunsuan",2989]
["9602","Upi/Datu Blah T. Sinsuat","Shariff Kabunsuan",2990]
["6230","Enrique Villanueva","Siquijor",2995]
["6226","Larena","Siquijor",2996]
["6228","Lazi","Siquijor",2997]
["6229","Maria","Siquijor",2998]
["6227","San Juan","Siquijor",2999]
["6225","Siquij","Siquijor",3000]
["4701","Bacon","Sorsogon",3008]
["4712","Barcelona","Sorsogon",3009]
["4706","Bulan","Sorsogon",3010]
["4704","Bulusan","Sorsogon",3011]
["4702","Casiguran","Sorsogon",3012]
["4713","Castilla","Sorsogon",3016]
["4715","Donsol","Sorsogon",3017]
["4710","Gubat","Sorsogon",3018]
["4707","Irosin","Sorsogon",3019]
["4703","Juban","Sorsogon",3020]
["4705","Magallanes","Sorsogon",3024]
["4708","Matnog","Sorsogon",3025]
["4714","Pilar","Sorsogon",3026]
["4711","Prieto Diaz","Sorsogon",3027]
["4709","Santa Magdalena","Sorsogon",3028]
["4700","Sorsogon","Sorsogon",3029]
["9511","Banga","South Cotabato",3035]
["9500","General Santos City (Dadiangas)","South Cotabato",3036]
["9506","Koronadal City","South Cotabato",3037]
["9508","Norala","South Cotabato",3038]
["9504","Polomolok","South Cotabato",3039]
["9509","Sto. Niño","South Cotabato",3040]
["9512","Surallah","South Cotabato",3041]
["9507","Tampakan","South Cotabato",3042]
["9510","Tantangan","South Cotabato",3043]
["9513","T'Boli","South Cotabato",3044]
["9505","Tupi","South Cotabato",3045]
["6610","Anahawan","Southern Leyte",3053]
["6604","Bontoc","Southern Leyte",3054]
["6608","Hinunangan","Southern Leyte",3055]
["6609","Hinundayan","Southern Leyte",3056]
["6615","Libagon","Southern Leyte",3057]
["6612","Liloan","Southern Leyte",3058]
["6600","Maasin","Southern Leyte",3062]
["6601","Macrohon","Southern Leyte",3063]
["6603","Malitbog","Southern Leyte",3064]
["6602","Padre Burgos","Southern Leyte",3065]
["6614","Pintuyan","Southern Leyte",3066]
["6613","San Francisco","Southern Leyte",3067]
["6611","San Juan (Cabalian)","Southern Leyte",3071]
["6617","San Ricardo","Southern Leyte",3072]
["6607","Silago","Southern Leyte",3073]
["6606","Sogod","Southern Leyte",3074]
["6616","St. Bernard","Southern Leyte",3075]
["6605","Tomas Oppus","Southern Leyte",3076]
["9810","Bagumbayan","Sultan Kudarat",3086]
["9801","Columbio","Sultan Kudarat",3087]
["9806","Esperanza (Ampatuan)","Sultan Kudarat",3088]
["9805","Isulan","Sultan Kudarat",3089]
["9808","Kalamansig","Sultan Kudarat",3090]
["9807","Lebak (Salaman)","Sultan Kudarat",3091]
["9803","Lutayan","Sultan Kudarat",3095]
["9802","Mariano Marcos","Sultan Kudarat",3096]
["9809","Palimbang","Sultan Kudarat",3097]
["9804","Pres. Quirino","Sultan Kudarat",3098]
["9811","Sen. Ninoy Aquino","Sultan Kudarat",3099]
["9800","Tacurong","Sultan Kudarat",3100]
["7407","Indanan","Sulu",3110]
["7400","Jolo","Sulu",3111]
["7416","Kalingalan Kalauang","Sulu",3112]
["7411","Lugus","Sulu",3113]
["7404","Luuk","Sulu",3114]
["7409","Maimbung","Sulu",3118]
["7413","Marungas","Sulu",3119]
["7402","Panamao","Sulu",3120]
["7415","Panglima Estino","Sulu",3121]
["7414","Panguntaran","Sulu",3122]
["7408","Parang","Sulu",3123]
["7405","Pata","Sulu",3127]
["7401","Patikul","Sulu",3128]
["7412","Siasi","Sulu",3129]
["7403","Talipao","Sulu",3130]
["7410","Tapul","Sulu",3131]
["7406","Tongkil","Sulu",3132]
["8425","Alegria","Surigao del Norte",3142]
["8408","Bacuag","Surigao del Norte",3143]
["8424","Burgos","Surigao del Norte",3144]
["8410","Claver","Surigao del Norte",3145]
["8417","Dapa","Surigao del Norte",3146]
["8418","Del Carmen","Surigao del Norte",3147]
["8419","Gen. Luna","Surigao del Norte",3148]
["8409","Gigaquit","Surigao del Norte",3152]
["8407","Mainit","Surigao del Norte",3153]
["8402","Malimano","Surigao del Norte",3154]
["8420","Pilar","Surigao del Norte",3155]
["8405","Placer","Surigao del Norte",3156]
["8423","San Benito","Surigao del Norte",3157]
["8401","San Francisco","Surigao del Norte",3158]
["8421","San Isidro","Surigao del Norte",3162]
["8422","Santa Monica","Surigao del Norte",3163]
["8404","Sison","Surigao del Norte",3164]
["8416","Socorro","Surigao del Norte",3165]
["8400","Surigao City","Surigao del Norte",3166]
["8403","Tagana-an","Surigao del Norte",3167]
["8406","Tubod","Surigao del Norte",3168]
["8309","Barobo","Surigao del Sur",3178]
["8303","Bayabas","Surigao del Sur",3179]
["8311","Bislig","Surigao del Sur",3180]
["8304","Cagwait","Surigao del Sur",3181]
["8317","Cantillan","Surigao del Sur",3182]
["8315","Carmen","Surigao del Sur",3183]
["8318","Carrascal","Surigao del Sur",3187]
["8313","Cortez","Surigao del Sur",3188]
["8310","Hinatuan","Surigao del Sur",3189]
["8314","Lanuza","Surigao del Sur",3190]
["8307","Lianga","Surigao del Sur",3191]
["8312","Lingig","Surigao del Sur",3192]
["8316","Madrid","Surigao del Sur",3196]
["8306","Marihatag","Surigao del Sur",3197]
["8305","San Agustin","Surigao del Sur",3198]
["8301","San Miguel","Surigao del Sur",3199]
["8308","Tagbina","Surigao del Sur",3200]
["8302","Tago","Surigao del Sur",3201]
["8300","Tandag","Surigao del Sur",3202]
["1636","Bay Breeze Executive Village","Taguig City",2316]
["1631","Bicutan","Taguig City",2317]
["1638","Ligid","Taguig City",2324]
["1634","Nichols - McKinley","Taguig City",2325]
["1637","Tuktukan","Taguig City",2326]
["1633","Upper Bicutan","Taguig City",2319]
["1632","ususan","Taguig City",2318]
["1630","Western Bicutan (inc FTI)","Taguig City",2323]
["2307","[Paniqui]","Tarlac",3224]
["2310","Anao","Tarlac",3212]
["2317","Bamban","Tarlac",3213]
["7500","Bongao","Tarlac",3240]
["2306","Camiling","Tarlac",3214]
["2333","Capas","Tarlac",3215]
["2316","Concepcion","Tarlac",3216]
["2302","Gerona","Tarlac",3217]
["2314","La Paz","Tarlac",3221]
["7509","Languyan","Tarlac",3242]
["7508","Mapun (Cagayan de Sulu)","Tarlac",3241]
["2304","Mayantoc","Tarlac",3222]
["2334","Moncada","Tarlac",3223]
["7501","Panglima Sugala (Balimbing)","Tarlac",3243]
["2312","Pura","Tarlac",3225]
["2311","Ramos","Tarlac",3226]
["2305","San Clemente","Tarlac",3230]
["2301","San Jose","Tarlac",3232]
["2309","San Manuel","Tarlac",3231]
["2303","Santa Ignacia","Tarlac",3233]
["7503","Sapa-Sapa","Tarlac",3244]
["7505","Simunul","Tarlac",3248]
["7506","Sitangkai","Tarlac",3249]
["7504","South Ubian","Tarlac",3250]
["7502","Tandubas","Tarlac",3252]
["2300","Tarlac City","Tarlac",3234]
["7507","Turtle Island (Taganak)","Tarlac",3251]
["2313","Victoria","Tarlac",3235]
["1444","Arkong Bato","Valenzuela City",2336]
["1445","Balangkas - Caloong","Valenzuela City",2337]
["1443","Dalandanan - West Canumay","Valenzuela City",2338]
["1447","East Canumay - Lawang Bato Punturin","Valenzuela City",2339]
["1442","Fortune Village","Valenzuela City",2340]
["1442","General T. de Leon","Valenzuela City",2341]
["1441","Karuhatan","Valenzuela City",2342]
["1446","Lingunan","Valenzuela City",2343]
["1444","Mabolo","Valenzuela City",2344]
["1444","Malanday","Valenzuela City",2345]
["1448","Mapulang Lupa","Valenzuela City",2349]
["1442","Paso de Blas","Valenzuela City",2350]
["1444","Pasolo","Valenzuela City",2351]
["1444","Polo","Valenzuela City",2352]
["1444","Rincon","Valenzuela City",2353]
["1440","Valenzuela Central Post Office - Malinta","Valenzuela City",2354]
["1469","Valenzuela P.O. Boxes","Valenzuela City",2355]
["6724","Almagro","Western Samar",3262]
["6720","Basey","Western Samar",3263]
["6710","Calbayog City","Western Samar",3264]
["6715","Calbiga","Western Samar",3265]
["6700","Catbalogan","Western Samar",3266]
["6722","Daram","Western Samar",3267]
["6706","Gandara","Western Samar",3268]
["6713","Hinabangan","Western Samar",3269]
["6701","Jiabong","Western Samar",3270]
["6721","Marabut","Western Samar",3274]
["6708","Matuguinao","Western Samar",3275]
["6702","Motiong","Western Samar",3276]
["6705","Pagsanghan","Western Samar",3277]
["6703","Paranas (Wright)","Western Samar",3278]
["6716","Pinabacdao","Western Samar",3279]
["6707","San Jorge","Western Samar",3280]
["6723","San Jose De Buan","Western Samar",3281]
["6714","San Sebastian","Western Samar",3282]
["6709","Santa Margarita","Western Samar",3286]
["6718","Santa Rita","Western Samar",3287]
["6711","Santo Niño","Western Samar",3288]
["6712","Tagapul-an","Western Samar",3289]
["6719","Talalora","Western Samar",3290]
["6704","Tarangnan","Western Samar",3291]
["6717","Villareal","Western Samar",3292]
["6725","Zumarraga","Western Samar",3293]
["2202","Botolan","Zambales",3303]
["2203","Cabangan","Zambales",3304]
["2212","Candelaria","Zambales",3305]
["2208","Castillejos","Zambales",3306]
["2201","Iba","Zambales",3307]
["2211","Masinloc","Zambales",3311]
["2200","Olongapo City","Zambales",3312]
["2210","Palauig & Scarborough Shoal","Zambales",3313]
["2206","San Antonio","Zambales",3314]
["2204","San Felipe","Zambales",3315]
["2207","San Marcelino","Zambales",3319]
["2205","San Narciso","Zambales",3320]
["2213","Santa Cruz","Zambales",3321]
["2209","Subic","Zambales",3322]
["2222","Subic Bay Freeport Zone (Metro Subic)","Zambales",3323]
["7123","Baliguian","Zamboanga del Norte",3333]
["7101","Dapitan City","Zamboanga del Norte",3334]
["7100","Dipolog City","Zamboanga del Norte",3335]
["7118","Gutalac","Zamboanga del Norte",3336]
["7111","Jose Dalman (Ponot)","Zamboanga del Norte",3337]
["7124","Kalawit","Zamboanga del Norte",3338]
["7109","Katipunan","Zamboanga del Norte",3339]
["7119","La Libertad","Zamboanga del Norte",3340]
["7117","Labason","Zamboanga del Norte",3341]
["7115","Liloy","Zamboanga del Norte",3342]
["7110","Manukan","Zamboanga del Norte",3343]
["7107","Mutia","Zamboanga del Norte",3344]
["7105","Pinan","Zamboanga del Norte",3345]
["7106","Polanco","Zamboanga del Norte",3349]
["7104","Rizal","Zamboanga del Norte",3350]
["7102","Roxas","Zamboanga del Norte",3351]
["7114","Salug","Zamboanga del Norte",3352]
["7108","Sergio Osmeña","Zamboanga del Norte",3353]
["7113","Siayan","Zamboanga del Norte",3354]
["7122","Sibuco","Zamboanga del Norte",3355]
["7103","Sibutad","Zamboanga del Norte",3356]
["7112","Sindangan (Leon B. Postigo)","Zamboanga del Norte",3357]
["7120","Siocon","Zamboanga del Norte",3358]
["7121","Siraway","Zamboanga del Norte",3359]
["7116","Tampilisan","Zamboanga del Norte",3360]
["7020","Aurora","Zamboanga del Sur",3370]
["7011","Bayog","Zamboanga del Sur",3371]
["7032","Dimataling","Zamboanga del Sur",3372]
["7030","Dinas","Zamboanga del Sur",3373]
["7015","Dumalinao","Zamboanga del Sur",3374]
["7028","Dumingag","Zamboanga del Sur",3375]
["7042","Guipos","Zamboanga del Sur",3376]
["7027","Josefina","Zamboanga del Sur",3377]
["7005","Kumalarang","Zamboanga del Sur",3378]
["7017","Labangan","Zamboanga del Sur",3379]
["7014","Lakewood","Zamboanga del Sur",3380]
["7037","Lapuyan","Zamboanga del Sur",3381]
["7026","Mahayag","Zamboanga del Sur",3382]
["7035","Margosatubig","Zamboanga del Sur",3386]
["7021","Midsalip","Zamboanga del Sur",3387]
["7023","Molave","Zamboanga del Sur",3388]
["7016","Pagadian City","Zamboanga del Sur",3389]
["7033","Pitogo","Zamboanga del Sur",3390]
["7024","Ramon Magsaysay (Liargo)","Zamboanga del Sur",3391]
["7029","San Miguel","Zamboanga del Sur",3392]
["7031","San Pablo","Zamboanga del Sur",3393]
["7022","Sominot (Don Mariano Marcos)","Zamboanga del Sur",3394]
["7034","Tabina","Zamboanga del Sur",3395]
["7025","Tambulig","Zamboanga del Sur",3396]
["7043","Tigbao","Zamboanga del Sur",3398]
["7019","Tukuran","Zamboanga del Sur",3399]
["7036","Vincenzo A. Sagun","Zamboanga del Sur",3400]
["7000","Zamboanga City","Zamboanga del Sur",3397]
["7040","Alicia","Zamboanga Sibugay",3410]
["7009","Buug","Zamboanga Sibugay",3411]
["7039","Diplahan","Zamboanga Sibugay",3412]
["7007","Imelda","Zamboanga Sibugay",3413]
["7001","Ipil","Zamboanga Sibugay",3414]
["7005","Kabasalan","Zamboanga Sibugay",3418]
["7010","Mabuhay","Zamboanga Sibugay",3419]
["7038","Malangas","Zamboanga Sibugay",3420]
["7004","Naga","Zamboanga Sibugay",3421]
["7041","Olutanga","Zamboanga Sibugay",3422]
["7008","Payao","Zamboanga Sibugay",3426]
["7002","Roseller T. Lim","Zamboanga Sibugay",3427]
["7006","Siay","Zamboanga Sibugay",3428]
["7012","Talusan","Zamboanga Sibugay",3429]
["7003","Titay","Zamboanga Sibugay",3430]
["7018","Tungawan","Zamboanga Sibugay",3431]