{"text_format":"1","workbook":"xlsx","n_sheets":7,"sheets":["Header Info","QSO Form","QSO DB","Cabrillo","Feature Notes","Cabrillo instructions","ZipDB"],"not_rendered":{"charts":0,"images":1,"macros":1,"external_links":0,"defined_names":60,"comments":0,"pivot_tables":0},"unopened":[],"bounds":{"document_bytes":16777216,"sheet_cells":100000,"rows_first":2000,"rows_last":500,"rows_between":2000,"halvings":0,"cell_chars":16384,"cell_head_chars":4096},"cells_cut":0,"cells_raw":0,"read":"whole","date_system":"1900"}

{"sheet":"Header Info","index":0,"n_rows":30,"n_cols":7,"rows_kept":30,"cut":false,"hidden":false,"merged":[]}
[]
[]
[]
[]
[]
[null,null,null,null,"TAG","ENTER DATA IN ALL CAPS"]
[null,null,null,null,"CONTEST: ","2026 DU3MY MEMORIAL CONTEST","Contest Title"]
[null,null,null,null,"CREATED-BY:","Microsoft Excel 2013","Program/App name and version"]
[null,null,null,null,"CALLSIGN:","DW1WWW","Callsign"]
[null,null,null,null,"CALL NATIONALITY:","LOCAL","Local or International (DX) Call"]
[null,null,null,null,"CURRENT PHIL. DISTRICT:","SAME","Choose 1-9 if not within default district or DX call, else select \"SAME\""]
[null,null,null,null,"CONTEST CALL:",{"$f":"F9&IF(F11=\"SAME\",\"\",\"/\"&IF(F10=\"LOCAL\",F11,\"DU\"&F11))","v":"DW1WWW"},"Derived Call with extension. If DX call, ext will be preceded with \"DU\""]
[null,null,null,null,"CATEGORY-OPERATOR:","SINGLE-OP FIXED","Single-Op, Multi-Op or Checklog"]
[null,null,null,null,"CATEGORY-MODE:","ALL","ALL only"]
[null,null,null,null,"CATEGORY-BAND:","2m","6m, 2m, 70cm, 40m or All band"]
[null,null,null,null,"CATEGORY-POWER:","HIGH","Low (50W or less) or High (more than 50W)"]
[null,null,null,null,"OPERATORS:",null,"REQUIRED  for Cat-Op=MULTI-OP, CALL/name separated by comma"]
[null,null,null,null,"NAME:","JUAN A. DELA CRUZ","Complete name of participant"]
[null,null,null,null,"ADDRESS-STREET:","MABINI ST.","Actual TX QTH. Max=75 characters"]
[null,null,null,null,"ADDRESS-BARANGAY:","SAMPALOC","Actual TX QTH. Max=75 characters"]
{"$rows_left_out":11}
{"sheet":"QSO Form","index":1,"n_rows":218,"n_cols":35,"rows_kept":218,"cut":false,"hidden":true,"merged":[[2,2,2,11],[5,4,5,5],[1,7,1,8]]}
[null,null,null,null,null,null,null,null,null,null,null,null,null,null,null,null,null,null,"Freq_Band Table",null,null,"Band_Mode Table",null,null,null,null,"Live_Date_Time"]
[null,null,"Must update HEADER info first.",null,null,"Data entry is N1MM style",null,"Post-contest data entry/edit",null,"      Generate Cabrillo file",null,null,null,null,null,null,null,null,"FREQ","BAND",null,"_6m","_2m","_70cm","_40m",null,"UTC_Date","UTC_Time"]
[null,null,{"$f":"'Header Info'!F7","v":"2026 DU3MY MEMORIAL CONTEST"},null,null,null,null,null,null,null,null,null,null,null,null,null,null,null,7,"_40m",null,"CW","CW","CW","CW",null,"2026-06-01",{"$f":"IF(HOUR(NOW()-TIME(8,0,0))<10,\"0\",\"\")&HOUR(NOW()-TIME(8,0,0))&IF(MINUTE(NOW()-TIME(8,0,0))<10,\"0\",\"\")&MINUTE(NOW()-TIME(8,0,0))","v":"0530"},null,"Display_PST",null,"Hide_PST"]
[null,null,"LIVE-CONTEST-LOGGER (Live logging during actual contest day)",null,null,null,null,null,null,null,null,null,null,null,null,null,null,null,50,"_6m",null,"SSB","SSB","SSB","SSB",null,null,null,null,"PST Date:",{"$f":"NOW()","v":"2026-08-11T13:30:02.630"}]
[null,null,null,null,null,null,null,null,null,null,null,null,null,null,null,null,null,null,144,"_2m",null,"cw","FM","FM","FM",null,"SearchCALL2Box",null,null,"PST Time:",{"$f":"NOW()","v":46245.562530439813}]
[null,null,null,null,"UTC Date/TIME here are based on computer clock",null,null,null,null,null,null,null,null,null,null,null,null,null,432,"_70cm",null,"ssb","cw","cw","cw"]
[null,null,null,null,null,null,null,null,null,null,null,null,null,null,null,null,null,null,null,null,null,null,"ssb","ssb","ssb"]
[null,null,"FREQ ","MODE","UTC_Date","UTC_Time","SntCALL","Snt","SntNR","RcvCALL","Rcv","RcvNR",null,null,null,null,null,null,"Band","Call2&Band&Mode",null,null,"fm","fm","fm",null,"UTC Date","UTC_Time",null,null,null,null,null,null,"This tab has N1MM equivalent, single QSO data entry mechanics. "]
[null,null,144,"FM",{"$f":"NOW()","v":"2026-08-11T13:30:02.630"},{"$f":"IF(HOUR(NOW()-TIME(8,0,0))<10,\"0\",\"\")&HOUR(NOW()-TIME(8,0,0))&IF(MINUTE(NOW()-TIME(8,0,0))<10,\"0\",\"\")&MINUTE(NOW()-TIME(8,0,0))","v":"0530"},{"$f":"'Header Info'!F12","v":"DW1WWW"},{"$f":"IF(UPPER(D9)=\"CW\",\"599\",\"59\")","v":"59"},{"$f":"IF(COUNTA(FREQ_DB)<100,\"00\",IF(COUNTA(FREQ_DB)<10,\"0\",\"\"))&COUNTA(FREQ_DB)+1","v":"001"},null,{"$f":"IF(UPPER(D9)=\"CW\",\"599\",\"59\")","v":"59"},null,null,null,null,null,null,null,{"$f":"IF(C9=1240,\"23cm\",IF(C9=432,\"70cm\",IF(C9=50,\"6m\",\"2m\")))","v":"2m"},{"$f":"J9&S9&UPPER(D9)","v":"2mFM"},null,null,null,null,null,null,"2026-06-01","0000",null,null,null,null,null,null,"Restricted to 4 input fields only: FREQ, MODE, RcvCALL and RcvNR"]
[null,null,{"$f":"IF(C9=\"\",\"blank FREQ\",\"\")","v":""},{"$f":"IF(D9=\"\",\"blank MODE\",\"\")","v":""},null,null,null,{"$f":"IF(_xlfn.IFNA(VLOOKUP($T$9,QSO_DB,8,0),\"\")=\"\",\"\",\"Dupe with QSO# \"&_xlfn.IFNA(VLOOKUP($T$9,QSO_DB,8,0),\"\"))","v":""},null,{"$f":"IF(J9=\"\",\"blank RcvCALL\",\"\")","v":"blank RcvCALL"},null,{"$f":"IF(L9=\"\",\"blank RcvNR\",\"\")","v":"blank RcvNR"},null,null,null,null,null,"<-- error_messages ",null,null,{"$f":"IF(blank_FREQ&blank_MODE&Dupe_message&blank_CALL2&blank_Exch2=\"\",1,0)","v":0},"error_messages_blank tag [0=not blank, 1=blank]",null,null,null,null,null,null,null,null,null,null,null,null,"UTC Date and Time are based on computer clock. SntCALL is from [Header Info]."]
["error_formula",null,{"$f":"IF(C10=\"\",\"blank FREQ\",\"\")","v":"blank FREQ"},{"$f":"IF(D10=\"\",\"blank MODE\",\"\")","v":"blank MODE"},null,null,null,{"$f":"IF(_xlfn.IFNA(VLOOKUP($T$9,QSO_DB,8,0),\"\")=\"\",\"\",\"Dupe with QSO# \"&_xlfn.IFNA(VLOOKUP($T$9,QSO_DB,8,0),\"\"))","v":""},null,{"$f":"IF(J10=\"\",\"blank RcvCALL\",\"\")","v":""},null,{"$f":"IF(L10=\"\",\"blank RcvNR\",\"\")","v":""}]
[]
[null,null,null,null,null,null,null,"If Dupe, QSO line #",null,"  To add QSO, all gray message",null,null,null,null,null,null,null,0,"Display/Hide tag [0=hidden, 1=displayed]",null,null,null,null,null,null,null,null,null,null,null,null,null,null,null,"Snt/Rcv signal report depends on MODE"]
[null,null,null,null,null,"<- notes_tag",null,"will  be  in  this  box",null,"   boxes   must   be   error-free",null,null,null,null,null,null,null,1,"operation tag [1=Run, 2= S&P]",null,null,null,null,null,null,"PathName:","D:\\HAM\\DX3H\\DU3MY UHF-VFH MEMORIAL CONTEST\\2026\\Logs\\DW1WWW.log",null,null,null,null,null,null,null,"If the 4 input fields are complete and valid, line# 9 will be logged in the database."]
[]
[null,null,"In <Live Contest> mode, data listed below are for viewing only. Data cannot be edited here."]
[null,null,"To update actual database, click <Post Contest> button near the upper left part of this tab.",null,null,null,null,null,null,null,null,null,null,null,null,null,null,"OldShapeName",null,"OldShapeText",null,null,null,"NewShapeName"]
["QSO","Call2&Band&Mode","Freq","Mode","UTC Date","Time","SntCALL","Snt","SntNR","RcvCALL","Rcv","RcvNR",null,null,null,null,null,"Option Button S&P",null,"Display Notes"]
[{"$f":"IF('QSO DB'!$D5=\"\",\"\",'QSO DB'!A5)","v":""},{"$f":"IF('QSO DB'!$D5=\"\",\"\",'QSO DB'!B5)","v":""},{"$f":"IF('QSO DB'!$D5=\"\",\"\",'QSO DB'!D5)","v":""},{"$f":"IF('QSO DB'!$D5=\"\",\"\",'QSO DB'!E5)","v":""},{"$f":"IF('QSO DB'!$D5=\"\",\"\",'QSO DB'!I5)","v":""},{"$f":"IF('QSO DB'!$D5=\"\",\"\",'QSO DB'!J5)","v":""},{"$f":"IF('QSO DB'!$D5=\"\",\"\",'QSO DB'!K5)","v":""},{"$f":"IF('QSO DB'!$D5=\"\",\"\",'QSO DB'!L5)","v":""},{"$f":"IF('QSO DB'!$D5=\"\",\"\",'QSO DB'!M5)","v":""},{"$f":"IF('QSO DB'!$D5=\"\",\"\",'QSO DB'!F5)","v":""},{"$f":"IF('QSO DB'!$D5=\"\",\"\",'QSO DB'!G5)","v":""},{"$f":"IF('QSO DB'!$D5=\"\",\"\",'QSO DB'!H5)","v":""}]
[{"$f":"IF('QSO DB'!$D6=\"\",\"\",'QSO DB'!A6)","v":""},{"$f":"IF('QSO DB'!$D6=\"\",\"\",'QSO DB'!B6)","v":""},{"$f":"IF('QSO DB'!$D6=\"\",\"\",'QSO DB'!D6)","v":""},{"$f":"IF('QSO DB'!$D6=\"\",\"\",'QSO DB'!E6)","v":""},{"$f":"IF('QSO DB'!$D6=\"\",\"\",'QSO DB'!I6)","v":""},{"$f":"IF('QSO DB'!$D6=\"\",\"\",'QSO DB'!J6)","v":""},{"$f":"IF('QSO DB'!$D6=\"\",\"\",'QSO DB'!K6)","v":""},{"$f":"IF('QSO DB'!$D6=\"\",\"\",'QSO DB'!L6)","v":""},{"$f":"IF('QSO DB'!$D6=\"\",\"\",'QSO DB'!M6)","v":""},{"$f":"IF('QSO DB'!$D6=\"\",\"\",'QSO DB'!F6)","v":""},{"$f":"IF('QSO DB'!$D6=\"\",\"\",'QSO DB'!G6)","v":""},{"$f":"IF('QSO DB'!$D6=\"\",\"\",'QSO DB'!H6)","v":""},null,null,null,null,null,"Hide PST",null,"Hide PST"]
{"$rows_left_out":199}
{"sheet":"QSO DB","index":2,"n_rows":205,"n_cols":20,"rows_kept":205,"cut":false,"hidden":false,"merged":[[0,10,0,14]]}
["NOTE: If a QSO line has a data, blank yellow cells",null,null,null,null,null,null,null,null,null,"NOTE: Clicking Live or Post refreshes Time col\n<--- Select LIVE (auto time [during contest])"]
[null,null,null,"must be completely filled-up.",null,null,null,null,null,null,"  or POST (manual time entry [after contest])",null,null,null,null,null,"LiveTime",null,0]
[null,null,null,null,null,null,null,null,{"$f":"\"Current option: \"&IF(LT=1,\"LIVE UTC time stamp [during contest]\",\"POST (Manual UTC time entry [after contest]\")","v":"Current option: POST (Manual UTC time entry [after contest]"},null,null,null,null,"Dup QSO#",null,null,"Band",null,"UTC Time"]
["QSO","Call2&Band&Mode","QSO","Freq","Mode","RcvCALL","Rcv","Zip2","2026-08-22","Time","SntCALL","Snt","Zip1","Up ","Down",null,null,"PST","Live","Post"]
[1,{"$f":"IF(F5=\"\",A5,F5&Q5&UPPER(E5))","v":1},1,null,null,null,{"$f":"IF(ISBLANK($D5),\"\",IF(E5=\"CW\",\"599\",\"59\"))","v":""},null,{"$f":"IF(F5=\"\",\"\",I$4)","v":""},null,{"$f":"IF($F5=\"\",\"\",'Header Info'!F$12)","v":""},{"$f":"IF(ISBLANK($F5),\"\",IF(E5=\"CW\",\"599\",\"59\"))","v":""},{"$f":"IF($F5=\"\",\"\",'Header Info'!F$24)","v":""},"",{"$f":"IF(ISNA(VLOOKUP(B5,B6:M$204,8,0)),\"\",VLOOKUP(B5,B6:C$204,2,0))","v":""},{"$f":"IF(LT=1,IF(COUNTA(D5,E5,F5,H5)=0,\"\",IF(COUNTA(D5,E5,F5,H5)=4,\"\",\"<- FILL-UP ALL YELLOW CELLS\")),IF(COUNTA(D5,E5,J5,F5,H5)=0,\"\",IF(COUNTA(D5,E5,J5,F5,H5)=5,\"\",\"<- FILL-UP ALL YELLOW CELLS\")))","v":""},{"$f":"IF(D5=1240,\"23cm\",IF(D5=432,\"70cm\",IF(D5=50,\"6m\",\"2m\")))","v":"2m"},{"$f":"IF(F5<>\"\",IF(R5<>\"\",R5,NOW()),\"\")","v":""},{"$f":"IF(O5=\"\",\"\",IF(HOUR(AA5)+IF(HOUR(AA5)<8,16,-8)<10,\"0\",\"\")&HOUR(AA5)+IF(HOUR(AA5)<8,16,-8)&IF(MINUTE(AA5)<9,\"0\",\"\")&MINUTE(AA5))","v":""}]
[2,2,2,null,null,null,"",null,{"$f":"IF(D6=\"\",\"\",I$4)","v":""},null,{"$f":"IF($D6=\"\",\"\",'Header Info'!F$12)","v":""},{"$f":"IF(ISBLANK($D6),\"\",IF(E6=\"CW\",\"599\",\"59\"))","v":""},{"$f":"IF($D6=\"\",\"\",'Header Info'!F$24)","v":""},{"$f":"IF(ISNA(VLOOKUP(B6,B$5:M5,8,0)),\"\",VLOOKUP(B6,B$5:C6,2,0))","v":""},{"$f":"IF(ISNA(VLOOKUP(B6,B7:M$204,8,0)),\"\",VLOOKUP(B6,B7:C$204,2,0))","v":""},"","2m",{"$f":"IF(F6<>\"\",IF(R6<>\"\",R6,NOW()),\"\")","v":""},""]
[3,3,3,null,null,null,"",null,"",null,{"$f":"IF($D7=\"\",\"\",'Header Info'!F$12)","v":""},"",{"$f":"IF($D7=\"\",\"\",'Header Info'!F$24)","v":""},{"$f":"IF(ISNA(VLOOKUP(B7,B$5:M6,8,0)),\"\",VLOOKUP(B7,B$5:C7,2,0))","v":""},{"$f":"IF(ISNA(VLOOKUP(B7,B8:M$204,8,0)),\"\",VLOOKUP(B7,B8:C$204,2,0))","v":""},"","2m","",""]
[4,4,4,null,null,null,"",null,"",null,{"$f":"IF($D8=\"\",\"\",'Header Info'!F$12)","v":""},"",{"$f":"IF($D8=\"\",\"\",'Header Info'!F$24)","v":""},{"$f":"IF(ISNA(VLOOKUP(B8,B$5:M7,8,0)),\"\",VLOOKUP(B8,B$5:C8,2,0))","v":""},{"$f":"IF(ISNA(VLOOKUP(B8,B9:M$204,8,0)),\"\",VLOOKUP(B8,B9:C$204,2,0))","v":""},"","2m","",""]
[5,5,5,null,null,null,"",null,"",null,{"$f":"IF($D9=\"\",\"\",'Header Info'!F$12)","v":""},"",{"$f":"IF($D9=\"\",\"\",'Header Info'!F$24)","v":""},{"$f":"IF(ISNA(VLOOKUP(B9,B$5:M8,8,0)),\"\",VLOOKUP(B9,B$5:C9,2,0))","v":""},{"$f":"IF(ISNA(VLOOKUP(B9,B10:M$204,8,0)),\"\",VLOOKUP(B9,B10:C$204,2,0))","v":""},"","2m","",""]
[6,6,6,null,null,null,"",null,"",null,{"$f":"IF($D10=\"\",\"\",'Header Info'!F$12)","v":""},"",{"$f":"IF($D10=\"\",\"\",'Header Info'!F$24)","v":""},{"$f":"IF(ISNA(VLOOKUP(B10,B$5:M9,8,0)),\"\",VLOOKUP(B10,B$5:C10,2,0))","v":""},{"$f":"IF(ISNA(VLOOKUP(B10,B11:M$204,8,0)),\"\",VLOOKUP(B10,B11:C$204,2,0))","v":""},"","2m","",""]
[7,7,7,null,null,null,"",null,"",null,{"$f":"IF($D11=\"\",\"\",'Header Info'!F$12)","v":""},"",{"$f":"IF($D11=\"\",\"\",'Header Info'!F$24)","v":""},{"$f":"IF(ISNA(VLOOKUP(B11,B$5:M10,8,0)),\"\",VLOOKUP(B11,B$5:C11,2,0))","v":""},{"$f":"IF(ISNA(VLOOKUP(B11,B12:M$204,8,0)),\"\",VLOOKUP(B11,B12:C$204,2,0))","v":""},"","2m","",""]
[8,8,8,null,null,null,"",null,"",null,{"$f":"IF($D12=\"\",\"\",'Header Info'!F$12)","v":""},"",{"$f":"IF($D12=\"\",\"\",'Header Info'!F$24)","v":""},{"$f":"IF(ISNA(VLOOKUP(B12,B$5:M11,8,0)),\"\",VLOOKUP(B12,B$5:C12,2,0))","v":""},{"$f":"IF(ISNA(VLOOKUP(B12,B13:M$204,8,0)),\"\",VLOOKUP(B12,B13:C$204,2,0))","v":""},"","2m","",""]
[9,9,9,null,null,null,"",null,"",null,{"$f":"IF($D13=\"\",\"\",'Header Info'!F$12)","v":""},"",{"$f":"IF($D13=\"\",\"\",'Header Info'!F$24)","v":""},{"$f":"IF(ISNA(VLOOKUP(B13,B$5:M12,8,0)),\"\",VLOOKUP(B13,B$5:C13,2,0))","v":""},{"$f":"IF(ISNA(VLOOKUP(B13,B14:M$204,8,0)),\"\",VLOOKUP(B13,B14:C$204,2,0))","v":""},"","2m","",""]
[10,10,10,null,null,null,"",null,"",null,{"$f":"IF($D14=\"\",\"\",'Header Info'!F$12)","v":""},"",{"$f":"IF($D14=\"\",\"\",'Header Info'!F$24)","v":""},{"$f":"IF(ISNA(VLOOKUP(B14,B$5:M13,8,0)),\"\",VLOOKUP(B14,B$5:C14,2,0))","v":""},{"$f":"IF(ISNA(VLOOKUP(B14,B15:M$204,8,0)),\"\",VLOOKUP(B14,B15:C$204,2,0))","v":""},"","2m","",""]
[11,11,11,null,null,null,"",null,"",null,{"$f":"IF($D15=\"\",\"\",'Header Info'!F$12)","v":""},"",{"$f":"IF($D15=\"\",\"\",'Header Info'!F$24)","v":""},{"$f":"IF(ISNA(VLOOKUP(B15,B$5:M14,8,0)),\"\",VLOOKUP(B15,B$5:C15,2,0))","v":""},{"$f":"IF(ISNA(VLOOKUP(B15,B16:M$204,8,0)),\"\",VLOOKUP(B15,B16:C$204,2,0))","v":""},"","2m","",""]
[12,12,12,null,null,null,"",null,"",null,{"$f":"IF($D16=\"\",\"\",'Header Info'!F$12)","v":""},"",{"$f":"IF($D16=\"\",\"\",'Header Info'!F$24)","v":""},{"$f":"IF(ISNA(VLOOKUP(B16,B$5:M15,8,0)),\"\",VLOOKUP(B16,B$5:C16,2,0))","v":""},{"$f":"IF(ISNA(VLOOKUP(B16,B17:M$204,8,0)),\"\",VLOOKUP(B16,B17:C$204,2,0))","v":""},"","2m","",""]
[13,13,13,null,null,null,"",null,"",null,{"$f":"IF($D17=\"\",\"\",'Header Info'!F$12)","v":""},"",{"$f":"IF($D17=\"\",\"\",'Header Info'!F$24)","v":""},{"$f":"IF(ISNA(VLOOKUP(B17,B$5:M16,8,0)),\"\",VLOOKUP(B17,B$5:C17,2,0))","v":""},{"$f":"IF(ISNA(VLOOKUP(B17,B18:M$204,8,0)),\"\",VLOOKUP(B17,B18:C$204,2,0))","v":""},"","2m","",""]
[14,14,14,null,null,null,"",null,"",null,{"$f":"IF($D18=\"\",\"\",'Header Info'!F$12)","v":""},"",{"$f":"IF($D18=\"\",\"\",'Header Info'!F$24)","v":""},{"$f":"IF(ISNA(VLOOKUP(B18,B$5:M17,8,0)),\"\",VLOOKUP(B18,B$5:C18,2,0))","v":""},{"$f":"IF(ISNA(VLOOKUP(B18,B19:M$204,8,0)),\"\",VLOOKUP(B18,B19:C$204,2,0))","v":""},"","2m","",""]
[15,15,15,null,null,null,"",null,"",null,{"$f":"IF($D19=\"\",\"\",'Header Info'!F$12)","v":""},"",{"$f":"IF($D19=\"\",\"\",'Header Info'!F$24)","v":""},{"$f":"IF(ISNA(VLOOKUP(B19,B$5:M18,8,0)),\"\",VLOOKUP(B19,B$5:C19,2,0))","v":""},{"$f":"IF(ISNA(VLOOKUP(B19,B20:M$204,8,0)),\"\",VLOOKUP(B19,B20:C$204,2,0))","v":""},"","2m","",""]
[16,16,16,null,null,null,"",null,"",null,{"$f":"IF($D20=\"\",\"\",'Header Info'!F$12)","v":""},"",{"$f":"IF($D20=\"\",\"\",'Header Info'!F$24)","v":""},{"$f":"IF(ISNA(VLOOKUP(B20,B$5:M19,8,0)),\"\",VLOOKUP(B20,B$5:C20,2,0))","v":""},{"$f":"IF(ISNA(VLOOKUP(B20,B21:M$204,8,0)),\"\",VLOOKUP(B20,B21:C$204,2,0))","v":""},"","2m","",""]
{"$rows_left_out":186}
{"sheet":"Cabrillo","index":3,"n_rows":219,"n_cols":1,"rows_kept":219,"cut":false,"hidden":false,"merged":[]}
["START-OF-LOG: 3.0"]
[{"$f":"\"CONTEST: \"&'Header Info'!F7","v":"CONTEST: 2026 DU3MY MEMORIAL CONTEST"}]
[{"$f":"'Header Info'!E8&\" \"&'Header Info'!F8","v":"CREATED-BY: Microsoft Excel 2013"}]
[{"$f":"'Header Info'!E12&\" \"&'Header Info'!F12","v":"CONTEST CALL: DW1WWW"}]
[{"$f":"'Header Info'!E13&\" \"&'Header Info'!F13","v":"CATEGORY-OPERATOR: SINGLE-OP FIXED"}]
["CATEGORY-MODE: ALL"]
[{"$f":"'Header Info'!E15&\" \"&'Header Info'!F15","v":"CATEGORY-BAND: 2m"}]
[{"$f":"\"CATEGORY-POWER: \"&'Header Info'!F16","v":"CATEGORY-POWER: HIGH"}]
[{"$f":"\"OPERATORS: \"&'Header Info'!F17","v":"OPERATORS: "}]
[{"$f":"'Header Info'!E18&\" \"&'Header Info'!F18","v":"NAME: JUAN A. DELA CRUZ"}]
[{"$f":"'Header Info'!E19&\" \"&'Header Info'!F19","v":"ADDRESS-STREET: MABINI ST."}]
[{"$f":"'Header Info'!E20&\" \"&'Header Info'!F20","v":"ADDRESS-BARANGAY: SAMPALOC"}]
[{"$f":"'Header Info'!E21&\" \"&'Header Info'!F21","v":"ADDRESS-CITY/TOWN: MANILA"}]
[{"$f":"'Header Info'!E22&\" \"&'Header Info'!F22","v":"ADDRESS-STATE-PROVINCE: MM"}]
[{"$f":"'Header Info'!E23&\" \"&'Header Info'!F23","v":"ADDRESS-COUNTRY: PHILIPPINES"}]
[{"$f":"'Header Info'!E24&\" \"&'Header Info'!F24","v":"ZIP CODE: 1015"}]
[{"$f":"'Header Info'!E25&\" \"&'Header Info'!F25","v":"EMAIL: DW1WWW@GMAIL.COM"}]
[{"$f":"'Header Info'!E27&\" \"&'Header Info'!F27","v":"CLUB: DX1ABC"}]
[{"$f":"'Header Info'!E28&\" \"&'Header Info'!F28","v":"GPS COORDINATES: 14.602803, 120.996586"}]
[{"$f":"IF(OR(LEFT(A19,3)=\"END\",A19=\"\"),\"\",IF(ISBLANK('QSO DB'!D5),\"END-OF-LOG:\",\"QSO:\"&'QSO DB'!D5&REPT(\" \",6-LEN('QSO DB'!D5))&\" \"&IF(ISBLANK('QSO DB'!E5),\"xx\",\"\")&UPPER('QSO DB'!E5)&\" \"&IF(ISBLANK('QSO DB'!I5),REPT(\"X\",10),YEAR('QSO DB'!I5)&\"-\"&IF(MONTH('QSO DB'!I5)<10,\"0\",\"\")&MONTH('QSO DB'!I5)&\"-\"&IF(DAY('QSO DB'!I5)<10,\"0\",\"\")&DAY('QSO DB'!I5))&\" \"&IF(ISBLANK('QSO DB'!J5),\"XXXX\",LEFT('QSO DB'!J5,4))&\" \"&UPPER('QSO DB'!K5)&REPT(\" \",14-LEN('QSO DB'!K5))&IF(ISBLANK('QSO DB'!L5),REPT(\"X\",3),'QSO DB'!L5&REPT(\" \",3-LEN('QSO DB'!L5)))&\" \"&IF(ISBLANK('QSO DB'!M5),REPT(\"X\",4),'QSO DB'!M5)&\"   \"&UPPER('QSO DB'!F5)&REPT(\" \",14-LEN('QSO DB'!F5))&IF(ISBLANK('QSO DB'!G5),REPT(\"X\",3),'QSO DB'!G5&REPT(\" \",3-LEN('QSO DB'!G5)))&\" \"&IF(ISBLANK('QSO DB'!H5),REPT(\"X\",4),'QSO DB'!H5)))","v":"END-OF-LOG:"}]
{"$rows_left_out":200}
{"sheet":"Feature Notes","index":4,"n_rows":91,"n_cols":13,"rows_kept":91,"cut":false,"hidden":true,"merged":[]}
[null,null,14.854166666666668,120.79166666666667,14.8125,120.875,{"$f":"2*6371*ASIN(SQRT( SIN(RADIANS((E1-C1)/2))^2 + COS(RADIANS(C1))*COS(RADIANS(E1))* SIN(RADIANS((F1-D1)/2))^2))","v":10.084720810575741}]
[null,null,null,"=2*6371*ASIN(SQRT(",{"$f":"D2&D3&D4&D5&D6","v":"=2*6371*ASIN(SQRT( SIN(RADIANS((E1-C1)/2))^2 + COS(RADIANS(C1))*COS(RADIANS(E1))* SIN(RADIANS((F1-D1)/2))^2))"}]
[null,null,null," SIN(RADIANS((E1-C1)/2))^2 +"]
[null,"PENDING ENHANCEMENTS:",null," COS(RADIANS(C1))*COS(RADIANS(E1))*"]
["done","check/review N1MM+ Edit function",null," SIN(RADIANS((F1-D1)/2))^2",null,null,null,null,"MAIN MENU"]
[null,"create INIT menu to initialize clock sync… invoke DOS command?",null,"))",null,null,null,null,"INITIALIZE","Synchronize computer clock and set <Formula><Iteration> ON."]
[null,"update absolute value of UTC time cell after keying EXCH data.",null,null,null,null,null,null,"HEADER"]
[null,"create separate interface for data entry (for flexible function interface) and QSO DB",null,null,null,null,null,null,null,"CATEGORY INFO"]
["done","check and make range names and list for hidden cells used as calculation references",null,null,null,null,null,null,null,"UPLOAD","LICENSE"]
[null,null,"grouped, to be hidden from column N onwards",null,null,null,null,null,null,null,"OTHER REQMTS"]
[null,"create temporary button for <Protect/Unprotect> for all worksheets in-progress mode"]
[null,"create common/main menu tab to navigate from one operational worksheet to another",null,null,null,null,null,null,"LIVE ENTRY"]
[null,"create QSO_DB post-contest entry interface. Also must work as Edit interface for Live-contest entry?",null,null,null,null,null,null,null,"FREQ"]
[null,null,"QSO form can be used as post-contest by abling UTC Date-Time entry. Add Search, Add, Delete buttons",null,null,null,null,null,null,"MODE"]
["done",null,"create table for valid UTC dates",null,null,null,null,null,null,"EDIT"]
["done",null,"create array or table for valid UTC time, 4-digit, 24-hr military format","to validate","if date=2026-05-31",null,"time = 0500-2359",null,"POST ENTRY"]
[null,null,null,null,"if date=2026-06-01",null,"time = 0000-0459"]
[null,"=AND(LEN(U14)=4, ISNUMBER(--U14), VALUE(RIGHT(U14,2))<=59, IF(T14=DATE(2026,5,31), AND(VALUE(LEFT(U14,2))>=5, VALUE(LEFT(U14,2))<=23), IF(T14=DATE(2026,6,1), AND(VALUE(LEFT(U14,2))>=0, VALUE(LEFT(U14,2))<=4), FALSE)))"]
[]
[null,"In QSO Form window",null,null,null,null,null,null,null,null,null,"<--- Operation mode, not yet functional."]
{"$rows_left_out":72}
{"sheet":"Cabrillo instructions","index":5,"n_rows":602,"n_cols":8,"rows_kept":602,"cut":false,"hidden":true,"merged":[]}
["To convert Excel data to cabrillo format:"]
[1,"check all data for accuracy and completeness"]
[2,"click <Cabrillo> tabsheet"]
[3,"execute <File><Save as>, using same folder as this input file"]
[4,"type in your callsign as the File Name"]
[5,"in <Save as File type>, click the drop-down arrow, choose \"Text (tab delimited) *.txt\""]
[6,"click <Save>"]
[7,"if file is already existing, make sure you really want to replace it before clicking <Yes>."]
[8,"to save the active sheet only, click <OK>"]
[9,"confirm using Text (tab delimited) format by clicking <Yes>"]
[10,"close the current sheet without saving, to maintain its input format."]
[]
["11 in your preferred file management application, e.g. File Explorer, DOS prompt"]
[null,"rename the saved file by changing its extension, from .txt to .log"]
[null,".log is the standard extension for a cabrillo file name. "]
[]
[null,"excel macro to convert worksheet to a text file with *.log as extension with the following tasks:"]
[null,"use worksheet \"Cabrillo\""]
[null,"save as Text (Tab delimited)"]
[null,"path is same as this workbook"]
{"$rows_left_out":583}
{"sheet":"ZipDB","index":6,"n_rows":2274,"n_cols":4,"rows_kept":2274,"cut":false,"hidden":true,"merged":[]}
["ZIP","BARANGAY/CITY/TOWN/OFFICE","CITY/PROVINCE/CATEGORY","SEQ"]
["0000","Foreign address"," ",0]
["2800","Bangued","Abra",3]
["2815","Boliney","Abra",18]
["2805","Bucay","Abra",8]
["2817","Bucloc","Abra",20]
["2816","Daguioman","Abra",19]
["2825","Danglas","Abra",28]
["2801","Dolores","Abra",4]
["2826","La Paz","Abra",29]
["2821","Lacub","Abra",24]
["2802","Lagangilang","Abra",5]
["2824","Lagayan","Abra",27]
["2807","Langiden","Abra",10]
["2819","Licuan (Baay)","Abra",22]
["2813","Luba","Abra",16]
["2820","Malibcong","Abra",23]
["2810","Manabo","Abra",13]
["2804","Peñarrubia","Abra",7]
["2806","Pidigan","Abra",9]
{"$rows_left_out":2254}